-12.298388 , -1.475806
-12.298388 , -1.475806
-12.231183 , -1.475806
-12.231183 , -1.475806
-12.298388 , -1.475806
-12.298388 , -1.467742
-12.231183 , -1.475806
-12.298388 , -1.483871
-12.298388 , -1.475806
-12.298388 , -1.451613
-12.298388 , -1.475806
-12.231183 , -1.475806
-12.365591 , -1.475806
-12.231183 , -1.475806
-12.231183 , -1.475806
-12.298388 , -1.475806
-12.231183 , -1.475806
-12.298388 , -1.475806
-12.298388 , -1.475806
-12.298388 , -1.475806
-12.231183 , -1.475806
-12.298388 , -1.483871
-12.231183 , -1.467742
-12.298388 , -1.475806
-12.231183 , -1.475806
-12.231183 , -1.483871
-12.298388 , -1.475806
-12.298388 , -1.475806
-12.298388 , -1.475806
-12.231183 , -1.467742
-12.298388 , -1.467742
-12.231183 , -1.467742
-12.298388 , -1.475806
-12.231183 , -1.475806
-12.298388 , -1.475806
-12.231183 , -1.475806
-12.298388 , -1.475806
-12.298388 , -1.475806
-12.298388 , -1.475806
-12.298388 , -1.475806
-12.298388 , -1.475806
-12.365591 , -1.475806
-12.298388 , -1.491935
-12.029570 , -1.475806
-12.231183 , -1.475806
-12.298388 , -1.475806
-12.231183 , -1.475806
-12.231183 , -1.475806
-12.298388 , -1.475806
-12.298388 , -1.467742
-12.231183 , -1.467742
-12.298388 , -1.475806
-12.298388 , -1.475806
-12.231183 , -1.475806
-12.298388 , -1.475806
-12.231183 , -1.475806
-12.231183 , -1.475806
-12.298388 , -1.467742
-12.163979 , -1.475806
-12.298388 , -1.475806
-12.298388 , -1.467742
-12.298388 , -1.467742
-12.231183 , -1.475806
-12.298388 , -1.475806
-12.298388 , -1.467742
-12.298388 , -1.475806
-12.231183 , -1.475806
-12.298388 , -1.475806
-12.298388 , -1.467742
-12.231183 , -1.459677
-12.365591 , -1.467742
-12.298388 , -1.475806
-12.231183 , -1.467742
-12.298388 , -1.475806
-12.231183 , -1.475806
-12.298388 , -1.475806
-12.298388 , -1.467742
-12.231183 , -1.467742
-12.231183 , -1.475806
-12.298388 , -1.467742
-12.298388 , -1.467742
-12.231183 , -1.475806
-12.231183 , -1.475806
-12.298388 , -1.475806
-12.231183 , -1.467742
-12.231183 , -1.475806
-12.231183 , -1.475806
-12.231183 , -1.483871
-12.298388 , -1.475806
-12.298388 , -1.475806
-12.298388 , -1.467742
-12.298388 , -1.467742
-12.298388 , -1.475806
-12.365591 , -1.467742
-12.231183 , -1.475806
-12.231183 , -1.475806
-12.298388 , -1.475806
-12.231183 , -1.467742
-12.298388 , -1.467742
-12.163979 , -1.475806
-12.231183 , -1.467742
-12.231183 , -1.475806
-12.298388 , -1.475806
-12.298388 , -1.475806
-12.231183 , -1.475806
-12.298388 , -1.475806
-12.231183 , -1.475806
-12.298388 , -1.475806
-12.298388 , -1.475806
-12.231183 , -1.467742
-12.231183 , -1.483871
-12.231183 , -1.475806
-12.231183 , -1.475806
-12.231183 , -1.475806
-12.231183 , -1.475806
-12.298388 , -1.467742
-12.298388 , -1.475806
-12.298388 , -1.467742
-12.298388 , -1.475806
-12.298388 , -1.467742
-12.231183 , -1.483871
-12.298388 , -1.475806
-12.298388 , -1.467742
-12.231183 , -1.475806
-12.231183 , -1.475806
-12.298388 , -1.475806
-12.231183 , -1.475806
-12.298388 , -1.475806
-12.298388 , -1.475806
-12.298388 , -1.475806
-12.231183 , -1.475806
-12.231183 , -1.475806
-12.231183 , -1.475806
-12.298388 , -1.475806
-12.298388 , -1.475806
-12.298388 , -1.475806
-12.298388 , -1.475806
-12.298388 , -1.475806
-12.298388 , -1.475806
-12.298388 , -1.459677
-12.298388 , -1.475806
-12.298388 , -1.475806
-12.298388 , -1.475806
-12.298388 , -1.475806
-12.298388 , -1.467742
-12.231183 , -1.475806
-12.298388 , -1.475806
-12.298388 , -1.475806
-12.298388 , -1.475806
-12.298388 , -1.475806
-12.298388 , -1.467742
-12.163979 , -1.475806
-12.298388 , -1.475806
-12.231183 , -1.467742
-12.231183 , -1.467742
-12.298388 , -1.475806
-12.231183 , -1.475806
-12.298388 , -1.467742
-12.298388 , -1.467742
-12.231183 , -1.500000
-12.298388 , -1.467742
-12.298388 , -1.467742
-12.298388 , -1.475806
-12.298388 , -1.475806
-12.365591 , -1.475806
-12.298388 , -1.467742
-12.298388 , -1.475806
-12.231183 , -1.467742
-12.298388 , -1.475806
-12.298388 , -1.475806
-12.298388 , -1.483871
-12.298388 , -1.475806
-12.365591 , -1.475806
-12.231183 , -1.475806
-12.298388 , -1.475806
-12.298388 , -1.467742
-12.298388 , -1.467742
-12.298388 , -1.475806
-12.231183 , -1.475806
-12.298388 , -1.467742
-12.231183 , -1.475806
-12.231183 , -1.475806
-12.298388 , -1.467742
-12.298388 , -1.475806
-12.298388 , -1.475806
-12.298388 , -1.475806
-12.298388 , -1.475806
-12.298388 , -1.467742
-12.298388 , -1.475806
-12.231183 , -1.459677
-12.298388 , -1.475806
-12.298388 , -1.475806
-12.298388 , -1.475806
-12.298388 , -1.475806
-12.231183 , -1.491935
-12.298388 , -1.475806
-12.231183 , -1.475806
-12.231183 , -1.475806
-12.298388 , -1.475806
-12.365591 , -1.467742
-12.298388 , -1.475806
-12.231183 , -1.467742
-12.029570 , -1.467742
-12.298388 , -1.467742
-12.298388 , -1.475806
-12.365591 , -1.475806
-12.365591 , -1.475806
-12.298388 , -1.467742
-12.231183 , -1.467742
-12.298388 , -1.467742
-12.298388 , -1.475806
-12.231183 , -1.475806
-12.298388 , -1.475806
-12.231183 , -1.475806
-12.231183 , -1.475806
-12.298388 , -1.483871
-12.298388 , -1.491935
-12.298388 , -1.459677
-12.231183 , -1.467742
-12.298388 , -1.475806
-12.298388 , -1.483871
-12.163979 , -1.475806
-12.298388 , -1.475806
-12.298388 , -1.467742
-12.298388 , -1.475806
-12.231183 , -1.475806
-12.231183 , -1.467742
-12.298388 , -1.475806
-12.298388 , -1.451613
-12.231183 , -1.475806
-12.298388 , -1.467742
-12.231183 , -1.475806
-12.231183 , -1.475806
-12.298388 , -1.467742
-12.298388 , -1.475806
-12.298388 , -1.475806
-12.231183 , -1.491935
-12.298388 , -1.475806
-12.231183 , -1.475806
-12.298388 , -1.467742
-12.231183 , -1.467742
-12.365591 , -1.467742
-12.298388 , -1.467742
-12.231183 , -1.475806
-12.298388 , -1.467742
-12.365591 , -1.467742
-12.231183 , -1.475806
-12.298388 , -1.475806
-12.231183 , -1.475806
-12.365591 , -1.475806
-12.298388 , -1.475806
-12.231183 , -1.475806
-12.298388 , -1.475806
-12.298388 , -1.475806
-12.298388 , -1.475806
-12.231183 , -1.475806
-12.231183 , -1.475806
-12.231183 , -1.475806
-12.298388 , -1.475806
-12.298388 , -1.467742
-12.231183 , -1.467742
-12.231183 , -1.467742
-12.231183 , -1.475806
-12.365591 , -1.475806
-12.231183 , -1.475806
-12.298388 , -1.500000
-12.231183 , -1.475806
-12.298388 , -1.475806
-12.298388 , -1.475806
-12.231183 , -1.467742
-12.298388 , -1.475806
-12.365591 , -1.475806
-12.231183 , -1.475806
-12.231183 , -1.459677
-12.231183 , -1.475806
-12.231183 , -1.475806
-12.231183 , -1.475806
-12.298388 , -1.459677
-12.432796 , -1.475806
-12.298388 , -1.475806
-12.231183 , -1.475806
-12.231183 , -1.467742
-12.231183 , -1.491935
-12.298388 , -1.475806
-12.298388 , -1.475806
-12.298388 , -1.475806
-12.231183 , -1.475806
-12.231183 , -1.475806
-12.298388 , -1.483871
-12.298388 , -1.475806
-12.298388 , -1.467742
-12.298388 , -1.475806
-12.231183 , -1.475806
-12.163979 , -1.475806
-12.231183 , -1.475806
-12.029570 , -1.475806
-12.298388 , -1.475806
-12.298388 , -1.475806
-12.231183 , -1.475806
-12.298388 , -1.475806
-12.231183 , -1.475806
-12.231183 , -1.475806
-12.298388 , -1.475806
-12.298388 , -1.467742
-12.231183 , -1.475806
-12.231183 , -1.467742
-12.298388 , -1.475806
-12.298388 , -1.475806
-12.298388 , -1.475806
-12.231183 , -1.435484
-12.298388 , -1.475806
-12.298388 , -1.475806
-12.298388 , -1.491935
-12.365591 , -1.467742
-12.298388 , -1.467742
-12.298388 , -1.467742
-12.298388 , -1.475806
-12.298388 , -1.475806
-12.298388 , -1.475806
-12.298388 , -1.475806
-12.231183 , -1.475806
-12.298388 , -1.451613
-12.231183 , -1.475806
-12.298388 , -1.475806
-12.298388 , -1.475806
-12.365591 , -1.475806
-12.231183 , -1.475806
-12.231183 , -1.475806
-12.298388 , -1.475806
-12.231183 , -1.467742
-12.163979 , -1.475806
-12.298388 , -1.475806
-12.298388 , -1.475806
-12.298388 , -1.475806
-12.298388 , -1.475806
-12.298388 , -1.459677
-12.298388 , -1.475806
-12.298388 , -1.475806
-12.298388 , -1.467742
-12.298388 , -1.475806
-12.298388 , -1.467742
-12.298388 , -1.475806
-12.231183 , -1.475806
-12.231183 , -1.475806
-12.298388 , -1.467742
-12.231183 , -1.467742
-12.298388 , -1.475806
-12.231183 , -1.475806
-12.298388 , -1.483871
-12.298388 , -1.475806
-12.298388 , -1.475806
-12.298388 , -1.475806
-12.163979 , -1.483871
-12.298388 , -1.500000
-12.231183 , -1.475806
-12.298388 , -1.475806
-12.298388 , -1.475806
-12.231183 , -1.475806
-12.298388 , -1.475806
-12.298388 , -1.475806
-12.231183 , -1.475806
-12.298388 , -1.475806
-12.298388 , -1.467742
-12.298388 , -1.475806
-12.298388 , -1.475806
-12.231183 , -1.475806
-12.298388 , -1.475806
-12.298388 , -1.475806
-12.298388 , -1.475806
-12.298388 , -1.467742
-12.298388 , -1.467742
-12.298388 , -1.475806
-12.298388 , -1.475806
-12.298388 , -1.467742
-12.298388 , -1.483871
-12.163979 , -1.467742
-12.298388 , -1.467742
-12.298388 , -1.475806
-12.231183 , -1.483871
-12.298388 , -1.475806
-12.365591 , -1.475806
-12.298388 , -1.475806
-12.298388 , -1.475806
-12.231183 , -1.467742
-12.231183 , -1.467742
-12.365591 , -1.475806
-12.298388 , -1.467742
-12.298388 , -1.475806
-12.298388 , -1.475806
-12.298388 , -1.475806
-12.298388 , -1.475806
-12.231183 , -1.467742
-12.231183 , -1.475806
-12.231183 , -1.475806
-12.298388 , -1.475806
-12.298388 , -1.475806
-12.298388 , -1.475806
-12.231183 , -1.475806
-12.298388 , -1.475806
-12.298388 , -1.467742
-12.298388 , -1.475806
-12.163979 , -1.467742
-12.298388 , -1.475806
-12.231183 , -1.443548
-12.298388 , -1.475806
-12.231183 , -1.475806
-12.298388 , -1.475806
-12.231183 , -1.475806
-12.500000 , -1.483871
-12.298388 , -1.475806
-12.298388 , -1.475806
-12.231183 , -1.475806
-12.298388 , -1.475806
-12.231183 , -1.467742
-12.298388 , -1.475806
-12.298388 , -1.467742
-12.298388 , -1.459677
-12.298388 , -1.475806
-12.298388 , -1.475806
-12.298388 , -1.475806
-12.298388 , -1.467742
-12.231183 , -1.475806
-12.298388 , -1.475806
-12.298388 , -1.467742
-12.298388 , -1.475806
-12.298388 , -1.483871
-12.231183 , -1.475806
-12.231183 , -1.475806
-12.500000 , -1.467742
-12.298388 , -1.467742
-12.231183 , -1.475806
-12.298388 , -1.491935
-12.298388 , -1.467742
-12.298388 , -1.475806
-12.298388 , -1.459677
-12.298388 , -1.475806
-12.298388 , -1.475806
-12.298388 , -1.475806
-12.231183 , -1.475806
-12.298388 , -1.475806
-12.231183 , -1.475806
-12.096775 , -1.475806
-12.298388 , -1.475806
-12.298388 , -1.475806
-12.231183 , -1.475806
-12.298388 , -1.475806
-12.298388 , -1.475806
-12.298388 , -1.475806
-12.298388 , -1.475806
-12.298388 , -1.475806
-12.298388 , -1.475806
-12.231183 , -1.467742
-12.365591 , -1.475806
-12.231183 , -1.475806
-12.298388 , -1.475806
-12.298388 , -1.475806
-12.298388 , -1.459677
-12.298388 , -1.443548
-12.298388 , -1.475806
-12.298388 , -1.475806
-12.231183 , -1.475806
-12.298388 , -1.483871
-12.298388 , -1.475806
-12.298388 , -1.475806
-12.298388 , -1.483871
-12.298388 , -1.475806
-12.298388 , -1.475806
-12.298388 , -1.475806
-12.298388 , -1.467742
-12.231183 , -1.475806
-12.298388 , -1.451613
-12.298388 , -1.467742
-12.231183 , -1.467742
-12.096775 , -1.475806
-12.298388 , -1.475806
-12.231183 , -1.475806
-12.298388 , -1.467742
-12.231183 , -1.459677
-12.231183 , -1.467742
-12.096775 , -1.475806
-12.298388 , -1.475806
-12.298388 , -1.467742
-12.298388 , -1.467742
-12.231183 , -1.475806
-12.231183 , -1.475806
-12.298388 , -1.443548
-12.231183 , -1.467742
-12.231183 , -1.483871
-12.231183 , -1.475806
-12.231183 , -1.475806
-12.231183 , -1.475806
-12.231183 , -1.475806
-12.365591 , -1.475806
-12.298388 , -1.467742
-12.231183 , -1.467742
-12.231183 , -1.459677
-12.298388 , -1.475806
-12.163979 , -1.475806
-12.365591 , -1.475806
-12.298388 , -1.475806
-12.298388 , -1.475806
-12.231183 , -1.483871
-12.298388 , -1.475806
-12.231183 , -1.475806
-12.298388 , -1.467742
-12.231183 , -1.475806
-12.231183 , -1.475806
-12.298388 , -1.459677
-12.298388 , -1.475806
-12.298388 , -1.475806
-12.298388 , -1.475806
-12.231183 , -1.475806
-12.298388 , -1.475806
-12.298388 , -1.475806
-12.365591 , -1.475806
-12.231183 , -1.475806
-12.231183 , -1.467742
-12.298388 , -1.475806
-11.760753 , 0.080645
-12.096775 , 0.056452
-12.231183 , 0.064516
-12.096775 , 0.064516
-11.895161 , 0.064516
-12.163979 , 0.056452
-12.500000 , 0.040323
-12.029570 , 0.032258
-12.231183 , 0.040323
-12.231183 , 0.048387
-12.163979 , 0.048387
-12.500000 , 0.048387
-12.500000 , 0.048387
-12.298388 , 0.048387
-12.163979 , 0.048387
-11.962365 , 0.048387
-12.163979 , 0.040323
3.696236 , 0.048387
0.470430 , 0.040323
0.470430 , 0.040323
0.470430 , 0.048387
0.604838 , 0.032258
0.403225 , 0.040323
0.537634 , 0.048387
0.470430 , 0.040323
0.470430 , 0.048387
0.470430 , 0.048387
0.470430 , 0.064516
0.470430 , 0.048387
0.470430 , 0.048387
0.470430 , 0.048387
0.403225 , 0.040323
0.470430 , 0.064516
0.470430 , 0.064516
0.403225 , 0.048387
0.470430 , -0.016129
0.470430 , 0.024194
0.470430 , 0.048387
0.537634 , 0.032258
0.403225 , 0.000000
0.470430 , 0.048387
0.470430 , 0.048387
0.470430 , 0.048387
0.537634 , 0.048387
0.470430 , 0.032258
0.470430 , 0.048387
0.470430 , 0.032258
0.672042 , 0.040323
0.470430 , 0.048387
0.470430 , 0.048387
0.470430 , 0.032258
0.403225 , 0.048387
0.470430 , 0.056452
0.470430 , 0.048387
0.403225 , 0.048387
-0.067204 , 0.048387
0.470430 , 0.032258
0.470430 , 0.024194
0.604838 , 0.048387
0.336021 , 0.048387
0.470430 , 0.048387
0.470430 , 0.064516
0.403225 , 0.048387
0.672042 , 0.048387
0.470430 , 0.048387
0.537634 , 0.064516
0.537634 , 0.048387
0.470430 , 0.048387
0.470430 , 0.064516
0.470430 , 0.056452
0.739247 , 0.048387
0.604838 , 0.048387
0.470430 , 0.048387
0.806452 , 0.048387
0.470430 , 0.048387
0.470430 , 0.048387
0.470430 , 0.024194
0.470430 , 0.048387
0.403225 , 0.048387
0.470430 , 0.040323
0.470430 , 0.048387
0.739247 , 0.048387
0.470430 , 0.048387
0.470430 , 0.048387
0.470430 , 0.048387
0.470430 , 0.056452
0.470430 , 0.032258
0.470430 , 0.048387
0.403225 , 0.040323
0.806452 , 0.048387
-0.067204 , 0.048387
0.403225 , 0.048387
0.470430 , 0.040323
0.470430 , 0.040323
0.470430 , 0.048387
0.470430 , 0.040323
0.403225 , 0.040323
0.470430 , 0.048387
0.000000 , 0.048387
0.403225 , 0.048387
0.806452 , 0.048387
0.403225 , 0.016129
0.470430 , 0.056452
0.403225 , 0.048387
0.403225 , 0.048387
0.470430 , 0.048387
0.470430 , 0.048387
0.336021 , 0.048387
0.470430 , 0.048387
0.470430 , 0.048387
0.470430 , 0.048387
0.470430 , 0.048387
0.604838 , 0.040323
0.470430 , 0.024194
0.403225 , 0.048387
0.470430 , 0.048387
0.470430 , 0.048387
0.470430 , 0.048387
0.470430 , 0.032258
0.470430 , 0.056452
0.470430 , 0.048387
0.470430 , 0.048387
0.470430 , 0.048387
0.806452 , 0.048387
0.672042 , 0.040323
0.403225 , 0.048387
0.537634 , 0.048387
0.470430 , 0.048387
0.336021 , 0.056452
0.806452 , 0.032258
0.470430 , 0.016129
0.201613 , 0.056452
0.604838 , 0.048387
0.470430 , 0.048387
0.537634 , 0.040323
0.873657 , 0.040323
0.537634 , 0.048387
0.403225 , 0.048387
0.403225 , 0.024194
0.537634 , 0.048387
0.537634 , 0.048387
0.604838 , 0.048387
0.537634 , 0.048387
0.470430 , 0.048387
0.470430 , 0.040323
0.470430 , 0.040323
0.470430 , 0.048387
0.403225 , 0.048387
0.739247 , 0.056452
0.470430 , 0.024194
0.470430 , 0.048387
0.403225 , 0.048387
0.470430 , 0.056452
0.470430 , 0.056452
0.403225 , 0.048387
0.470430 , 0.040323
0.470430 , 0.040323
0.201613 , 0.048387
0.067204 , 0.056452
0.336021 , 0.072581
0.336021 , 0.064516
0.470430 , 0.048387
0.537634 , 0.056452
0.336021 , 0.048387
0.470430 , 0.048387
0.470430 , 0.048387
0.470430 , 0.040323
0.134408 , 0.048387
0.604838 , 0.048387
0.470430 , 0.048387
0.537634 , 0.048387
0.739247 , 0.048387
0.806452 , 0.048387
0.470430 , 0.048387
0.672042 , 0.032258
0.470430 , 0.024194
0.470430 , 0.048387
0.403225 , 0.048387
0.537634 , 0.048387
0.470430 , 0.048387
0.470430 , 0.048387
0.470430 , 0.048387
0.470430 , 0.048387
0.403225 , 0.040323
0.537634 , 0.040323
0.470430 , 0.048387
0.470430 , 0.040323
0.672042 , 0.048387
0.470430 , 0.048387
0.537634 , 0.048387
0.470430 , 0.048387
0.470430 , 0.056452
0.470430 , 0.040323
0.470430 , 0.048387
0.470430 , 0.040323
0.537634 , 0.048387
0.470430 , 0.032258
0.537634 , 0.048387
0.403225 , 0.048387
0.470430 , 0.048387
0.873657 , 0.048387
0.806452 , 0.048387
0.470430 , 0.120968
0.537634 , 0.048387
0.470430 , 0.048387
0.470430 , 0.040323
0.470430 , 0.048387
0.470430 , 0.040323
0.470430 , 0.048387
0.470430 , 0.056452
0.604838 , 0.048387
0.403225 , 0.056452
0.470430 , 0.008065
0.470430 , 0.080645
0.336021 , 0.048387
0.403225 , 0.048387
0.336021 , 0.048387
0.470430 , 0.048387
0.470430 , 0.048387
0.470430 , 0.048387
0.403225 , 0.048387
0.336021 , 0.048387
0.470430 , 0.048387
0.470430 , 0.048387
0.403225 , 0.032258
0.470430 , 0.048387
0.403225 , 0.048387
0.470430 , 0.048387
0.672042 , 0.056452
0.403225 , 0.048387
0.470430 , 0.048387
0.604838 , 0.048387
0.403225 , 0.040323
0.470430 , 0.048387
0.470430 , 0.072581
0.537634 , 0.032258
0.470430 , 0.056452
0.537634 , 0.048387
0.537634 , 0.040323
0.470430 , 0.056452
0.470430 , 0.048387
0.470430 , 0.040323
0.470430 , 0.048387
0.403225 , 0.048387
0.470430 , 0.072581
0.470430 , 0.048387
0.470430 , 0.048387
0.470430 , 0.048387
0.403225 , 0.048387
0.470430 , 0.016129
0.470430 , 0.040323
0.268817 , 0.048387
0.403225 , 0.048387
0.470430 , 0.048387
0.470430 , 0.048387
0.739247 , 0.048387
0.336021 , 0.040323
0.470430 , 0.048387
0.470430 , 0.048387
0.470430 , 0.048387
0.470430 , 0.048387
0.537634 , 0.048387
0.537634 , 0.056452
0.470430 , 0.040323
0.403225 , 0.048387
0.336021 , 0.040323
0.739247 , 0.040323
0.470430 , 0.048387
0.403225 , 0.040323
0.470430 , 0.048387
0.403225 , 0.048387
0.336021 , 0.040323
0.403225 , 0.048387
0.537634 , 0.048387
0.470430 , 0.040323
0.470430 , 0.040323
0.470430 , 0.048387
0.470430 , 0.048387
0.201613 , 0.048387
0.470430 , 0.048387
0.403225 , 0.056452
0.470430 , 0.048387
0.537634 , 0.032258
0.470430 , 0.048387
0.403225 , 0.040323
0.470430 , 0.048387
0.403225 , 0.040323
0.470430 , 0.056452
0.470430 , 0.040323
0.403225 , 0.048387
0.470430 , 0.048387
0.537634 , 0.048387
0.806452 , 0.032258
0.470430 , 0.048387
0.470430 , 0.048387
0.470430 , 0.056452
0.470430 , 0.048387
0.470430 , 0.024194
0.604838 , 0.056452
0.470430 , 0.032258
0.403225 , 0.040323
0.470430 , 0.024194
0.470430 , 0.048387
0.268817 , 0.048387
0.470430 , 0.048387
0.470430 , 0.048387
0.470430 , 0.032258
0.873657 , 0.056452
0.403225 , 0.056452
0.470430 , 0.048387
0.403225 , 0.048387
0.470430 , 0.048387
0.470430 , 0.048387
0.470430 , 0.048387
0.000000 , 0.048387
0.470430 , 0.048387
0.403225 , 0.048387
0.470430 , 0.048387
0.403225 , 0.056452
0.470430 , 0.032258
0.604838 , 0.032258
0.403225 , 0.024194
0.537634 , 0.048387
0.470430 , 0.064516
0.470430 , 0.048387
0.470430 , 0.048387
0.873657 , 0.048387
0.403225 , 0.040323
0.470430 , 0.048387
0.470430 , 0.048387
0.403225 , 0.056452
0.537634 , 0.024194
0.806452 , 0.048387
0.470430 , 0.048387
0.470430 , 0.056452
0.470430 , 0.040323
0.470430 , 0.064516
0.336021 , 0.048387
0.470430 , 0.048387
0.470430 , 0.048387
0.134408 , 0.048387
0.201613 , 0.024194
0.470430 , 0.048387
0.470430 , 0.048387
0.470430 , 0.048387
0.470430 , 0.032258
0.134408 , 0.040323
0.470430 , 0.048387
0.268817 , 0.048387
0.403225 , 0.032258
0.470430 , 0.056452
0.806452 , 0.040323
0.000000 , 0.056452
0.537634 , 0.048387
0.470430 , 0.048387
0.403225 , 0.048387
0.470430 , 0.048387
0.470430 , 0.056452
0.537634 , 0.048387
0.403225 , 0.048387
0.537634 , 0.048387
0.537634 , 0.040323
0.470430 , 0.048387
0.470430 , 0.032258
0.470430 , 0.048387
0.470430 , 0.048387
0.470430 , 0.048387
0.470430 , 0.048387
0.403225 , 0.040323
0.470430 , 0.048387
0.537634 , 0.072581
0.403225 , 0.048387
0.470430 , 0.048387
0.470430 , 0.048387
0.403225 , 0.048387
0.470430 , 0.048387
0.470430 , 0.048387
0.470430 , 0.064516
0.470430 , 0.048387
0.470430 , 0.032258
0.403225 , 0.048387
0.470430 , 0.048387
0.537634 , 0.048387
0.268817 , 0.048387
0.470430 , 0.048387
0.470430 , 0.048387
0.336021 , 0.048387
0.537634 , 0.056452
0.201613 , 0.048387
0.470430 , 0.048387
0.470430 , 0.048387
0.470430 , 0.032258
0.470430 , 0.048387
0.806452 , 0.032258
0.403225 , 0.048387
0.134408 , 0.056452
0.470430 , 0.056452
0.336021 , 0.048387
0.806452 , 0.040323
0.470430 , 0.040323
0.403225 , 0.048387
0.470430 , 0.048387
0.336021 , 0.072581
0.537634 , 0.048387
0.470430 , 0.048387
0.672042 , 0.040323
0.470430 , 0.048387
0.268817 , 0.032258
0.470430 , 0.048387
0.537634 , 0.048387
0.537634 , 0.056452
0.470430 , 0.048387
0.470430 , 0.072581
0.470430 , 0.024194
0.403225 , 0.048387
0.470430 , 0.048387
0.470430 , 0.048387
0.470430 , 0.048387
0.739247 , 0.056452
0.403225 , 0.048387
0.470430 , 0.056452
0.470430 , 0.048387
0.268817 , 0.056452
0.470430 , 0.048387
0.403225 , 0.048387
0.470430 , 0.040323
0.336021 , 0.056452
0.470430 , 0.056452
0.470430 , 0.048387
0.470430 , 0.048387
0.403225 , 0.048387
0.470430 , 0.048387
0.470430 , 0.048387
0.470430 , 0.064516
0.403225 , 0.056452
0.806452 , 0.048387
0.470430 , 0.048387
0.470430 , 0.048387
0.604838 , 0.048387
0.134408 , 0.056452
0.470430 , 0.048387
0.470430 , 0.040323
0.470430 , 0.064516
0.403225 , 0.040323
0.403225 , 0.048387
0.470430 , 0.040323
0.403225 , 0.048387
0.470430 , 0.048387
0.470430 , 0.040323
0.403225 , 0.040323
0.470430 , 0.048387
0.537634 , 0.048387
0.470430 , 0.048387
0.537634 , 0.048387
0.739247 , 0.040323
0.739247 , 0.048387
0.403225 , 0.048387
0.604838 , 0.048387
0.672042 , 0.048387
0.537634 , 0.048387
0.403225 , 0.048387
0.470430 , 0.056452
0.537634 , 0.048387
0.537634 , 0.048387
0.470430 , 0.040323
0.403225 , 0.048387
0.000000 , 0.056452
0.739247 , 0.048387
0.537634 , 0.048387
0.537634 , 0.056452
0.739247 , 0.048387
0.470430 , 0.048387
0.470430 , 0.040323
0.470430 , 0.048387
0.470430 , 0.040323
0.604838 , 0.048387
0.940861 , 0.040323
0.403225 , 0.048387
0.537634 , 0.048387
0.537634 , 0.048387
0.470430 , 0.040323
0.604838 , 0.048387
0.470430 , 0.048387
0.470430 , 0.048387
0.470430 , 0.048387
0.537634 , 0.048387
0.134408 , 0.040323
0.470430 , 0.048387
0.470430 , 0.056452
0.537634 , 0.048387
0.470430 , 0.056452
0.470430 , 0.048387
0.470430 , 0.056452
0.470430 , 0.032258
0.470430 , -0.008065
0.201613 , 0.048387
0.672042 , 0.048387
0.470430 , 0.032258
0.537634 , 0.072581
0.537634 , 0.056452
0.470430 , 0.056452
0.537634 , 0.048387
0.470430 , 0.040323
0.470430 , 0.048387
-0.067204 , 0.048387
0.268817 , 0.048387
0.268817 , 0.040323
0.537634 , 0.040323
1.075269 , 0.040323
0.470430 , 0.048387
0.336021 , 0.040323
0.873657 , 0.048387
0.470430 , 0.032258
0.470430 , 0.040323
0.470430 , 0.048387
0.940861 , 0.056452
0.470430 , 0.048387
0.403225 , 0.048387
0.470430 , 0.048387
0.470430 , 0.048387
0.470430 , 0.048387
0.336021 , 0.048387
0.604838 , 0.048387
0.403225 , 0.056452
0.470430 , 0.048387
0.470430 , 0.048387
0.403225 , 0.048387
0.470430 , 0.040323
0.336021 , 0.048387
0.470430 , 0.032258
0.470430 , 0.048387
0.470430 , 0.048387
0.470430 , 0.048387
-0.067204 , 0.056452
0.672042 , 0.040323
0.470430 , 0.032258
0.403225 , 0.048387
0.470430 , 0.056452
1.008065 , 0.048387
0.604838 , 0.056452
0.470430 , 0.048387
0.470430 , 0.032258
0.403225 , 0.048387
0.470430 , 0.048387
0.604838 , 0.048387
0.470430 , 0.048387
0.268817 , 0.048387
0.403225 , 0.048387
0.470430 , 0.048387
0.268817 , 0.056452
0.470430 , 0.048387
0.470430 , 0.056452
0.470430 , 0.024194
0.739247 , 0.048387
0.403225 , 0.048387
0.672042 , 0.048387
0.470430 , 0.056452
0.470430 , 0.048387
0.470430 , 0.048387
0.201613 , 0.048387
0.470430 , 0.032258
0.134408 , 0.048387
0.470430 , 0.064516
0.470430 , 0.040323
0.470430 , 0.048387
0.403225 , 0.048387
0.470430 , 0.048387
0.537634 , 0.048387
0.403225 , 0.048387
0.470430 , 0.048387
0.470430 , 0.032258
0.604838 , 0.048387
0.739247 , 0.048387
0.470430 , 0.040323
0.470430 , 0.048387
0.470430 , 0.048387
0.537634 , 0.048387
0.739247 , 0.048387
0.470430 , 0.048387
0.000000 , 0.048387
0.470430 , 0.048387
0.470430 , 0.048387
0.000000 , 0.048387
0.470430 , 0.048387
0.470430 , 0.048387
0.000000 , 0.048387
0.403225 , 0.072581
0.470430 , 0.048387
0.470430 , 0.048387
0.537634 , 0.040323
0.268817 , 0.048387
0.470430 , 0.040323
0.470430 , 0.048387
0.268817 , 0.048387
0.470430 , 0.048387
0.470430 , 0.040323
0.403225 , 0.048387
0.470430 , 0.032258
0.470430 , 0.040323
0.403225 , 0.040323
0.470430 , 0.048387
0.268817 , 0.048387
0.268817 , 0.008065
0.470430 , 0.048387
0.470430 , 0.048387
0.739247 , 0.048387
0.268817 , 0.048387
0.537634 , 0.048387
0.067204 , 0.048387
0.806452 , 0.048387
0.537634 , 0.048387
0.470430 , 0.040323
0.537634 , 0.048387
0.403225 , 0.048387
0.470430 , 0.048387
0.470430 , 0.048387
0.470430 , 0.048387
0.470430 , 0.064516
0.403225 , 0.024194
0.470430 , 0.048387
0.336021 , 0.048387
0.470430 , 0.048387
0.537634 , 0.040323
0.470430 , 0.040323
0.470430 , 0.040323
0.470430 , 0.040323
0.537634 , 0.048387
0.268817 , 0.048387
0.134408 , 0.048387
0.470430 , 0.048387
0.470430 , 0.048387
0.470430 , 0.056452
0.470430 , 0.040323
0.201613 , 0.056452
0.470430 , 0.048387
0.470430 , 0.048387
0.537634 , 0.040323
0.336021 , 0.048387
0.470430 , 0.048387
0.470430 , 0.048387
0.336021 , 0.048387
0.470430 , 0.048387
0.470430 , 0.048387
0.470430 , 0.024194
0.403225 , 0.056452
0.470430 , 0.048387
0.537634 , 0.056452
0.403225 , 0.032258
0.470430 , 0.048387
0.537634 , 0.048387
0.470430 , 0.048387
0.470430 , 0.048387
0.470430 , 0.048387
0.403225 , 0.048387
0.470430 , 0.040323
0.537634 , 0.048387
0.470430 , 0.048387
0.537634 , 0.048387
0.470430 , 0.048387
0.470430 , 0.048387
0.470430 , 0.048387
0.470430 , 0.048387
0.470430 , 0.056452
0.470430 , 0.048387
0.470430 , 0.048387
0.537634 , 0.048387
0.470430 , 0.040323
0.470430 , 0.024194
0.470430 , 0.048387
0.403225 , 0.040323
0.537634 , 0.048387
0.470430 , 0.048387
0.470430 , 0.048387
0.403225 , 0.048387
0.537634 , 0.048387
0.470430 , 0.048387
0.470430 , 0.040323
0.470430 , 0.056452
0.403225 , 0.048387
0.470430 , 0.048387
-0.067204 , 0.056452
0.201613 , 0.048387
0.403225 , 0.048387
0.470430 , 0.048387
0.470430 , 0.032258
0.470430 , 0.048387
0.470430 , 0.048387
0.403225 , 0.016129
0.268817 , 0.064516
0.470430 , 0.088710
0.537634 , 0.040323
0.470430 , 0.048387
0.604838 , 0.024194
0.537634 , 0.024194
0.739247 , 0.048387
0.470430 , 0.040323
0.470430 , 0.056452
0.537634 , 0.048387
0.470430 , 0.048387
0.470430 , 0.056452
0.470430 , 0.104839
0.470430 , 0.048387
0.470430 , 0.048387
0.000000 , 0.032258
0.470430 , 0.032258
0.470430 , 0.040323
0.470430 , 0.024194
0.470430 , 0.040323
0.201613 , 0.048387
0.604838 , 0.048387
0.470430 , 0.048387
0.470430 , 0.048387
0.470430 , 0.032258
0.268817 , 0.048387
0.470430 , 0.040323
0.403225 , 0.048387
0.470430 , 0.048387
0.470430 , 0.048387
0.537634 , 0.048387
0.470430 , 0.048387
0.470430 , 0.048387
0.470430 , 0.032258
0.537634 , 0.048387
0.470430 , 0.048387
0.470430 , 0.040323
0.470430 , 0.048387
0.470430 , 0.056452
0.403225 , 0.048387
0.268817 , 0.040323
0.470430 , 0.040323
0.806452 , 0.048387
0.403225 , 0.048387
0.067204 , 0.048387
0.470430 , 0.048387
0.403225 , 0.048387
0.470430 , 0.048387
0.201613 , 0.032258
0.537634 , 0.048387
0.470430 , 0.032258
0.537634 , 0.040323
0.470430 , 0.032258
0.470430 , 0.048387
0.470430 , 0.056452
0.470430 , 0.048387
0.470430 , 0.048387
1.008065 , 0.024194
0.470430 , 0.048387
0.672042 , 0.056452
0.470430 , 0.048387
0.470430 , 0.024194
0.470430 , 0.040323
0.739247 , 0.056452
0.739247 , 0.048387
0.470430 , 0.040323
0.470430 , 0.048387
0.672042 , 0.040323
0.470430 , 0.048387
0.470430 , 0.048387
0.470430 , 0.040323
0.470430 , 0.040323
0.470430 , 0.048387
0.403225 , 0.048387
0.470430 , 0.064516
0.604838 , 0.024194
0.537634 , 0.064516
0.470430 , 0.040323
0.470430 , 0.056452
0.537634 , 0.056452
0.403225 , 0.056452
0.470430 , 0.048387
0.470430 , 0.048387
0.470430 , 0.048387
0.403225 , 0.048387
0.470430 , 0.056452
0.672042 , 0.056452
0.470430 , 0.048387
0.604838 , 0.048387
0.403225 , 0.048387
0.672042 , 0.048387
0.403225 , 0.040323
0.470430 , 0.040323
0.134408 , 0.048387
0.470430 , 0.048387
0.403225 , 0.056452
0.403225 , 0.048387
0.604838 , 0.048387
0.470430 , 0.048387
0.470430 , 0.048387
0.336021 , 0.040323
0.403225 , 0.024194
0.470430 , 0.048387
0.470430 , 0.056452
0.537634 , 0.048387
0.470430 , 0.048387
0.470430 , 0.040323
0.604838 , 0.048387
0.470430 , 0.048387
0.537634 , 0.048387
0.403225 , 0.048387
0.470430 , 0.048387
0.470430 , 0.048387
0.470430 , 0.040323
0.470430 , 0.040323
-0.067204 , 0.056452
0.470430 , 0.048387
0.470430 , 0.048387
0.537634 , 0.040323
0.537634 , 0.056452
0.470430 , 0.056452
0.403225 , 0.048387
0.470430 , 0.056452
0.470430 , 0.056452
0.470430 , 0.048387
0.537634 , 0.048387
0.873657 , 0.040323
0.470430 , 0.056452
0.470430 , 0.048387
0.470430 , 0.048387
0.873657 , 0.048387
0.403225 , 0.056452
0.739247 , 0.048387
0.470430 , 0.048387
0.268817 , 0.048387
0.201613 , 0.048387
0.470430 , 0.040323
0.268817 , 0.040323
0.470430 , 0.040323
0.873657 , 0.048387
0.470430 , 0.040323
0.470430 , 0.048387
0.470430 , 0.040323
0.470430 , 0.048387
0.470430 , 0.024194
0.470430 , 0.048387
0.470430 , 0.048387
0.336021 , 0.048387
0.403225 , 0.056452
0.403225 , 0.048387
0.336021 , 0.048387
0.604838 , 0.064516
0.537634 , 0.048387
0.739247 , 0.048387
0.470430 , 0.048387
0.940861 , 0.048387
0.470430 , 0.048387
0.403225 , 0.056452
0.268817 , 0.048387
0.470430 , 0.048387
0.470430 , 0.048387
0.470430 , 0.024194
0.470430 , 0.024194
0.470430 , 0.048387
0.403225 , 0.064516
0.403225 , 0.032258
0.403225 , 0.048387
0.470430 , 0.048387
0.672042 , 0.048387
0.201613 , 0.048387
0.806452 , 0.048387
0.537634 , 0.024194
0.537634 , 0.048387
0.403225 , 0.056452
0.470430 , 0.040323
0.470430 , 0.048387
0.470430 , 0.048387
0.537634 , 0.048387
0.470430 , 0.048387
0.470430 , 0.048387
0.470430 , 0.048387
0.403225 , 0.048387
0.470430 , 0.040323
0.470430 , 0.040323
0.470430 , 0.048387
0.672042 , 0.048387
0.470430 , 0.048387
0.470430 , 0.048387
0.470430 , 0.048387
0.403225 , 0.048387
0.470430 , 0.040323
0.537634 , 0.048387
0.470430 , 0.048387
0.134408 , 0.072581
0.403225 , 0.040323
0.470430 , 0.048387
0.403225 , 0.040323
0.403225 , 0.048387
0.470430 , 0.048387
0.470430 , 0.032258
0.201613 , 0.048387
0.336021 , 0.048387
0