Removed Pin From Net: NetName=+12 Pin=K1-1
Removed Pin From Net: NetName=+24 Pin=K1-3
Removed Pin From Net: NetName=+Vbat Pin=K2-1
Removed Pin From Net: NetName=+24 Pin=K2-3
Removed Pin From Net: NetName=+5 Pin=U6-7
Removed Pin From Net: NetName=GND Pin=U6-14
Removed Member From Class: ClassName=Schematic - shield cockpit V2.1 Member=J?
Removed Member From Class: ClassName=Schematic - shield cockpit V2.1 Member=Q?
Change Component Footprint: Designator=K1 Old Footprint=FP-CX240D5R-MFG New Footprint=CN100D24
Change Component Footprint: Designator=K2 Old Footprint=FP-CX240D5R-MFG New Footprint=CN100D24
Change Component Footprint: Designator=U6 Old Footprint=J0014A New Footprint=N0014A
Change Component Comment : Designator=K1 Old Comment=CX240D5R New Comment=CN100D24
Change Component Comment : Designator=K2 Old Comment=CX240D5R New Comment=CN100D24
Change Component Comment : Designator=U6 Old Comment=SN5425J New Comment=SN7425N
Change Component Designator: OldDesignator=C1 NewDesignator=C7
Change Component Designator: OldDesignator=C2 NewDesignator=C8
Change Component Designator: OldDesignator=C3 NewDesignator=C9
Change Component Designator: OldDesignator=C4 NewDesignator=C11
Change Component Designator: OldDesignator=C7 NewDesignator=C10
Change Component Designator: OldDesignator=C8 NewDesignator=C2
Change Component Designator: OldDesignator=C9 NewDesignator=C1
Change Component Designator: OldDesignator=C10 NewDesignator=C3
Change Component Designator: OldDesignator=C11 NewDesignator=C4
Change Component Designator: OldDesignator=J1 NewDesignator=J3
Change Component Designator: OldDesignator=J2 NewDesignator=J4
Change Component Designator: OldDesignator=J3 NewDesignator=J5
Change Component Designator: OldDesignator=J4 NewDesignator=J13
Change Component Designator: OldDesignator=J5 NewDesignator=J16
Change Component Designator: OldDesignator=J6 NewDesignator=J22
Change Component Designator: OldDesignator=J7 NewDesignator=J17
Change Component Designator: OldDesignator=J8 NewDesignator=J6
Change Component Designator: OldDesignator=J9 NewDesignator=J14
Change Component Designator: OldDesignator=J10 NewDesignator=J20
Change Component Designator: OldDesignator=J11 NewDesignator=J18
Change Component Designator: OldDesignator=J12 NewDesignator=J21
Change Component Designator: OldDesignator=J13 NewDesignator=J25
Change Component Designator: OldDesignator=J14 NewDesignator=J15
Change Component Designator: OldDesignator=J15 NewDesignator=J7
Change Component Designator: OldDesignator=J16 NewDesignator=J10
Change Component Designator: OldDesignator=J17 NewDesignator=J1
Change Component Designator: OldDesignator=J18 NewDesignator=J2
Change Component Designator: OldDesignator=J19 NewDesignator=J11
Change Component Designator: OldDesignator=J21 NewDesignator=J9
Change Component Designator: OldDesignator=J22 NewDesignator=J8
Change Component Designator: OldDesignator=J23 NewDesignator=J12
Change Component Designator: OldDesignator=J24 NewDesignator=J19
Change Component Designator: OldDesignator=J? NewDesignator=J23
Change Component Designator: OldDesignator=Q1 NewDesignator=Q2
Change Component Designator: OldDesignator=Q2 NewDesignator=Q3
Change Component Designator: OldDesignator=Q? NewDesignator=Q1
Change Component Designator: OldDesignator=R1 NewDesignator=R20
Change Component Designator: OldDesignator=R2 NewDesignator=R23
Change Component Designator: OldDesignator=R3 NewDesignator=R25
Change Component Designator: OldDesignator=R4 NewDesignator=R26
Change Component Designator: OldDesignator=R5 NewDesignator=R12
Change Component Designator: OldDesignator=R6 NewDesignator=R18
Change Component Designator: OldDesignator=R7 NewDesignator=R21
Change Component Designator: OldDesignator=R8 NewDesignator=R28
Change Component Designator: OldDesignator=R9 NewDesignator=R13
Change Component Designator: OldDesignator=R10 NewDesignator=R16
Change Component Designator: OldDesignator=R11 NewDesignator=R17
Change Component Designator: OldDesignator=R12 NewDesignator=R19
Change Component Designator: OldDesignator=R13 NewDesignator=R22
Change Component Designator: OldDesignator=R14 NewDesignator=R24
Change Component Designator: OldDesignator=R15 NewDesignator=R27
Change Component Designator: OldDesignator=R16 NewDesignator=R29
Change Component Designator: OldDesignator=R17 NewDesignator=R4
Change Component Designator: OldDesignator=R18 NewDesignator=R6
Change Component Designator: OldDesignator=R19 NewDesignator=R11
Change Component Designator: OldDesignator=R20 NewDesignator=R10
Change Component Designator: OldDesignator=R21 NewDesignator=R5
Change Component Designator: OldDesignator=R22 NewDesignator=R1
Change Component Designator: OldDesignator=R23 NewDesignator=R2
Change Component Designator: OldDesignator=R24 NewDesignator=R3
Change Component Designator: OldDesignator=R25 NewDesignator=R7
Change Component Designator: OldDesignator=R26 NewDesignator=R9
Change Component Designator: OldDesignator=R27 NewDesignator=R8
Change Component Designator: OldDesignator=R28 NewDesignator=R15
Change Component Designator: OldDesignator=R29 NewDesignator=R14
Change Component Designator: OldDesignator=U1 NewDesignator=U5
Change Component Designator: OldDesignator=U2 NewDesignator=U3
Change Component Designator: OldDesignator=U3 NewDesignator=U1
Change Component Designator: OldDesignator=U5 NewDesignator=U2
Change Managed Component Library Link : Designator=U6 Old VaultGUID=B7D15EC3-160A-466F-A46C-7801FE6295A7 New VaultGUID=B7D15EC3-160A-466F-A46C-7801FE6295A7 Old ItemGUID=E5393EFF-8ADB-4988-8371-A94F47E5F346 New ItemGUID=09405C7C-E893-415A-9241-EBA8320E0CD3 Old RevisionGUID=3C170353-668A-4F68-A546-B0C978561667 New RevisionGUID=32816B6F-87AF-4AF5-8E07-D456157A1AE4
Change Managed Component Library Link : Designator=K1 Old VaultGUID=B7D15EC3-160A-466F-A46C-7801FE6295A7 New VaultGUID= Old ItemGUID=89CD4ACC-59F0-4467-9ED7-00FFF4F9E498 New ItemGUID= Old RevisionGUID=23836A2E-6641-4257-A661-E021D20260A4 New RevisionGUID=
Change Managed Component Library Link : Designator=K2 Old VaultGUID=B7D15EC3-160A-466F-A46C-7801FE6295A7 New VaultGUID= Old ItemGUID=89CD4ACC-59F0-4467-9ED7-00FFF4F9E498 New ItemGUID= Old RevisionGUID=23836A2E-6641-4257-A661-E021D20260A4 New RevisionGUID=
Change component parameters: Designator = "K1" ("K1"); Footprint = "FP-CX240D5R-MFG"; UniqueID = "\OJPVOEBL" ("\OJPVOEBL")
Change component parameters (AddParameter): Name = "Arrow Part Number"; Value = ""; VariantName = "[No Variations]"
Change component parameters (AddParameter): Name = "Arrow Price/Stock"; Value = ""; VariantName = "[No Variations]"
Change component parameters (AddParameter): Name = "Datasheet Link"; Value = "https://www.sensata.com/sites/default/files/a/sensata-cn-series-plug-in-pcb-mount-ssr-datasheet.pdf"; VariantName = "[No Variations]"
Change component parameters (AddParameter): Name = "Height"; Value = "15.5mm"; VariantName = "[No Variations]"
Change component parameters (AddParameter): Name = "Manufacturer_Name"; Value = "CRYDOM"; VariantName = "[No Variations]"
Change component parameters (AddParameter): Name = "Manufacturer_Part_Number"; Value = "CN100D24"; VariantName = "[No Variations]"
Change component parameters (AddParameter): Name = "Mouser Part Number"; Value = "558-CN100D24"; VariantName = "[No Variations]"
Change component parameters (AddParameter): Name = "Mouser Price/Stock"; Value = "https://www.mouser.co.uk/ProductDetail/Crydom/CN100D24?qs=QNEnbhJQKvYWxrlj%2FePnbw%3D%3D"; VariantName = "[No Variations]"
Change component parameters (AddParameter): Name = "Supplier 1"; Value = "Digi-Key"; VariantName = "[No Variations]"
Change component parameters (AddParameter): Name = "Supplier Part Number 1"; Value = "172-CN100D24-ND"; VariantName = "[No Variations]"
Change component parameters: Designator = "K2" ("K2"); Footprint = "FP-CX240D5R-MFG"; UniqueID = "\BAFYKXQS" ("\BAFYKXQS")
Change component parameters (AddParameter): Name = "Arrow Part Number"; Value = ""; VariantName = "[No Variations]"
Change component parameters (AddParameter): Name = "Arrow Price/Stock"; Value = ""; VariantName = "[No Variations]"
Change component parameters (AddParameter): Name = "Datasheet Link"; Value = "https://www.sensata.com/sites/default/files/a/sensata-cn-series-plug-in-pcb-mount-ssr-datasheet.pdf"; VariantName = "[No Variations]"
Change component parameters (AddParameter): Name = "Height"; Value = "15.5mm"; VariantName = "[No Variations]"
Change component parameters (AddParameter): Name = "Manufacturer_Name"; Value = "CRYDOM"; VariantName = "[No Variations]"
Change component parameters (AddParameter): Name = "Manufacturer_Part_Number"; Value = "CN100D24"; VariantName = "[No Variations]"
Change component parameters (AddParameter): Name = "Mouser Part Number"; Value = "558-CN100D24"; VariantName = "[No Variations]"
Change component parameters (AddParameter): Name = "Mouser Price/Stock"; Value = "https://www.mouser.co.uk/ProductDetail/Crydom/CN100D24?qs=QNEnbhJQKvYWxrlj%2FePnbw%3D%3D"; VariantName = "[No Variations]"
Change component parameters (AddParameter): Name = "Supplier 1"; Value = "Digi-Key"; VariantName = "[No Variations]"
Change component parameters (AddParameter): Name = "Supplier Part Number 1"; Value = "172-CN100D24-ND"; VariantName = "[No Variations]"
Change component parameters: Designator = "U6" ("U6"); Footprint = "J0014A"; UniqueID = "\TEHFQFIF" ("\TEHFQFIF")
Change component parameters (AddParameter): Name = "Bits(#)"; Value = "2"; VariantName = "[No Variations]"
Change component parameters (AddParameter): Name = "Code_JEDEC"; Value = "MS-001"; VariantName = "[No Variations]"
Change component parameters (AddParameter): Name = "DatasheetVersion"; Value = "SDLS082"; VariantName = "[No Variations]"
Change component parameters (AddParameter): Name = "F @ Nom Voltage(Max)(Mhz)"; Value = "75"; VariantName = "[No Variations]"
Change component parameters (AddParameter): Name = "Generic Part Number"; Value = "SN7425"; VariantName = "[No Variations]"
Change component parameters (AddParameter): Name = "ICC @ Nom Voltage(Max)(mA)"; Value = "0.019"; VariantName = "[No Variations]"
Change component parameters (AddParameter): Name = "Input Type"; Value = "TTL"; VariantName = "[No Variations]"
Change component parameters (AddParameter): Name = "Manufacturer"; Value = "Texas Instruments"; VariantName = "[No Variations]"
Change component parameters (AddParameter): Name = "Operating Temperature Range(C)"; Value = "0 to 70"; VariantName = "[No Variations]"
Change component parameters (AddParameter): Name = "Output Drive (IOL/IOH)(Max)(mA)"; Value = "0.8/-16"; VariantName = "[No Variations]"
Change component parameters (AddParameter): Name = "Output Type"; Value = "TTL"; VariantName = "[No Variations]"
Change component parameters (AddParameter): Name = "PackageReference"; Value = "N0014A"; VariantName = "[No Variations]"
Change component parameters (AddParameter): Name = "PackageVersion"; Value = "http://www.ti.com/lit/ml/mpdi002c/mpdi002c.pdf"; VariantName = "[No Variations]"
Change component parameters (AddParameter): Name = "Rating"; Value = "Catalog"; VariantName = "[No Variations]"
Change component parameters (AddParameter): Name = "tpd @ Nom Voltage(Max)(ns)"; Value = "22"; VariantName = "[No Variations]"
Change component parameters (AddParameter): Name = "VCC(Max)(V)"; Value = "5.25"; VariantName = "[No Variations]"
Change component parameters (AddParameter): Name = "VCC(Min)(V)"; Value = "4.75"; VariantName = "[No Variations]"
Change component parameters (AddParameter): Name = "Voltage(Nom)(V)"; Value = "5"; VariantName = "[No Variations]"
Added Component: Designator=D1(SOT95P230X110-3N)
Add component (AddParameter): Name = "Arrow Part Number"; Value = "BAS16,215"; VariantName = "[No Variations]"
Add component (AddParameter): Name = "Arrow Price/Stock"; Value = "https://www.arrow.com/en/products/bas16215/nexperia?region=asia"; VariantName = "[No Variations]"
Add component (AddParameter): Name = "Datasheet Link"; Value = "https://assets.nexperia.com/documents/data-sheet/BAS16_SER.pdf"; VariantName = "[No Variations]"
Add component (AddParameter): Name = "Height"; Value = "1.1mm"; VariantName = "[No Variations]"
Add component (AddParameter): Name = "Manufacturer_Name"; Value = "Nexperia"; VariantName = "[No Variations]"
Add component (AddParameter): Name = "Manufacturer_Part_Number"; Value = "BAS16,215"; VariantName = "[No Variations]"
Add component (AddParameter): Name = "Mouser Part Number"; Value = "771-BAS16-T/R"; VariantName = "[No Variations]"
Add component (AddParameter): Name = "Mouser Price/Stock"; Value = "https://www.mouser.co.uk/ProductDetail/Nexperia/BAS16215?qs=me8TqzrmIYV7V5KFj4xR5w%3D%3D"; VariantName = "[No Variations]"
Add component (AddParameter): Name = "Supplier 1"; Value = "RSComponents"; VariantName = "[No Variations]"
Add component (AddParameter): Name = "Supplier Part Number 1"; Value = "1038399"; VariantName = "[No Variations]"
Added Component: Designator=D2(SOT95P230X110-3N)
Add component (AddParameter): Name = "Arrow Part Number"; Value = "BAS16,215"; VariantName = "[No Variations]"
Add component (AddParameter): Name = "Arrow Price/Stock"; Value = "https://www.arrow.com/en/products/bas16215/nexperia?region=asia"; VariantName = "[No Variations]"
Add component (AddParameter): Name = "Datasheet Link"; Value = "https://assets.nexperia.com/documents/data-sheet/BAS16_SER.pdf"; VariantName = "[No Variations]"
Add component (AddParameter): Name = "Height"; Value = "1.1mm"; VariantName = "[No Variations]"
Add component (AddParameter): Name = "Manufacturer_Name"; Value = "Nexperia"; VariantName = "[No Variations]"
Add component (AddParameter): Name = "Manufacturer_Part_Number"; Value = "BAS16,215"; VariantName = "[No Variations]"
Add component (AddParameter): Name = "Mouser Part Number"; Value = "771-BAS16-T/R"; VariantName = "[No Variations]"
Add component (AddParameter): Name = "Mouser Price/Stock"; Value = "https://www.mouser.co.uk/ProductDetail/Nexperia/BAS16215?qs=me8TqzrmIYV7V5KFj4xR5w%3D%3D"; VariantName = "[No Variations]"
Add component (AddParameter): Name = "Supplier 1"; Value = "RSComponents"; VariantName = "[No Variations]"
Add component (AddParameter): Name = "Supplier Part Number 1"; Value = "1038399"; VariantName = "[No Variations]"
Added Component: Designator=F1(C1206)
Add component (AddParameter): Name = "LatestRevisionDate"; Value = "17-Jul-2002"; VariantName = "[No Variations]"
Add component (AddParameter): Name = "LatestRevisionNote"; Value = "Re-released for DXP Platform."; VariantName = "[No Variations]"
Add component (AddParameter): Name = "PackageDescription"; Value = "Thru-Hole; 2 Leads"; VariantName = "[No Variations]"
Add component (AddParameter): Name = "PackageReference"; Value = "PIN-W2/E2.8"; VariantName = "[No Variations]"
Add component (AddParameter): Name = "Published"; Value = "8-Jun-2000"; VariantName = "[No Variations]"
Add component (AddParameter): Name = "Publisher"; Value = "Altium Limited"; VariantName = "[No Variations]"
Add component (AddParameter): Name = "Supplier 1"; Value = "RSComponents"; VariantName = "[No Variations]"
Add component (AddParameter): Name = "Supplier Part Number 1"; Value = "1740296"; VariantName = "[No Variations]"
Added Component: Designator=J24(FP-S08B-PASK-2_LF_SN-MFG)
Add component (AddParameter): Name = "Color"; Value = "Natural"; VariantName = "[No Variations]"
Add component (AddParameter): Name = "Connector Type"; Value = "Header"; VariantName = "[No Variations]"
Add component (AddParameter): Name = "Contact Finish - Mating"; Value = "TIN"; VariantName = "[No Variations]"
Add component (AddParameter): Name = "Contact Material"; Value = "Copper Alloy"; VariantName = "[No Variations]"
Add component (AddParameter): Name = "Contact Mating Length"; Value = "0.126inch"; VariantName = "[No Variations]"
Add component (AddParameter): Name = "Contact Plating"; Value = "Tin"; VariantName = "[No Variations]"
Add component (AddParameter): Name = "Contact Shape"; Value = "Square"; VariantName = "[No Variations]"
Add component (AddParameter): Name = "Contact Type"; Value = "Male Pin"; VariantName = "[No Variations]"
Add component (AddParameter): Name = "Current Rating"; Value = "3A"; VariantName = "[No Variations]"
Add component (AddParameter): Name = "Fastening Type"; Value = "Ramp"; VariantName = "[No Variations]"
Add component (AddParameter): Name = "Flammability Rating"; Value = "UL94 V-0"; VariantName = "[No Variations]"
Add component (AddParameter): Name = "Housing Color"; Value = "White"; VariantName = "[No Variations]"
Add component (AddParameter): Name = "Insulation Color"; Value = "Natural"; VariantName = "[No Variations]"
Add component (AddParameter): Name = "Insulation Material"; Value = "PBT"; VariantName = "[No Variations]"
Add component (AddParameter): Name = "Lead Free"; Value = "Lead Free"; VariantName = "[No Variations]"
Add component (AddParameter): Name = "Mount"; Value = "Through Hole"; VariantName = "[No Variations]"
Add component (AddParameter): Name = "Number of Contacts"; Value = "8"; VariantName = "[No Variations]"
Add component (AddParameter): Name = "Number of Positions"; Value = "8"; VariantName = "[No Variations]"
Add component (AddParameter): Name = "Number of Rows"; Value = "1"; VariantName = "[No Variations]"
Add component (AddParameter): Name = "Orientation"; Value = "Right Angle"; VariantName = "[No Variations]"
Add component (AddParameter): Name = "Packaging"; Value = "Bulk"; VariantName = "[No Variations]"
Add component (AddParameter): Name = "Pitch"; Value = "2mm"; VariantName = "[No Variations]"
Add component (AddParameter): Name = "Series"; Value = "PA"; VariantName = "[No Variations]"
Add component (AddParameter): Name = "Termination"; Value = "Solder"; VariantName = "[No Variations]"
Add component (AddParameter): Name = "Voltage Rating"; Value = "250V"; VariantName = "[No Variations]"
Added Pin To Net: NetName=GND Pin=D1-1
Added Pin To Net: NetName=GND Pin=D2-1
Added Pin To Net: NetName=+3.3 Pin=J24-1
Added Pin To Net: NetName=GND Pin=J24-8
Added Pin To Net: NetName=+Vbat Pin=K1-13
Added Pin To Net: NetName=+24 Pin=K1-A1
Added Pin To Net: NetName=+12 Pin=K2-13
Added Pin To Net: NetName=+24 Pin=K2-A1
Added Pin To Net: NetName=GND Pin=U6-7
Added Pin To Net: NetName=+5 Pin=U6-14
Change Net Name : Old Net Name=NetC8_2 New Net Name=NetC2_2
Change Net Name : Old Net Name=NetC9_2 New Net Name=NetC1_2
Change Net Name : Old Net Name=NetC10_2 New Net Name=NetC3_2
Change Net Name : Old Net Name=NetC11_2 New Net Name=NetC4_2
Change Net Name : Old Net Name=NetJ1_5 New Net Name=NetJ3_5
Change Net Name : Old Net Name=NetJ1_6 New Net Name=NetJ3_6
Change Net Name : Old Net Name=NetJ1_7 New Net Name=NetJ3_7
Change Net Name : Old Net Name=NetJ1_9 New Net Name=NetJ3_9
Change Net Name : Old Net Name=NetJ1_10 New Net Name=NetJ3_10
Change Net Name : Old Net Name=NetJ1_11 New Net Name=NetJ3_11
Change Net Name : Old Net Name=NetJ1_17 New Net Name=NetJ3_17
Change Net Name : Old Net Name=NetJ1_18 New Net Name=NetJ3_18
Change Net Name : Old Net Name=NetJ2_4 New Net Name=NetJ4_4
Change Net Name : Old Net Name=NetJ2_5 New Net Name=NetJ4_5
Change Net Name : Old Net Name=NetJ2_6 New Net Name=NetJ4_6
Change Net Name : Old Net Name=NetJ2_7 New Net Name=NetJ4_7
Change Net Name : Old Net Name=NetJ2_8 New Net Name=NetJ4_8
Change Net Name : Old Net Name=NetJ2_9 New Net Name=NetJ4_9
Change Net Name : Old Net Name=NetJ2_10 New Net Name=NetJ4_10
Change Net Name : Old Net Name=NetJ2_11 New Net Name=NetJ4_11
Change Net Name : Old Net Name=NetJ2_12 New Net Name=NetJ4_12
Change Net Name : Old Net Name=NetJ2_15 New Net Name=NetJ4_15
Change Net Name : Old Net Name=NetJ13_2 New Net Name=NetJ25_2
Change Net Name : Old Net Name=NetJ17_2 New Net Name=NetJ1_2
Change Net Name : Old Net Name=NetJ18_2 New Net Name=NetJ2_2
Change Net Name : Old Net Name=NetJ19_2 New Net Name=NetJ11_2
Change Net Name : Old Net Name=NetJ21_2 New Net Name=NetJ9_2
Change Net Name : Old Net Name=NetJ22_2 New Net Name=NetJ8_2
Change Net Name : Old Net Name=NetJ23_2 New Net Name=NetJ12_2
Change Net Name : Old Net Name=NetQ1_1 New Net Name=NetQ2_1
Change Net Name : Old Net Name=NetQ1_2 New Net Name=NetQ2_2
Change Net Name : Old Net Name=NetQ2_1 New Net Name=NetQ3_1
Change Net Name : Old Net Name=NetQ?_1 New Net Name=NetQ1_1
Change Net Name : Old Net Name=NetR3_1 New Net Name=NetR25_1
Change Net Name : Old Net Name=NetR5_1 New Net Name=NetR12_1
Change Net Name : Old Net Name=NetR6_1 New Net Name=NetR18_1
Change Net Name : Old Net Name=NetR7_1 New Net Name=NetR21_1
Change Net Name : Old Net Name=NetR8_1 New Net Name=NetR28_1
Change Net Name : Old Net Name=NetR9_1 New Net Name=NetR13_1
Change Net Name : Old Net Name=NetR11_1 New Net Name=NetR17_1
Change Net Name : Old Net Name=NetR13_1 New Net Name=NetR22_1
Change Net Name : Old Net Name=NetR15_1 New Net Name=NetR27_1
Change Net Name : Old Net Name=NetU1_1 New Net Name=NetU4_6
Change Net Name : Old Net Name=NetU1_9 New Net Name=NetU4_2
Change Net Name : Old Net Name=NetU1_10 New Net Name=NetU4_5
Change Net Name : Old Net Name=NetU1_13 New Net Name=NetU4_1
Change Net Name : Old Net Name=NetU3_4 New Net Name=NetU1_4
Change Net Name : Old Net Name=NetU3_5 New Net Name=NetU1_5
Change Net Name : Old Net Name=NetU3_6 New Net Name=NetU1_6
Added Pin To Net: NetName=NetD1_3 Pin=D1-3
Added Pin To Net: NetName=NetD1_3 Pin=F1-2
Added Pin To Net: NetName=NetD1_3 Pin=J23-2
Added Net: Name=NetD1_3
Added Pin To Net: NetName=NetD2_3 Pin=D2-3
Added Pin To Net: NetName=NetD2_3 Pin=J22-2
Added Pin To Net: NetName=NetD2_3 Pin=K2-14
Added Net: Name=NetD2_3
Added Pin To Net: NetName=NetF1_1 Pin=F1-1
Added Pin To Net: NetName=NetF1_1 Pin=K1-14
Added Net: Name=NetF1_1
Added Pin To Net: NetName=NetJ24_2 Pin=J24-2
Added Pin To Net: NetName=NetJ24_2 Pin=U2-6
Added Net: Name=NetJ24_2
Added Pin To Net: NetName=NetJ24_3 Pin=J24-3
Added Pin To Net: NetName=NetJ24_3 Pin=U2-7
Added Net: Name=NetJ24_3
Added Pin To Net: NetName=NetJ24_4 Pin=J24-4
Added Pin To Net: NetName=NetJ24_4 Pin=U2-9
Added Net: Name=NetJ24_4
Added Pin To Net: NetName=NetJ24_5 Pin=J24-5
Added Pin To Net: NetName=NetJ24_5 Pin=U2-10
Added Net: Name=NetJ24_5
Added Pin To Net: NetName=NetJ24_6 Pin=J24-6
Added Pin To Net: NetName=NetJ24_6 Pin=U2-11
Added Net: Name=NetJ24_6
Added Pin To Net: NetName=NetJ24_7 Pin=J24-7
Added Pin To Net: NetName=NetJ24_7 Pin=U2-12
Added Net: Name=NetJ24_7
Added Pin To Net: NetName=NetJ25_1 Pin=J25-1
Added Pin To Net: NetName=NetJ25_1 Pin=K2-A2
Added Net: Name=NetJ25_1
Added Pin To Net: NetName=NetK1_A2 Pin=K1-A2
Added Pin To Net: NetName=NetK1_A2 Pin=Q1-3
Added Net: Name=NetK1_A2
Added Member To Class: ClassName=Schematic - shield cockpit V2.1 Member=Component D1 BAS16,215
Added Member To Class: ClassName=Schematic - shield cockpit V2.1 Member=Component D2 BAS16,215
Added Member To Class: ClassName=Schematic - shield cockpit V2.1 Member=Component F1 2A
Added Member To Class: ClassName=Schematic - shield cockpit V2.1 Member=Component J20 B02B
Added Member To Class: ClassName=Schematic - shield cockpit V2.1 Member=Component J25 B02B
Added Member To Class: ClassName=Schematic - shield cockpit V2.1 Member=Component Q3 2N7002-T1-GE3
Added Room: Name=Schematic - shield cockpit V2.1
