M48
;Layer_Color=9474304
;FILE_FORMAT=2:4
INCH,TZ
;TYPE=PLATED
T1F00S00C0.0118
T2F00S00C0.0157
T4F00S00C0.0276
T5F00S00C0.0320
T6F00S00C0.0335
T7F00S00C0.0531
T8F00S00C0.1220
;TYPE=NON_PLATED
T9F00S00C0.0433
%
T01
X13210Y1530
X12460Y3000
X21160Y3220
X21150Y2340
X10594Y896
X10628Y4022
X3740Y2200
X2380Y2520
X2250Y1920
X1990Y450
X3690Y4940
X3700Y5630
X3454Y6596
X3790Y8245
X2920Y8110
X5140Y8140
X5130Y9720
X8240Y13670
X9080Y14860
X8900Y15270
X9390Y15770
X9780Y14880
X10310Y14680
X11400Y14580
X11370Y15140
X11290Y15580
X11800Y15910
X11730Y16490
X11070Y16800
X11140Y17180
X11422Y17342
X10420Y19300
X9680Y19210
X8240Y18840
X7230Y19480
X5648Y19412
X5710Y17650
X7460Y16530
X11752Y14270
X11610Y13220
X10610Y6920
X11440Y5400
Y4850
X2740Y14430
X11840Y14930
X12150Y16180
X12410Y17540
X11980Y18210
X12740Y19080
X15480Y18970
X15770Y19190
X16020Y19020
X16120Y18730
X16500Y18830
X16520Y18540
X16530Y18250
X17110Y18620
X17269Y19280
X16880Y19210
X17137Y17741
X16510Y16950
X16420Y16650
X16520Y16161
X16010Y16340
X16140Y17120
X16905Y15718
X17330Y15820
X18130Y15660
X19110Y15590
X19354Y14660
X20160Y14180
X20610Y14130
X20660Y13370
X20220Y13390
X21551Y13151
X21720Y13500
X22070Y15000
X21035Y14935
X21110Y17290
X20927Y17817
X22000Y17110
X23270Y17230
X23530Y17107
X24260Y16290
X23374Y15484
X23540Y14180
X23861Y14179
X23850Y13880
X24343Y13777
X25198Y14709
X25540Y14600
X25876Y16196
X27401Y15240
X26480Y13200
X25442Y12412
X25690Y11460
X26080Y11250
X24050Y12000
X22630Y11813
X21200Y9170
X19690Y9260
X17770Y11130
X16568Y12478
X16850Y13540
X17546Y13790
X17593Y14120
X17340Y14360
X18428Y13898
X18390Y13280
X15210Y13120
X15310Y13930
X15430Y14170
X15719Y14289
X15950Y14520
X16420Y15040
X14510Y14080
X13780Y14640
X13390Y15190
X13550Y13380
X13690Y13180
X13890Y12920
X14220Y12790
X14039Y11301
X14610Y10630
X13860Y9560
X15706Y9876
X16390Y6530
X13980Y5650
Y5200
Y4750
X13530
Y5200
Y5650
X12950Y5400
X12447
X11943
X11953Y4850
X12467
X12980
X12710Y11550
X12754Y13084
X12514Y13324
X12214Y13624
X18510Y16549
X18186Y18629
X27430Y18510
X26940Y19410
X25140Y7330
X24380Y6930
Y6590
Y6250
X24030
Y6590
Y6930
X23120Y6760
X24750Y5490
X27782Y9841
X29460Y8630
X29320Y11640
X29730Y11700
X28280Y16030
X27490Y15690
X27920Y17990
X28450Y18680
X28530Y18970
X27951Y19250
X28310Y19640
X19367Y20270
X18280Y20760
X18970Y21870
X19190Y23110
X19220Y24030
X19840Y23570
X17120Y23460
X15860Y23090
X15380Y24070
X16040Y24720
X16002Y26760
X14965Y26410
X12651Y25135
X13263Y20642
X15250Y21630
X17832Y25255
X18050Y25830
X18780Y26390
X19480Y26400
X20540Y26480
X22920Y25110
X7345Y25255
X5670Y25375
X5248Y25098
X4620Y25350
X4510Y26400
X3960Y24820
X5130Y24060
X5770Y20180
X9440Y20590
X11810Y20340
T02
X14130Y9210
X24470Y15733
T04
X16670Y2010
Y3010
X17670
X18480Y3025
Y2237
Y1450
X17670Y2010
X17170Y4010
X18480Y3812
X23010
Y3025
Y2237
Y1450
X24280Y2010
Y3010
X25280
Y2010
X24780Y4010
X8425Y3010
Y2010
X6500Y1633
Y2420
X18480Y4600
X23010
X24375Y22603
X25163
X25950
X26737
X11627Y22470
X10840
X10053
X9265
T05
X11980Y23420
Y26420
X24008Y26425
X25008Y25425
Y24425
X26008
Y25425
X27008Y26425
Y23425
X24008
X10980Y24420
X9980
Y25420
X10980
X8980Y26420
Y23420
T06
X4058Y25925
X6026
T07
X30118Y1213
Y2213
Y3213
Y4213
X20580
Y3213
Y2213
Y1213
X1378Y2953
Y3953
Y4953
Y5953
Y6953
Y7953
Y8953
Y9953
Y10953
Y11953
Y12953
Y13953
Y14953
Y15953
Y16953
Y17953
Y18953
Y19953
X20580Y5213
X30118
Y6213
Y7213
Y8213
Y9213
Y10213
Y11213
Y12213
Y13213
Y14213
Y15213
Y16213
Y17213
Y18213
Y19213
Y20213
Y21213
Y22213
Y23213
Y24213
X2756Y24484
Y23484
Y25484
Y26484
X1378Y21953
Y20953
T08
X1378Y1378
X30118Y26181
T09
X19149Y859
X23679
X7169Y1042
X23785Y21934
X8675Y21801
M30
