M48
;Layer_Color=9474304
;FILE_FORMAT=2:4
INCH,TZ
;TYPE=PLATED
T2F00S00C0.0280
T3F00S00C0.0335
T4F00S00C0.0394
T5F00S00C0.0402
%
T02
X9250Y2050
Y2800
X11700Y3000
X16750Y2800
Y2050
X17850Y4800
X13850Y7400
X6358Y6708
X5150Y6897
X24450Y3350
X23100Y9050
X20750Y10550
X20650Y11350
Y12450
X20550Y13300
X22150Y13950
X18800Y14263
X20000Y15800
X19300Y18500
X21550Y20350
X22650Y20500
X20140Y22874
X18857Y22940
X18808Y22292
X18126Y19150
X18125Y18475
X16000Y19100
X15900Y17900
X15450Y17400
X15000Y16900
X14550Y16450
X12050Y16900
X11350Y14550
X8569Y13490
X8150Y9450
X7321Y9057
X7055Y9595
X6400Y8350
X5850Y11200
X11850Y8150
X16250Y7850
X17850
X15050Y22500
X13950Y22900
X10900Y20950
X10509Y20352
X10518Y19200
X9100Y19050
X9200Y19850
X9350Y20950
X8666Y20816
X7717Y20167
X8072Y19644
X7942Y19058
X7691Y18485
X8650Y18191
X9277Y18223
X4450Y19050
X3800
X4800Y20650
X5150Y21500
X5486Y23214
X8000Y23150
X7450Y22350
X6100Y24250
X13050Y25950
X12839Y26512
X14450Y26500
X15600Y26550
X16800Y26200
X19188Y26352
X18900Y24550
X20300Y24950
T03
X4616Y25319
X6584
T04
X3933Y1278
Y2065
Y2852
Y3640
X8233
Y2852
Y2065
Y1278
X17783
Y2065
Y2852
Y3640
X22083
Y2852
Y2065
Y1278
X12368Y23700
Y24700
X11037Y26100
X10250
X9463
X8675
T05
X2000Y4350
Y5350
Y6350
Y7350
X12150Y4350
X13150
X14150
X14250Y1200
X13250
X12250
X25500Y5400
Y6400
Y7400
Y8400
Y9400
Y10400
Y11400
Y12400
Y13400
Y14400
Y15400
Y16400
Y17400
Y18400
Y19400
Y20400
Y21400
Y22400
Y23400
X2000Y23350
Y22350
Y21350
Y20350
Y19350
Y18350
Y17350
Y16350
Y15350
Y14350
Y13350
Y12350
Y11350
Y10350
Y9350
Y8350
X25500Y24400
M30
