Removed Pin From Net: NetName=VBAT_LV+ Pin=C17-1
Removed Pin From Net: NetName=VBAT_LV+ Pin=C18-2
Removed Pin From Net: NetName=+5 Pin=C24-2
Removed Pin From Net: NetName=9VCAN0 Pin=D5-2
Removed Pin From Net: NetName=VBAT_LV+ Pin=IC1-2
Removed Pin From Net: NetName=VBAT_LV+ Pin=R32-2
Removed Pin From Net: NetName=+5 Pin=U4-1
Removed Pin From Net: NetName=+5 Pin=U4-3
Added Component: Designator=F1(C1206)
Add component (AddParameter): Name = "LatestRevisionDate"; Value = "17-Jul-2002"; VariantName = "[No Variations]"
Add component (AddParameter): Name = "LatestRevisionNote"; Value = "Re-released for DXP Platform."; VariantName = "[No Variations]"
Add component (AddParameter): Name = "PackageDescription"; Value = "Thru-Hole; 2 Leads"; VariantName = "[No Variations]"
Add component (AddParameter): Name = "PackageReference"; Value = "PIN-W2/E2.8"; VariantName = "[No Variations]"
Add component (AddParameter): Name = "Published"; Value = "8-Jun-2000"; VariantName = "[No Variations]"
Add component (AddParameter): Name = "Publisher"; Value = "Altium Limited"; VariantName = "[No Variations]"
Added Component: Designator=F2(C1206)
Add component (AddParameter): Name = "LatestRevisionDate"; Value = "17-Jul-2002"; VariantName = "[No Variations]"
Add component (AddParameter): Name = "LatestRevisionNote"; Value = "Re-released for DXP Platform."; VariantName = "[No Variations]"
Add component (AddParameter): Name = "PackageDescription"; Value = "Thru-Hole; 2 Leads"; VariantName = "[No Variations]"
Add component (AddParameter): Name = "PackageReference"; Value = "PIN-W2/E2.8"; VariantName = "[No Variations]"
Add component (AddParameter): Name = "Published"; Value = "8-Jun-2000"; VariantName = "[No Variations]"
Add component (AddParameter): Name = "Publisher"; Value = "Altium Limited"; VariantName = "[No Variations]"
Added Component: Designator=F3(C1206)
Add component (AddParameter): Name = "LatestRevisionDate"; Value = "17-Jul-2002"; VariantName = "[No Variations]"
Add component (AddParameter): Name = "LatestRevisionNote"; Value = "Re-released for DXP Platform."; VariantName = "[No Variations]"
Add component (AddParameter): Name = "PackageDescription"; Value = "Thru-Hole; 2 Leads"; VariantName = "[No Variations]"
Add component (AddParameter): Name = "PackageReference"; Value = "PIN-W2/E2.8"; VariantName = "[No Variations]"
Add component (AddParameter): Name = "Published"; Value = "8-Jun-2000"; VariantName = "[No Variations]"
Add component (AddParameter): Name = "Publisher"; Value = "Altium Limited"; VariantName = "[No Variations]"
Added Pin To Net: NetName=VBAT_LV+ Pin=F1-1
Added Pin To Net: NetName=+5 Pin=F2-2
Added Pin To Net: NetName=9VCAN0 Pin=F3-2
Added Pin To Net: NetName=NetC17_1 Pin=C17-1
Added Pin To Net: NetName=NetC17_1 Pin=C18-2
Added Pin To Net: NetName=NetC17_1 Pin=F1-2
Added Pin To Net: NetName=NetC17_1 Pin=IC1-2
Added Pin To Net: NetName=NetC17_1 Pin=R32-2
Added Net: Name=NetC17_1
Added Pin To Net: NetName=NetC24_2 Pin=C24-2
Added Pin To Net: NetName=NetC24_2 Pin=F2-1
Added Pin To Net: NetName=NetC24_2 Pin=U4-1
Added Pin To Net: NetName=NetC24_2 Pin=U4-3
Added Net: Name=NetC24_2
Added Member To Class: ClassName=PSU Member=Component F1 Fuse 1
Added Member To Class: ClassName=PSU Member=Component F2 Fuse 1
Added Member To Class: ClassName=PSU Member=Component F3 Fuse 1
Added Room: Name=MCU-main-board-V3
Added Room: Name=PSU
