Added Pin To Net: NetName=NetJ1_15 Pin=J1-15
Added Pin To Net: NetName=NetJ1_15 Pin=U3-27
Added Pin To Net: NetName=NetJ1_15 Pin=U5-1
Added Net: Name=NetJ1_15
Added Pin To Net: NetName=NetJ1_16 Pin=J1-16
Added Pin To Net: NetName=NetJ1_16 Pin=U3-28
Added Pin To Net: NetName=NetJ1_16 Pin=U5-4
Added Net: Name=NetJ1_16
