G04*
G04 #@! TF.GenerationSoftware,Altium Limited,Altium Designer,22.4.2 (48)*
G04*
G04 Layer_Color=8421504*
%FSLAX25Y25*%
%MOIN*%
G70*
G04*
G04 #@! TF.SameCoordinates,7DDAD634-7C5B-453E-A4F1-0B7F20BD61A3*
G04*
G04*
G04 #@! TF.FilePolarity,Positive*
G04*
G01*
G75*
%ADD16C,0.01968*%
%ADD17R,0.05709X0.03937*%
%ADD18R,0.00984X0.02559*%
%ADD19R,0.04134X0.04134*%
%ADD20R,0.02913X0.10984*%
%ADD21R,0.03937X0.03150*%
%ADD22R,0.06299X0.08661*%
%ADD23R,0.06299X0.08583*%
%ADD24R,0.03937X0.03543*%
%ADD25R,0.01575X0.05315*%
%ADD26R,0.05906X0.07480*%
G04:AMPARAMS|DCode=27|XSize=39.37mil|YSize=70.87mil|CornerRadius=3.94mil|HoleSize=0mil|Usage=FLASHONLY|Rotation=225.000|XOffset=0mil|YOffset=0mil|HoleType=Round|Shape=RoundedRectangle|*
%AMROUNDEDRECTD27*
21,1,0.03937,0.06299,0,0,225.0*
21,1,0.03150,0.07087,0,0,225.0*
1,1,0.00787,-0.03341,0.01114*
1,1,0.00787,-0.01114,0.03341*
1,1,0.00787,0.03341,-0.01114*
1,1,0.00787,0.01114,-0.03341*
%
%ADD27ROUNDEDRECTD27*%
%ADD28R,0.03150X0.03937*%
%ADD29R,0.04134X0.04134*%
%ADD30P,0.05846X4X180.0*%
G04:AMPARAMS|DCode=31|XSize=29.92mil|YSize=26mil|CornerRadius=3.25mil|HoleSize=0mil|Usage=FLASHONLY|Rotation=270.000|XOffset=0mil|YOffset=0mil|HoleType=Round|Shape=RoundedRectangle|*
%AMROUNDEDRECTD31*
21,1,0.02992,0.01950,0,0,270.0*
21,1,0.02342,0.02600,0,0,270.0*
1,1,0.00650,-0.00975,-0.01171*
1,1,0.00650,-0.00975,0.01171*
1,1,0.00650,0.00975,0.01171*
1,1,0.00650,0.00975,-0.01171*
%
%ADD31ROUNDEDRECTD31*%
%ADD32R,0.02362X0.03937*%
%ADD33R,0.02756X0.03347*%
%ADD34R,0.04206X0.04750*%
%ADD35R,0.03568X0.03366*%
%ADD36R,0.02953X0.03937*%
%ADD37R,0.04134X0.04528*%
G04:AMPARAMS|DCode=38|XSize=51.18mil|YSize=29.92mil|CornerRadius=3.74mil|HoleSize=0mil|Usage=FLASHONLY|Rotation=0.000|XOffset=0mil|YOffset=0mil|HoleType=Round|Shape=RoundedRectangle|*
%AMROUNDEDRECTD38*
21,1,0.05118,0.02244,0,0,0.0*
21,1,0.04370,0.02992,0,0,0.0*
1,1,0.00748,0.02185,-0.01122*
1,1,0.00748,-0.02185,-0.01122*
1,1,0.00748,-0.02185,0.01122*
1,1,0.00748,0.02185,0.01122*
%
%ADD38ROUNDEDRECTD38*%
%ADD39R,0.03394X0.02894*%
%ADD40R,0.03591X0.03772*%
%ADD41R,0.21260X0.11417*%
%ADD42R,0.06772X0.12598*%
%ADD43R,0.06004X0.02559*%
%ADD44R,0.03937X0.06299*%
%ADD45R,0.03681X0.03788*%
%ADD46R,0.05142X0.04166*%
G04:AMPARAMS|DCode=47|XSize=51.18mil|YSize=29.92mil|CornerRadius=3.74mil|HoleSize=0mil|Usage=FLASHONLY|Rotation=45.000|XOffset=0mil|YOffset=0mil|HoleType=Round|Shape=RoundedRectangle|*
%AMROUNDEDRECTD47*
21,1,0.05118,0.02244,0,0,45.0*
21,1,0.04370,0.02992,0,0,45.0*
1,1,0.00748,0.02339,0.00752*
1,1,0.00748,-0.00752,-0.02339*
1,1,0.00748,-0.02339,-0.00752*
1,1,0.00748,0.00752,0.02339*
%
%ADD47ROUNDEDRECTD47*%
%ADD48R,0.03740X0.04134*%
G04:AMPARAMS|DCode=49|XSize=66.93mil|YSize=39.37mil|CornerRadius=2.95mil|HoleSize=0mil|Usage=FLASHONLY|Rotation=270.000|XOffset=0mil|YOffset=0mil|HoleType=Round|Shape=RoundedRectangle|*
%AMROUNDEDRECTD49*
21,1,0.06693,0.03347,0,0,270.0*
21,1,0.06102,0.03937,0,0,270.0*
1,1,0.00591,-0.01673,-0.03051*
1,1,0.00591,-0.01673,0.03051*
1,1,0.00591,0.01673,0.03051*
1,1,0.00591,0.01673,-0.03051*
%
%ADD49ROUNDEDRECTD49*%
G04:AMPARAMS|DCode=50|XSize=31.5mil|YSize=31.5mil|CornerRadius=3.15mil|HoleSize=0mil|Usage=FLASHONLY|Rotation=270.000|XOffset=0mil|YOffset=0mil|HoleType=Round|Shape=RoundedRectangle|*
%AMROUNDEDRECTD50*
21,1,0.03150,0.02520,0,0,270.0*
21,1,0.02520,0.03150,0,0,270.0*
1,1,0.00630,-0.01260,-0.01260*
1,1,0.00630,-0.01260,0.01260*
1,1,0.00630,0.01260,0.01260*
1,1,0.00630,0.01260,-0.01260*
%
%ADD50ROUNDEDRECTD50*%
G04:AMPARAMS|DCode=51|XSize=29.92mil|YSize=26mil|CornerRadius=3.25mil|HoleSize=0mil|Usage=FLASHONLY|Rotation=180.000|XOffset=0mil|YOffset=0mil|HoleType=Round|Shape=RoundedRectangle|*
%AMROUNDEDRECTD51*
21,1,0.02992,0.01950,0,0,180.0*
21,1,0.02342,0.02600,0,0,180.0*
1,1,0.00650,-0.01171,0.00975*
1,1,0.00650,0.01171,0.00975*
1,1,0.00650,0.01171,-0.00975*
1,1,0.00650,-0.01171,-0.00975*
%
%ADD51ROUNDEDRECTD51*%
%ADD52P,0.05846X4X90.0*%
G04:AMPARAMS|DCode=53|XSize=65.14mil|YSize=110.48mil|CornerRadius=0mil|HoleSize=0mil|Usage=FLASHONLY|Rotation=135.000|XOffset=0mil|YOffset=0mil|HoleType=Round|Shape=Rectangle|*
%AMROTATEDRECTD53*
4,1,4,0.06209,0.01603,-0.01603,-0.06209,-0.06209,-0.01603,0.01603,0.06209,0.06209,0.01603,0.0*
%
%ADD53ROTATEDRECTD53*%

G04:AMPARAMS|DCode=54|XSize=51.18mil|YSize=29.92mil|CornerRadius=3.74mil|HoleSize=0mil|Usage=FLASHONLY|Rotation=135.000|XOffset=0mil|YOffset=0mil|HoleType=Round|Shape=RoundedRectangle|*
%AMROUNDEDRECTD54*
21,1,0.05118,0.02244,0,0,135.0*
21,1,0.04370,0.02992,0,0,135.0*
1,1,0.00748,-0.00752,0.02339*
1,1,0.00748,0.02339,-0.00752*
1,1,0.00748,0.00752,-0.02339*
1,1,0.00748,-0.02339,0.00752*
%
%ADD54ROUNDEDRECTD54*%
%ADD55R,0.03937X0.02953*%
G04:AMPARAMS|DCode=56|XSize=29.92mil|YSize=26mil|CornerRadius=3.25mil|HoleSize=0mil|Usage=FLASHONLY|Rotation=225.000|XOffset=0mil|YOffset=0mil|HoleType=Round|Shape=RoundedRectangle|*
%AMROUNDEDRECTD56*
21,1,0.02992,0.01950,0,0,225.0*
21,1,0.02342,0.02600,0,0,225.0*
1,1,0.00650,-0.01518,-0.00139*
1,1,0.00650,0.00139,0.01518*
1,1,0.00650,0.01518,0.00139*
1,1,0.00650,-0.00139,-0.01518*
%
%ADD56ROUNDEDRECTD56*%
%ADD57R,0.03543X0.03937*%
G04:AMPARAMS|DCode=58|XSize=58.07mil|YSize=11.81mil|CornerRadius=0mil|HoleSize=0mil|Usage=FLASHONLY|Rotation=315.000|XOffset=0mil|YOffset=0mil|HoleType=Round|Shape=Rectangle|*
%AMROTATEDRECTD58*
4,1,4,-0.02471,0.01636,-0.01636,0.02471,0.02471,-0.01636,0.01636,-0.02471,-0.02471,0.01636,0.0*
%
%ADD58ROTATEDRECTD58*%

G04:AMPARAMS|DCode=59|XSize=58.07mil|YSize=11.81mil|CornerRadius=0mil|HoleSize=0mil|Usage=FLASHONLY|Rotation=45.000|XOffset=0mil|YOffset=0mil|HoleType=Round|Shape=Rectangle|*
%AMROTATEDRECTD59*
4,1,4,-0.01636,-0.02471,-0.02471,-0.01636,0.01636,0.02471,0.02471,0.01636,-0.01636,-0.02471,0.0*
%
%ADD59ROTATEDRECTD59*%

%ADD60P,0.04733X4X90.0*%
%ADD61R,0.06704X0.10261*%
G36*
X175890Y259228D02*
X173921D01*
X173921Y262772D01*
X175890D01*
Y259228D01*
D02*
G37*
G36*
X181008Y257260D02*
X175890D01*
Y264740D01*
X181008D01*
Y257260D01*
D02*
G37*
G36*
X204236D02*
X199118D01*
Y264740D01*
X204236D01*
Y257260D01*
D02*
G37*
G36*
X206205Y259228D02*
X204236D01*
Y262772D01*
X206205D01*
X206205Y259228D01*
D02*
G37*
D16*
X176284Y260130D02*
X175351Y260052D01*
X174906Y259228D01*
X175351Y258405D01*
X176284Y258326D01*
X176874Y259228D01*
X176284Y260130D01*
X205221Y262772D02*
X204728Y263624D01*
X203744D01*
X203252Y262772D01*
X203744Y261919D01*
X204728D01*
X205221Y262772D01*
Y259228D02*
X204728Y260081D01*
X203744D01*
X203252Y259228D01*
X203744Y258376D01*
X204728D01*
X205221Y259228D01*
X176874Y262772D02*
X176382Y263624D01*
X175398D01*
X174906Y262772D01*
X175398Y261919D01*
X176382D01*
X176874Y262772D01*
D17*
X57000Y193500D02*
D03*
Y200980D02*
D03*
X142500Y235740D02*
D03*
Y228260D02*
D03*
X196500Y146260D02*
D03*
Y153740D02*
D03*
X95000Y78500D02*
D03*
Y71020D02*
D03*
X206000Y198240D02*
D03*
Y190760D02*
D03*
D18*
X194032Y240500D02*
D03*
X196000D02*
D03*
X197968D02*
D03*
Y236760D02*
D03*
X196000D02*
D03*
X194032D02*
D03*
D19*
X27343Y49000D02*
D03*
X32658D02*
D03*
X234315Y48500D02*
D03*
X229000D02*
D03*
D20*
X104000Y263512D02*
D03*
X109000D02*
D03*
X114000D02*
D03*
X119000D02*
D03*
X124000D02*
D03*
Y247488D02*
D03*
X119000D02*
D03*
X114000D02*
D03*
X109000D02*
D03*
X104000D02*
D03*
D21*
X117000Y237500D02*
D03*
Y231594D02*
D03*
X112000Y237500D02*
D03*
Y231594D02*
D03*
X97000Y254000D02*
D03*
Y248095D02*
D03*
X96000Y238500D02*
D03*
Y232594D02*
D03*
X86000Y238500D02*
D03*
Y232594D02*
D03*
X142500Y259953D02*
D03*
Y254047D02*
D03*
X91000Y238500D02*
D03*
Y232594D02*
D03*
D22*
X155500Y262591D02*
D03*
X45000Y156591D02*
D03*
D23*
X155500Y226410D02*
D03*
X45000Y120409D02*
D03*
D24*
X142500Y243441D02*
D03*
Y248559D02*
D03*
X213500Y193441D02*
D03*
Y198559D02*
D03*
D25*
X195181Y250370D02*
D03*
X192622D02*
D03*
X190063D02*
D03*
X187504D02*
D03*
X184945D02*
D03*
D26*
X194000Y261000D02*
D03*
X186126D02*
D03*
D27*
X97020Y202020D02*
D03*
X103980Y208980D02*
D03*
D28*
X64000Y139000D02*
D03*
X58095D02*
D03*
D29*
X58000Y126185D02*
D03*
Y131500D02*
D03*
X140000Y70342D02*
D03*
Y75657D02*
D03*
Y64657D02*
D03*
Y59342D02*
D03*
D30*
X118121Y131121D02*
D03*
X121879Y134879D02*
D03*
X141121Y156121D02*
D03*
X144879Y159879D02*
D03*
X85258Y197258D02*
D03*
X81500Y193500D02*
D03*
D31*
X211756Y182500D02*
D03*
X206244D02*
D03*
X212256Y162000D02*
D03*
X206744D02*
D03*
D32*
X206760Y176724D02*
D03*
X214240D02*
D03*
Y167276D02*
D03*
X210500D02*
D03*
X206760D02*
D03*
D33*
X184972Y145500D02*
D03*
X189500D02*
D03*
X147961Y54000D02*
D03*
X143039D02*
D03*
D34*
X153000Y65251D02*
D03*
Y58749D02*
D03*
D35*
X160000Y59537D02*
D03*
Y64463D02*
D03*
X95500Y52926D02*
D03*
Y48000D02*
D03*
D36*
X170953Y60000D02*
D03*
X165047D02*
D03*
X181000Y239500D02*
D03*
X186906D02*
D03*
D37*
X95000Y90193D02*
D03*
Y83500D02*
D03*
D38*
X103000Y64000D02*
D03*
Y71047D02*
D03*
X182500Y194996D02*
D03*
Y202043D02*
D03*
D39*
X95500Y63846D02*
D03*
Y59000D02*
D03*
D40*
X103000Y47138D02*
D03*
Y52862D02*
D03*
D41*
X173500Y76012D02*
D03*
Y114988D02*
D03*
D42*
X110264Y90500D02*
D03*
X135500D02*
D03*
D43*
X132677Y69500D02*
D03*
Y64500D02*
D03*
Y59500D02*
D03*
Y54500D02*
D03*
X111323D02*
D03*
Y59500D02*
D03*
Y64500D02*
D03*
Y69500D02*
D03*
D44*
X70000Y53000D02*
D03*
X60158D02*
D03*
X50315D02*
D03*
X70000Y43551D02*
D03*
X60158D02*
D03*
X50315D02*
D03*
X191157Y43500D02*
D03*
X201000D02*
D03*
X210842D02*
D03*
X191157Y52949D02*
D03*
X201000D02*
D03*
X210842D02*
D03*
D45*
X32867Y53500D02*
D03*
X38500D02*
D03*
X32500Y43000D02*
D03*
X38133D02*
D03*
X223000Y53500D02*
D03*
X228633D02*
D03*
X223500Y43000D02*
D03*
X229133D02*
D03*
D46*
X190945Y195000D02*
D03*
X197055D02*
D03*
D47*
X174978Y193522D02*
D03*
X169994Y198505D02*
D03*
D48*
X181146Y232000D02*
D03*
X186854D02*
D03*
D49*
X206000Y233441D02*
D03*
X206500Y155059D02*
D03*
D50*
X206000Y240331D02*
D03*
X206500Y148169D02*
D03*
D51*
X174000Y240012D02*
D03*
Y234500D02*
D03*
D52*
X148621Y199879D02*
D03*
X152379Y196121D02*
D03*
D53*
X137030Y195469D02*
D03*
X144969Y187531D02*
D03*
D54*
X150978Y179978D02*
D03*
X145994Y174995D02*
D03*
D55*
X58000Y147095D02*
D03*
Y153000D02*
D03*
D56*
X84949Y148551D02*
D03*
X81051Y152449D02*
D03*
D57*
X65000Y196000D02*
D03*
X70118D02*
D03*
D58*
X103966Y194413D02*
D03*
X102574Y193022D02*
D03*
X101182Y191630D02*
D03*
X99790Y190238D02*
D03*
X98398Y188846D02*
D03*
X97006Y187454D02*
D03*
X95614Y186062D02*
D03*
X94222Y184670D02*
D03*
X92830Y183278D02*
D03*
X91438Y181886D02*
D03*
X90046Y180494D02*
D03*
X88654Y179102D02*
D03*
X87262Y177710D02*
D03*
X85870Y176318D02*
D03*
X84478Y174926D02*
D03*
X83087Y173534D02*
D03*
X115034Y141586D02*
D03*
X116426Y142978D02*
D03*
X117818Y144370D02*
D03*
X119210Y145762D02*
D03*
X120602Y147154D02*
D03*
X121994Y148546D02*
D03*
X123386Y149938D02*
D03*
X124778Y151330D02*
D03*
X126170Y152722D02*
D03*
X127562Y154114D02*
D03*
X128954Y155506D02*
D03*
X130346Y156898D02*
D03*
X131738Y158290D02*
D03*
X133130Y159682D02*
D03*
X134522Y161074D02*
D03*
X135914Y162466D02*
D03*
D59*
X83087D02*
D03*
X84478Y161074D02*
D03*
X85870Y159682D02*
D03*
X87262Y158290D02*
D03*
X88654Y156898D02*
D03*
X90046Y155506D02*
D03*
X91438Y154114D02*
D03*
X92830Y152722D02*
D03*
X94222Y151330D02*
D03*
X95614Y149938D02*
D03*
X97006Y148546D02*
D03*
X98398Y147154D02*
D03*
X99790Y145762D02*
D03*
X101182Y144370D02*
D03*
X102574Y142978D02*
D03*
X103966Y141586D02*
D03*
X135914Y173534D02*
D03*
X134522Y174926D02*
D03*
X133130Y176318D02*
D03*
X131738Y177710D02*
D03*
X130346Y179102D02*
D03*
X128954Y180494D02*
D03*
X127562Y181886D02*
D03*
X126170Y183278D02*
D03*
X124778Y184670D02*
D03*
X123386Y186062D02*
D03*
X121994Y187454D02*
D03*
X120602Y188846D02*
D03*
X119210Y190238D02*
D03*
X117818Y191630D02*
D03*
X116426Y193022D02*
D03*
X115034Y194413D02*
D03*
D60*
X88899Y210101D02*
D03*
X92101Y206899D02*
D03*
X95899Y216601D02*
D03*
X99101Y213399D02*
D03*
D61*
X214773Y140000D02*
D03*
X206500D02*
D03*
X214773Y127500D02*
D03*
X206500D02*
D03*
X214636Y114500D02*
D03*
X206364D02*
D03*
M02*
