M48
;Layer_Color=9474304
;FILE_FORMAT=2:4
INCH,TZ
;TYPE=PLATED
T1F00S00C0.0118
T2F00S00C0.0197
T3F00S00C0.0315
T4F00S00C0.0394
T5F00S00C0.0402
T6F00S00C0.0437
T7F00S00C0.0453
T8F00S00C0.0700
;TYPE=NON_PLATED
T9F00S00C0.0472
%
T01
X23350Y7900
T02
X19040Y8050
X18934Y9350
X10660Y23290
X8100Y21950
X7250
X6450Y21932
X6100Y21000
X5550Y19950
X6300Y19450
T03
X4163Y4700
X4950
X5738
X6525
X7313
X8100
X8887
X9675
X10462
X12900Y4750
X13687
X16100
X16887
X19300
X20087
X20875
X21047Y23723
X21835
X22622
X23409
X18559Y23773
X17772
X16985
X16197
X13709
X12922
X12135
X9625Y23700
X8837
X8050
X7263
X6475
X5688
X4900
X4113
T04
X23250Y3200
X24037
X24825
X25612
T05
X1969Y6591
Y7591
Y8591
Y9591
Y10591
Y11591
Y12591
Y13591
Y14591
Y15591
X25591
Y14591
Y13591
Y12591
Y11591
Y10591
Y9591
Y8591
Y7591
Y6591
Y16591
Y17591
Y18591
Y19591
Y20591
Y21591
Y22591
Y23591
Y24591
Y25591
X1969
Y24591
Y23591
Y22591
Y21591
Y20591
Y19591
Y18591
Y17591
Y16591
T06
X7200Y12100
X8200
X9200
X10200
X11200
X12200
X13200
X14200
X15200
X16200
X17200
X18200
X19200
X20200
X21200
Y18100
X20200
X19200
X18200
X17200
X16200
X15200
X14200
X13200
X12200
X11200
X10200
X9200
X8200
X7200
T07
X7200Y10400
X8200
X9200
X10200
X11200
X12200
X13200
X14200
X15200
X16200
X17200
X18200
X19200
X20200
X21200
Y19300
X20200
X19200
X18200
X17200
X16200
X15200
X14200
X13200
X12200
X11200
X10200
X9200
X8200
X7200
T08
X6200Y12100
X22200
Y18100
X6200
T09
X3572Y3873
X11053
X12309Y3923
X14278
X15509
X17478
X18709
X21465
X20457Y24550
X19150Y24600
X24000Y24550
X15607Y24600
X14300
X11544
X10215Y24527
X3522
M30
