Removed Pin From Net: NetName=SDA_0 Pin=J9-21
Removed Pin From Net: NetName=SCL_0 Pin=J9-22
Removed Pin From Net: NetName=GND Pin=J9-23
Removed Pin From Net: NetName=GND Pin=J9-24
Change Component Footprint: Designator=J9 Old Footprint=SHDR24W80P0X254_1X24_6146X254X850P New Footprint=RHDR20W80P0X254_1X20_5130X254X880P
Change Component Comment : Designator=J9 Old Comment=PPPC241LFBN-RC New Comment=PPPC201LFBN-RC
Change component parameters: Designator = "J9" ("J9"); Footprint = "SHDR24W80P0X254_1X24_6146X254X850P"; UniqueID = "\WNCLVSTT" ("\WNCLVSTT")
Change component parameters (AddParameter): Name = "Arrow Part Number"; Value = ""; VariantName = "[No Variations]"
Change component parameters (AddParameter): Name = "Arrow Price/Stock"; Value = ""; VariantName = "[No Variations]"
Change component parameters (AddParameter): Name = "Datasheet Link"; Value = "https://media.digikey.com/pdf/Data%20Sheets/Sullins%20PDFs/Female_Headers.100_DS.pdf"; VariantName = "[No Variations]"
Change component parameters (AddParameter): Name = "Height"; Value = "8.8mm"; VariantName = "[No Variations]"
Change component parameters (AddParameter): Name = "Manufacturer_Name"; Value = "Sullins"; VariantName = "[No Variations]"
Change component parameters (AddParameter): Name = "Manufacturer_Part_Number"; Value = "PPPC201LFBN-RC"; VariantName = "[No Variations]"
Change component parameters (AddParameter): Name = "Mouser Part Number"; Value = ""; VariantName = "[No Variations]"
Change component parameters (AddParameter): Name = "Mouser Price/Stock"; Value = ""; VariantName = "[No Variations]"
Added Component: Designator=J16(RHDR4W80P0X254_1X4_1066X254X850P)
Add component (AddParameter): Name = "Arrow Part Number"; Value = ""; VariantName = "[No Variations]"
Add component (AddParameter): Name = "Arrow Price/Stock"; Value = ""; VariantName = "[No Variations]"
Add component (AddParameter): Name = "Datasheet Link"; Value = "https://drawings-pdf.s3.amazonaws.com/10492.pdf"; VariantName = "[No Variations]"
Add component (AddParameter): Name = "Height"; Value = "8.5mm"; VariantName = "[No Variations]"
Add component (AddParameter): Name = "Manufacturer_Name"; Value = "Sullins"; VariantName = "[No Variations]"
Add component (AddParameter): Name = "Manufacturer_Part_Number"; Value = "PPPC041LFBN-RC"; VariantName = "[No Variations]"
Add component (AddParameter): Name = "Mouser Part Number"; Value = ""; VariantName = "[No Variations]"
Add component (AddParameter): Name = "Mouser Price/Stock"; Value = ""; VariantName = "[No Variations]"
Added Pin To Net: NetName=SDA_0 Pin=J16-1
Added Pin To Net: NetName=SCL_0 Pin=J16-2
Added Pin To Net: NetName=GND Pin=J16-3
Added Pin To Net: NetName=GND Pin=J16-4
Added Member To Class: ClassName=MCU-main-board-V3 Member=Component J16 PPPC041LFBN-RC
Added Room: Name=MCU-main-board-V3
Added Room: Name=PSU
