[2022-10-23 15:34:09,804][PeerSampler][INFO] Rank: -1
[2022-10-23 15:34:09,804][PeerSampler][INFO] type(graph): <class 'int'>
[2022-10-23 15:34:09,804][PeerSampler][INFO] type(mapping): <class 'decentralizepy.mappings.Linear.Linear'>
[2022-10-23 15:34:09,834][Node][INFO] Sending connection request to all neighbors
[2022-10-23 15:34:09,834][Node][INFO] Sending connection request to 0
[2022-10-23 15:34:09,835][TCP][INFO] Sent message size: 49
[2022-10-23 15:34:09,835][Node][INFO] Sending connection request to 1
[2022-10-23 15:34:09,835][TCP][INFO] Sent message size: 49
[2022-10-23 15:34:09,836][Node][INFO] Sending connection request to 2
[2022-10-23 15:34:09,836][TCP][INFO] Sent message size: 49
[2022-10-23 15:34:09,836][Node][INFO] Sending connection request to 3
[2022-10-23 15:34:09,837][TCP][INFO] Sent message size: 49
[2022-10-23 15:34:09,837][Node][INFO] Waiting HELLO from 0
[2022-10-23 15:34:25,452][Node][INFO] Received some message from 1 with CHANNEL: CONNECT
[2022-10-23 15:34:25,452][Node][INFO] Received HELLO from 1
[2022-10-23 15:34:25,452][Node][INFO] Waiting HELLO from 0
[2022-10-23 15:34:25,452][Node][INFO] Received some message from 2 with CHANNEL: CONNECT
[2022-10-23 15:34:25,452][Node][INFO] Received HELLO from 2
[2022-10-23 15:34:25,452][Node][INFO] Waiting HELLO from 0
[2022-10-23 15:34:25,454][Node][INFO] Received some message from 1 with CHANNEL: LABEL_DIST
[2022-10-23 15:34:25,455][Node][INFO] Received some message from 2 with CHANNEL: LABEL_DIST
[2022-10-23 15:34:25,493][Node][INFO] Received some message from 3 with CHANNEL: CONNECT
[2022-10-23 15:34:25,493][Node][INFO] Received HELLO from 3
[2022-10-23 15:34:25,493][Node][INFO] Waiting HELLO from 0
[2022-10-23 15:34:25,496][Node][INFO] Received some message from 3 with CHANNEL: LABEL_DIST
[2022-10-23 15:34:25,525][Node][INFO] Received some message from 1 with CHANNEL: SERVER_REQUEST
[2022-10-23 15:34:25,528][Node][INFO] Received some message from 2 with CHANNEL: SERVER_REQUEST
[2022-10-23 15:34:25,578][Node][INFO] Received some message from 0 with CHANNEL: CONNECT
[2022-10-23 15:34:25,579][Node][INFO] Received HELLO from 0
[2022-10-23 15:34:25,579][PeerSampler][INFO] Labels received from 1: {1: 2343, 2: 5000, 3: 5000, 4: 157}
[2022-10-23 15:34:25,579][PeerSampler][INFO] Labels received from 2: {0: 4755, 1: 2657, 4: 4843, 5: 245}
[2022-10-23 15:34:25,579][PeerSampler][INFO] Labels received from 3: {0: 245, 5: 3638, 8: 3617, 9: 5000}
[2022-10-23 15:34:25,601][Node][INFO] Received some message from 3 with CHANNEL: SERVER_REQUEST
[2022-10-23 15:34:25,604][Node][INFO] Received some message from 0 with CHANNEL: LABEL_DIST
[2022-10-23 15:34:25,604][PeerSampler][INFO] Labels received from 0: {5: 1117, 6: 5000, 7: 5000, 8: 1383}
[2022-10-23 15:34:25,604][PeerSampler][INFO] Gathered all labels from nodes
[2022-10-23 15:34:25,604][TCP][INFO] Sent message size: 56
[2022-10-23 15:34:25,604][TCP][INFO] Sent message size: 56
[2022-10-23 15:34:25,604][TCP][INFO] Sent message size: 56
[2022-10-23 15:34:25,651][Node][INFO] Received some message from 0 with CHANNEL: SERVER_REQUEST
[2022-10-23 15:34:25,651][TCP][INFO] Sent message size: 56
[2022-10-23 15:34:25,729][Node][INFO] Received some message from 3 with CHANNEL: SERVER_REQUEST
[2022-10-23 15:34:25,729][TCP][INFO] Sent message size: 56
[2022-10-23 15:34:25,730][Node][INFO] Received some message from 2 with CHANNEL: SERVER_REQUEST
[2022-10-23 15:34:25,730][TCP][INFO] Sent message size: 56
[2022-10-23 15:34:25,731][Node][INFO] Received some message from 1 with CHANNEL: SERVER_REQUEST
[2022-10-23 15:34:25,731][TCP][INFO] Sent message size: 56
[2022-10-23 15:34:25,733][Node][INFO] Received some message from 0 with CHANNEL: SERVER_REQUEST
[2022-10-23 15:34:25,734][TCP][INFO] Sent message size: 56
[2022-10-23 15:34:25,822][Node][INFO] Received some message from 3 with CHANNEL: SERVER_REQUEST
[2022-10-23 15:34:25,822][TCP][INFO] Sent message size: 56
[2022-10-23 15:34:25,826][Node][INFO] Received some message from 0 with CHANNEL: SERVER_REQUEST
[2022-10-23 15:34:25,827][TCP][INFO] Sent message size: 56
[2022-10-23 15:34:25,829][Node][INFO] Received some message from 1 with CHANNEL: SERVER_REQUEST
[2022-10-23 15:34:25,829][TCP][INFO] Sent message size: 56
[2022-10-23 15:34:25,833][Node][INFO] Received some message from 2 with CHANNEL: SERVER_REQUEST
[2022-10-23 15:34:25,834][TCP][INFO] Sent message size: 56
