####
#
# OBJ File Generated by Meshlab
#
####
# Object Deport.obj
#
# Vertices: 856
# Faces: 1724
#
####
v 25.871565 11.459017 2.000000
v 32.386318 8.171574 2.000000
v 25.811516 11.603991 2.000000
v 25.729527 11.737785 2.000000
v 25.229527 12.101057 2.000000
v 25.374500 12.041007 2.000000
v 19.270510 19.530197 2.000000
v 25.508295 11.959017 2.000000
v 25.627617 11.857107 2.000000
v 25.508295 4.040983 2.000000
v 25.374500 3.958994 2.000000
v 32.386318 2.000000 2.000000
v 25.229527 3.898943 2.000000
v 6.154700 2.000000 2.000000
v 13.464074 3.862312 2.000000
v 13.311492 3.898943 2.000000
v 13.311492 12.101057 2.000000
v 13.464074 12.137689 2.000000
v 13.620509 12.150001 2.000000
v 25.908197 11.306435 2.000000
v 25.920509 11.150001 2.000000
v 25.920509 4.850000 2.000000
v 25.908197 4.693566 2.000000
v 25.871565 4.540983 2.000000
v 25.811516 4.396009 2.000000
v 25.729527 4.262215 2.000000
v 25.627617 4.142893 2.000000
v 25.076944 3.862312 2.000000
v 24.920509 3.850000 2.000000
v 13.620509 3.850000 2.000000
v 13.166519 3.958994 2.000000
v 13.032724 4.040983 2.000000
v 12.913403 4.142893 2.000000
v 12.811493 4.262215 2.000000
v 12.729504 4.396009 2.000000
v 12.669454 4.540983 2.000000
v 24.920509 12.150001 2.000000
v 25.076944 12.137689 2.000000
v 12.632821 11.306435 2.000000
v 12.669454 11.459017 2.000000
v 6.154700 8.171574 2.000000
v 12.729504 11.603991 2.000000
v 12.811493 11.737785 2.000000
v 12.632821 4.693566 2.000000
v 12.620509 4.850000 2.000000
v 12.620509 11.150001 2.000000
v 12.913403 11.857107 2.000000
v 13.032724 11.959017 2.000000
v 13.166519 12.041007 2.000000
v 6.511352 12.535534 10.110184
v 6.623724 13.242641 11.329762
v 9.511352 12.535534 4.914032
v 10.623724 13.242641 4.401559
v 10.521772 13.132026 4.356913
v 6.400210 12.921621 11.074862
v 6.359272 12.827014 10.956553
v 6.337157 12.742641 10.826110
v 6.458962 13.024133 11.178122
v 6.534084 13.132026 11.263792
v 6.440674 12.544240 10.250013
v 6.386815 12.570143 10.395104
v 10.410019 13.024133 4.334692
v 10.291216 12.921621 4.335441
v 10.168289 12.827014 4.359142
v 9.805092 12.612604 4.559399
v 9.922197 12.670579 4.472517
v 10.044265 12.742641 4.405212
v 9.695831 12.570143 4.663719
v 9.597108 12.544240 4.782907
v 6.351101 12.612604 10.541886
v 6.334412 12.670579 10.686743
v 12.542613 11.496580 3.242678
v 12.848469 11.828427 3.376615
v 10.064792 9.810932 4.163094
v 9.768621 9.733224 4.520661
v 6.848468 11.828427 13.768920
v 6.579548 11.496580 13.571010
v 6.511352 9.707108 10.110184
v 6.354184 11.172904 13.313999
v 6.177926 10.865368 13.004217
v 6.055113 10.581547 12.649291
v 5.988770 10.328428 12.257961
v 5.980532 10.112244 11.839863
v 9.511352 9.707108 4.914032
v 6.030600 9.938317 11.405291
v 6.137741 9.810932 10.964946
v 6.299318 9.733224 10.529671
v 10.392570 9.938317 3.850134
v 11.850945 10.865368 3.178259
v 12.207354 11.172904 3.176012
v 10.743888 10.112244 3.589489
v 11.110090 10.328428 3.387574
v 11.482164 10.581547 3.249363
v 29.029667 12.535534 4.914032
v 27.917295 13.242641 4.401559
v 32.029667 12.535534 10.110184
v 31.917295 13.242641 11.329762
v 32.006935 13.132026 11.263792
v 28.943911 12.544240 4.782907
v 28.845188 12.570143 4.663719
v 28.735928 12.612604 4.559399
v 32.082058 13.024133 11.178122
v 32.140812 12.921621 11.074862
v 32.181747 12.827014 10.956553
v 32.206608 12.670579 10.686743
v 32.189919 12.612604 10.541886
v 32.154202 12.570143 10.395104
v 28.496754 12.742641 4.405212
v 28.372730 12.827014 4.359142
v 28.249804 12.921621 4.335441
v 32.203861 12.742641 10.826110
v 32.100346 12.544240 10.250013
v 28.618822 12.670579 4.472517
v 28.131001 13.024133 4.334692
v 28.019245 13.132026 4.356913
v 26.333666 11.172904 3.176012
v 29.029667 9.707108 4.914032
v 25.998405 11.496580 3.242678
v 25.692551 11.828427 3.376615
v 32.241703 9.733224 10.529671
v 32.403278 9.810932 10.964946
v 31.692549 11.828427 13.768920
v 26.690073 10.865368 3.178259
v 27.058855 10.581547 3.249363
v 28.772398 9.733224 4.520661
v 27.797131 10.112244 3.589489
v 28.148449 9.938317 3.850134
v 28.476227 9.810932 4.163094
v 32.029667 9.707108 10.110184
v 27.430929 10.328428 3.387574
v 32.510418 9.938317 11.405291
v 32.560486 10.112244 11.839863
v 32.552250 10.328428 12.257961
v 32.485905 10.581547 12.649291
v 32.363094 10.865368 13.004217
v 32.186836 11.172904 13.313999
v 31.961472 11.496580 13.571010
v 15.961493 12.570143 26.978931
v 16.114075 12.544240 27.004835
v 15.270509 13.242641 26.306435
v 16.270510 12.535534 27.013540
v 23.270510 13.242641 26.306435
v 22.270510 12.535534 27.013540
v 15.282821 13.132026 26.417051
v 15.319453 13.024133 26.524942
v 15.379503 12.921621 26.627455
v 15.563402 12.742641 26.806435
v 15.682723 12.670579 26.878494
v 15.816519 12.612604 26.936472
v 22.858295 12.670579 26.878494
v 22.724501 12.612604 26.936472
v 22.426945 12.544240 27.004835
v 22.579527 12.570143 26.978931
v 15.461493 12.827014 26.722063
v 22.977617 12.742641 26.806435
v 23.079525 12.827014 26.722063
v 23.161516 12.921621 26.627455
v 23.221565 13.024133 26.524942
v 23.258198 13.132026 26.417051
v 25.233574 11.496580 25.224068
v 25.123678 11.172904 25.547745
v 24.943529 10.865368 25.855280
v 24.391830 10.328428 26.392221
v 24.033865 10.112244 26.608404
v 25.270510 11.828427 24.892221
v 23.632483 9.938317 26.782330
v 23.197561 9.810932 26.909716
v 16.270510 9.707108 27.013540
v 13.270510 11.828427 24.892221
v 22.270510 9.707108 27.013540
v 22.739813 9.733224 26.987425
v 24.697561 10.581547 26.139103
v 13.597490 10.865368 25.855280
v 13.417340 11.172904 25.547745
v 13.307445 11.496580 25.224068
v 14.149189 10.328428 26.392221
v 15.343458 9.810932 26.909716
v 14.507154 10.112244 26.608404
v 14.908538 9.938317 26.782330
v 15.801207 9.733224 26.987425
v 13.843458 10.581547 26.139103
v 22.270510 20.000000 17.012585
v 23.270510 20.000000 16.012585
v 16.270510 20.000000 17.012585
v 15.270509 20.000000 16.012585
v 23.161516 20.000000 16.466578
v 23.221565 20.000000 16.321604
v 23.258198 20.000000 16.169020
v 22.858295 20.000000 16.821602
v 22.977617 20.000000 16.719692
v 22.724501 20.000000 16.903593
v 22.579527 20.000000 16.963642
v 22.426945 20.000000 17.000273
v 23.079525 20.000000 16.600370
v 15.282821 20.000000 16.169020
v 15.319453 20.000000 16.321604
v 15.379503 20.000000 16.466578
v 15.961493 20.000000 16.963642
v 15.563402 20.000000 16.719692
v 15.816519 20.000000 16.903593
v 15.682723 20.000000 16.821602
v 15.461493 20.000000 16.600370
v 16.114075 20.000000 17.000273
v 23.632483 18.000002 18.685606
v 23.197561 18.000002 18.865755
v 25.270510 18.000002 16.012585
v 16.270510 18.000002 19.012585
v 13.270510 18.000002 16.012585
v 22.270510 18.000002 19.012585
v 22.739813 18.000002 18.975651
v 24.033865 18.000002 18.439636
v 25.233574 18.000002 16.481890
v 25.123678 18.000002 16.939636
v 24.943529 18.000002 17.374556
v 24.697561 18.000002 17.775942
v 24.391830 18.000002 18.133905
v 13.597490 18.000002 17.374556
v 13.417340 18.000002 16.939636
v 13.307445 18.000002 16.481890
v 15.801207 18.000002 18.975651
v 15.343458 18.000002 18.865755
v 14.908538 18.000002 18.685606
v 14.507154 18.000002 18.439636
v 14.149189 18.000002 18.133905
v 13.843458 18.000002 17.775942
v 15.682723 22.000000 11.203568
v 19.270510 22.000000 1.282752
v 15.563402 22.000000 11.305478
v 15.461493 22.000000 11.424800
v 22.858295 22.000000 11.203568
v 22.977617 22.000000 11.305478
v 30.294868 22.000000 20.377502
v 23.258198 22.000000 11.856151
v 23.270510 22.000000 12.012585
v 23.221565 22.000000 16.321604
v 23.161516 22.000000 16.466578
v 23.079525 22.000000 16.600370
v 22.977617 22.000000 16.719692
v 22.858295 22.000000 16.821602
v 22.724501 22.000000 16.903593
v 22.579527 22.000000 16.963642
v 15.682723 22.000000 16.821602
v 15.563402 22.000000 16.719692
v 8.246150 22.000000 20.377502
v 15.461493 22.000000 16.600370
v 15.379503 22.000000 16.466578
v 15.319453 22.000000 16.321604
v 15.282821 22.000000 16.169020
v 15.270509 22.000000 16.012585
v 15.379503 22.000000 11.558595
v 15.319453 22.000000 11.703568
v 15.816519 22.000000 11.121578
v 15.961493 22.000000 11.061529
v 16.114075 22.000000 11.024897
v 23.270510 22.000000 16.012585
v 23.258198 22.000000 16.169020
v 16.114075 22.000000 17.000273
v 15.961493 22.000000 16.963642
v 15.816519 22.000000 16.903593
v 15.270509 22.000000 12.012585
v 15.282821 22.000000 11.856151
v 22.426945 22.000000 17.000273
v 22.270510 22.000000 17.012585
v 16.270510 22.000000 17.012585
v 22.426945 22.000000 11.024897
v 22.579527 22.000000 11.061529
v 22.724501 22.000000 11.121578
v 23.079525 22.000000 11.424800
v 23.161516 22.000000 11.558595
v 23.221565 22.000000 11.703568
v 16.270510 22.000000 11.012586
v 22.270510 22.000000 11.012586
v 5.000000 9.000001 0.000000
v 5.000000 0.000000 0.000000
v 0.000000 9.000001 8.660254
v 0.000000 0.000000 8.660254
v 14.270510 9.000001 33.377502
v 7.135254 21.358624 21.018877
v 14.270510 0.000000 33.377502
v 24.270508 9.000001 33.377502
v 24.270508 0.000000 33.377502
v 38.541019 9.000001 8.660254
v 31.405766 21.358624 21.018877
v 38.541019 0.000000 8.660254
v 33.541019 9.000001 0.000000
v 33.541019 0.000000 0.000000
v 14.120510 10.650001 0.000000
v 19.270510 21.358624 0.000000
v 24.420509 10.650001 0.000000
v 24.420509 5.350000 0.000000
v 14.120510 5.350000 0.000000
v 16.270510 13.949748 28.427753
v 22.270510 13.949748 28.427753
v 22.426945 13.958453 28.419050
v 16.114075 13.958453 28.419050
v 15.961493 13.984356 28.393147
v 15.816519 14.026818 28.350685
v 15.682723 14.084794 28.292707
v 15.563402 14.156855 28.220648
v 15.461493 14.241228 28.136276
v 15.270509 17.485281 24.892221
v 15.282821 17.595896 24.781605
v 15.563402 17.985283 24.392221
v 15.682723 18.057343 24.320160
v 15.816519 18.115320 24.262184
v 15.961493 18.157780 24.219721
v 15.270509 14.656855 27.720650
v 15.379503 14.335835 28.041668
v 15.319453 14.438347 27.939156
v 15.282821 14.546239 27.831264
v 23.221565 17.703791 24.673712
v 23.258198 17.595896 24.781605
v 15.319453 17.703791 24.673712
v 15.379503 17.806301 24.571201
v 15.461493 17.900908 24.476593
v 23.258198 14.546239 27.831264
v 23.221565 14.438347 27.939156
v 23.161516 14.335835 28.041668
v 22.426945 18.183681 24.193819
v 22.579527 18.157780 24.219721
v 22.724501 18.115320 24.262184
v 22.858295 18.057343 24.320160
v 23.270510 17.485281 24.892221
v 23.270510 14.656855 27.720650
v 23.079525 14.241228 28.136276
v 22.977617 14.156855 28.220648
v 22.858295 14.084794 28.292707
v 16.114075 18.183681 24.193819
v 16.270510 18.192389 24.185114
v 22.270510 18.192389 24.185114
v 22.977617 17.985283 24.392221
v 23.079525 17.900908 24.476593
v 23.161516 17.806301 24.571201
v 22.724501 14.026818 28.350685
v 22.579527 13.984356 28.393147
v 23.270510 16.071068 23.478006
v 23.258198 16.181683 23.367390
v 23.221565 16.289576 23.259499
v 23.161516 16.392088 23.156988
v 23.079525 16.486694 23.062380
v 22.977617 16.571068 22.978008
v 22.858295 16.643129 22.905945
v 22.724501 16.701103 22.847969
v 22.579527 16.743567 22.805508
v 22.426945 16.769468 22.779606
v 22.270510 16.778175 22.770901
v 15.270509 16.071068 23.478006
v 16.270510 16.778175 22.770901
v 16.114075 16.769468 22.779606
v 15.961493 16.743567 22.805508
v 15.816519 16.701103 22.847969
v 15.682723 16.643129 22.905945
v 15.563402 16.571068 22.978008
v 15.461493 16.486694 23.062380
v 15.379503 16.392088 23.156988
v 15.319453 16.289576 23.259499
v 15.282821 16.181683 23.367390
v 26.509499 18.183681 6.188416
v 26.455641 18.157780 6.043324
v 26.419926 18.115320 5.896542
v 26.403236 18.057343 5.751685
v 30.478844 17.703791 12.103737
v 30.360043 17.806301 12.102987
v 29.721498 14.156855 3.698106
v 29.597477 14.241228 3.652035
v 29.474548 14.335835 3.628334
v 26.405985 17.985283 5.612319
v 26.428099 17.900908 5.481875
v 30.237116 17.900908 12.079287
v 30.113091 17.985283 12.033216
v 29.991024 18.057343 11.965912
v 29.873919 18.115320 11.879029
v 29.764658 18.157780 11.774710
v 26.469034 17.806301 5.363567
v 26.527788 17.703791 5.260306
v 26.602909 17.595896 5.174636
v 29.243990 14.546239 3.649806
v 29.355745 14.438347 3.627585
v 29.843567 14.084794 3.765411
v 29.960672 14.026818 3.852292
v 30.069933 13.984356 3.956612
v 33.431351 14.084794 9.979636
v 33.428604 14.156855 10.119002
v 33.406494 14.241228 10.249446
v 29.665934 18.183681 11.655520
v 29.580177 18.192389 11.524398
v 26.580177 18.192389 6.328245
v 26.692551 17.485281 5.108665
v 29.142040 14.656855 3.694452
v 33.325092 13.958453 9.542907
v 33.378952 13.984356 9.687998
v 33.414661 14.026818 9.834780
v 30.168655 13.958453 4.075801
v 30.254412 13.949748 4.206925
v 33.254410 13.949748 9.403077
v 33.365555 14.335835 10.367755
v 33.306801 14.438347 10.471015
v 33.231678 14.546239 10.556685
v 33.142036 14.656855 10.622656
v 30.692551 17.485281 12.036869
v 30.590597 17.595896 12.081515
v 5.126356 14.026818 9.834780
v 5.162070 13.984356 9.687998
v 5.109667 14.084794 9.979636
v 8.372364 13.958453 4.075801
v 8.471087 13.984356 3.956612
v 8.580347 14.026818 3.852292
v 5.215929 13.958453 9.542907
v 5.286607 13.949748 9.403077
v 8.286607 13.949748 4.206925
v 8.697452 14.084794 3.765411
v 8.819520 14.156855 3.698106
v 8.943543 14.241228 3.652035
v 11.938109 17.595896 5.174636
v 11.848469 17.485281 5.108665
v 9.398979 14.656855 3.694452
v 12.135035 17.985283 5.612319
v 12.137782 18.057343 5.751685
v 12.121093 18.115320 5.896542
v 12.085379 18.157780 6.043324
v 8.875085 18.183681 11.655520
v 8.776361 18.157780 11.774710
v 8.667101 18.115320 11.879029
v 8.549995 18.057343 11.965912
v 8.180977 17.806301 12.102987
v 8.303904 17.900908 12.079287
v 8.427928 17.985283 12.033216
v 9.066471 14.335835 3.628334
v 9.185274 14.438347 3.627585
v 9.297028 14.546239 3.649806
v 12.013230 17.703791 5.260306
v 12.071984 17.806301 5.363567
v 12.112921 17.900908 5.481875
v 12.031520 18.183681 6.188416
v 11.960842 18.192389 6.328245
v 8.960841 18.192389 11.524398
v 8.062175 17.703791 12.103737
v 7.950420 17.595896 12.081515
v 7.848469 17.485281 12.036869
v 5.175465 14.335835 10.367755
v 5.134528 14.241228 10.249446
v 5.112413 14.156855 10.119002
v 5.398979 14.656855 10.622656
v 5.309339 14.546239 10.556685
v 5.234217 14.438347 10.471015
v 25.467806 16.071068 5.815773
v 25.378164 16.181683 5.881742
v 25.303043 16.289576 5.967413
v 25.244289 16.392088 6.070673
v 25.203352 16.486694 6.188982
v 25.181240 16.571068 6.319426
v 25.178492 16.643129 6.458792
v 25.195181 16.701103 6.603649
v 25.230896 16.743567 6.750431
v 25.284756 16.769468 6.895523
v 25.355433 16.778175 7.035352
v 29.467806 16.071068 12.743976
v 28.355433 16.778175 12.231504
v 28.441191 16.769468 12.362627
v 28.539913 16.743567 12.481816
v 28.649174 16.701103 12.586137
v 28.766277 16.643129 12.673018
v 28.888344 16.571068 12.740323
v 29.012371 16.486694 12.786393
v 29.135298 16.392088 12.810095
v 29.254101 16.289576 12.810844
v 29.365852 16.181683 12.788622
v 9.073214 16.071068 12.743976
v 9.175165 16.181683 12.788622
v 9.286919 16.289576 12.810844
v 9.405722 16.392088 12.810095
v 9.528649 16.486694 12.786393
v 9.652674 16.571068 12.740323
v 9.774741 16.643129 12.673018
v 9.891847 16.701103 12.586137
v 10.001106 16.743567 12.481816
v 10.099829 16.769468 12.362627
v 10.185586 16.778175 12.231504
v 13.073214 16.071068 5.815773
v 13.185587 16.778175 7.035352
v 13.256264 16.769468 6.895523
v 13.310123 16.743567 6.750431
v 13.345837 16.701103 6.603649
v 13.362526 16.643129 6.458792
v 13.359779 16.571068 6.319426
v 13.337667 16.486694 6.188982
v 13.296729 16.392088 6.070673
v 13.237975 16.289576 5.967413
v 13.162854 16.181683 5.881742
v 15.270509 20.000000 12.012585
v 16.270510 20.000000 11.012586
v 16.114075 20.000000 11.024897
v 15.961493 20.000000 11.061529
v 15.816519 20.000000 11.121578
v 15.682723 20.000000 11.203568
v 15.563402 20.000000 11.305478
v 15.461493 20.000000 11.424800
v 15.379503 20.000000 11.558595
v 15.319453 20.000000 11.703568
v 15.282821 20.000000 11.856151
v 22.270510 20.000000 11.012586
v 23.270510 20.000000 12.012585
v 23.258198 20.000000 11.856151
v 23.221565 20.000000 11.703568
v 23.161516 20.000000 11.558595
v 23.079525 20.000000 11.424800
v 22.977617 20.000000 11.305478
v 22.858295 20.000000 11.203568
v 22.724501 20.000000 11.121578
v 22.579527 20.000000 11.061529
v 22.426945 20.000000 11.024897
v 15.801207 20.000000 9.049520
v 15.736625 20.000000 9.060473
v 19.270510 20.000000 2.939606
v 22.804394 20.000000 9.060473
v 22.739813 20.000000 9.049520
v 22.270510 20.000000 9.012586
v 16.270510 20.000000 9.012586
v 13.270510 20.000000 16.012585
v 25.270510 20.000000 16.012585
v 25.270510 20.000000 13.331910
v 28.859991 20.000000 19.549076
v 25.270510 20.000000 12.012585
v 13.307445 20.000000 16.481890
v 9.681028 20.000000 19.549076
v 13.270510 20.000000 13.331910
v 13.270510 20.000000 12.012585
v 23.197561 20.000000 18.865755
v 23.632483 20.000000 18.685606
v 24.033865 20.000000 18.439636
v 24.391830 20.000000 18.133905
v 24.697561 20.000000 17.775942
v 24.943529 20.000000 17.374556
v 25.123678 20.000000 16.939636
v 25.233574 20.000000 16.481890
v 13.417340 20.000000 16.939636
v 13.597490 20.000000 17.374556
v 13.843458 20.000000 17.775942
v 14.908538 20.000000 18.685606
v 15.343458 20.000000 18.865755
v 15.801207 20.000000 18.975651
v 14.149189 20.000000 18.133905
v 14.507154 20.000000 18.439636
v 16.270510 20.000000 19.012585
v 22.270510 20.000000 19.012585
v 22.739813 20.000000 18.975651
v 2.309401 2.000000 8.660254
v 2.309401 8.171574 8.660254
v 8.867306 19.530197 20.018877
v 15.425210 8.171574 31.377502
v 15.425210 2.000000 31.377502
v 23.115808 2.000000 31.377502
v 23.115808 8.171574 31.377502
v 29.673714 19.530197 20.018877
v 36.231617 8.171574 8.660254
v 36.231617 2.000000 8.660254
v 13.270510 16.071068 23.478006
v 13.270510 13.242641 26.306435
v 13.307445 12.910793 26.638281
v 13.417340 12.587117 26.961958
v 13.597490 12.279581 27.269493
v 13.843458 11.995760 27.553316
v 14.149189 11.742641 27.806435
v 24.391830 11.742641 27.806435
v 24.697561 11.995760 27.553316
v 14.908538 17.961178 21.587896
v 15.343458 18.088564 21.460510
v 15.801207 18.166271 21.382805
v 14.507154 11.526457 28.022619
v 14.908538 11.352530 28.196543
v 15.343458 11.225145 28.323929
v 14.507154 17.787252 21.761824
v 14.149189 17.571068 21.978008
v 13.843458 17.317949 22.231127
v 13.597490 17.034126 22.514946
v 22.739813 11.147438 28.401638
v 23.197561 11.225145 28.323929
v 22.270510 18.192389 21.356688
v 16.270510 18.192389 21.356688
v 13.417340 16.726593 22.822485
v 13.307445 16.402916 23.146160
v 23.632483 11.352530 28.196543
v 24.033865 11.526457 28.022619
v 25.123678 16.726593 22.822485
v 24.943529 17.034126 22.514946
v 24.697561 17.317949 22.231127
v 24.391830 17.571068 21.978008
v 24.033865 17.787252 21.761824
v 23.632483 17.961178 21.587896
v 15.801207 11.147438 28.401638
v 16.270510 11.121321 28.427753
v 22.270510 11.121321 28.427753
v 24.943529 12.279581 27.269493
v 25.123678 12.587117 26.961958
v 25.233574 12.910793 26.638281
v 25.270510 13.242641 26.306435
v 23.197561 18.088564 21.460510
v 22.739813 18.166271 21.382805
v 25.270510 16.071068 23.478006
v 25.233574 16.402916 23.146160
v 22.270510 16.778175 19.942474
v 22.739813 16.752056 19.968590
v 23.197561 16.674349 20.046297
v 23.632483 16.546965 20.173683
v 24.033865 16.373039 20.347610
v 24.391830 16.156855 20.563795
v 24.697561 15.903735 20.816914
v 24.943529 15.619914 21.100733
v 25.123678 15.312378 21.408270
v 25.233574 14.988702 21.731947
v 25.270510 14.656855 22.063793
v 13.270510 14.656855 22.063793
v 13.307445 14.988702 21.731947
v 13.417340 15.312378 21.408270
v 13.597490 15.619914 21.100733
v 13.843458 15.903735 20.816914
v 14.149189 16.156855 20.563795
v 14.507154 16.373039 20.347610
v 14.908538 16.546965 20.173683
v 15.343458 16.674349 20.046297
v 15.801207 16.752056 19.968590
v 16.270510 16.778175 19.942474
v 30.467804 16.071068 14.476027
v 33.710651 11.995760 11.942184
v 33.776993 11.742641 11.550855
v 32.917294 13.242641 13.061813
v 33.186214 12.910793 12.863903
v 33.411583 12.587117 12.606893
v 33.587841 12.279581 12.297111
v 33.785233 11.526457 11.132756
v 33.735165 11.352530 10.698184
v 33.628025 11.225145 10.257839
v 29.700972 11.225145 3.455987
v 29.373194 11.352530 3.143027
v 29.997145 11.147438 3.813555
v 29.021875 11.526457 2.882382
v 28.655672 11.742641 2.680467
v 28.283600 11.995760 2.542256
v 29.470280 17.034126 14.674383
v 29.826689 16.726593 14.676630
v 27.914818 12.279581 2.471152
v 27.558411 12.587117 2.468905
v 27.223150 12.910793 2.535571
v 26.917295 13.242641 2.669508
v 27.684128 18.088564 13.689548
v 28.011908 17.961178 14.002507
v 30.161949 16.402916 14.609964
v 24.467806 16.071068 4.083722
v 24.198885 16.402916 4.281632
v 23.973520 16.726593 4.538643
v 23.197561 19.708981 9.159416
v 23.918655 18.166271 7.322971
v 28.363224 17.787252 14.263154
v 28.729427 17.571068 14.465068
v 29.101500 17.317949 14.603278
v 33.466446 11.147438 9.822564
v 33.254410 11.121321 9.403077
v 30.254412 11.121321 4.206925
v 23.797262 17.034126 4.848425
v 23.674448 17.317949 5.203351
v 23.608107 17.571068 5.594681
v 23.599869 17.787252 6.012780
v 23.649937 17.961178 6.447351
v 23.757078 18.088564 6.887696
v 25.123678 19.003971 11.085534
v 25.042149 18.964079 10.864535
v 27.130688 18.192389 12.938611
v 24.943529 18.942526 10.650615
v 24.130688 18.192389 7.742458
v 24.828430 18.939442 10.445090
v 24.697561 18.954849 10.249229
v 24.551727 18.988649 10.064241
v 24.391830 19.040636 9.891265
v 24.218853 19.110489 9.731367
v 25.261261 19.230658 11.777208
v 25.233574 19.137672 11.543283
v 25.187618 19.061954 11.312249
v 24.033865 19.197777 9.585534
v 23.838005 19.301962 9.454665
v 23.632483 19.422403 9.339565
v 27.387959 18.166271 13.331982
v 25.270510 19.340338 12.012585
v 10.257420 11.995760 2.542256
v 9.885346 11.742641 2.680467
v 14.073214 16.071068 4.083722
v 11.623723 13.242641 2.669508
v 14.743757 17.034126 4.848425
v 14.567499 16.726593 4.538643
v 14.342134 16.402916 4.281632
v 5.074573 11.147438 9.822564
v 4.912996 11.225145 10.257839
v 4.805854 11.352530 10.698184
v 11.317868 12.910793 2.535571
v 10.982609 12.587117 2.468905
v 10.626200 12.279581 2.471152
v 9.519143 11.526457 2.882382
v 9.167826 11.352530 3.143027
v 8.840047 11.225145 3.455987
v 5.623724 13.242641 13.061813
v 8.073214 16.071068 14.476027
v 8.379070 16.402916 14.609964
v 8.714330 16.726593 14.676630
v 9.070738 17.034126 14.674383
v 9.439519 17.317949 14.603278
v 9.811591 17.571068 14.465068
v 10.177794 17.787252 14.263154
v 14.891083 17.961178 6.447351
v 14.783941 18.088564 6.887696
v 14.622364 18.166271 7.322971
v 4.755786 11.526457 11.132756
v 4.764026 11.742641 11.550855
v 4.830368 11.995760 11.942184
v 4.953180 12.279581 12.297111
v 5.129439 12.587117 12.606893
v 5.354803 12.910793 12.863903
v 14.941151 17.787252 6.012780
v 14.932912 17.571068 5.594681
v 14.866570 17.317949 5.203351
v 8.543876 11.147438 3.813555
v 8.286607 11.121321 4.206925
v 5.286607 11.121321 9.403077
v 13.989292 18.988649 10.064241
v 13.843458 18.954849 10.249229
v 14.410331 18.192389 7.742458
v 13.712588 18.939442 10.445090
v 11.410332 18.192389 12.938611
v 13.597490 18.942526 10.650615
v 13.498871 18.964079 10.864535
v 14.507154 19.197777 9.585534
v 14.322165 19.110489 9.731367
v 14.149189 19.040636 9.891265
v 13.417340 19.003971 11.085534
v 13.353400 19.061954 11.312249
v 13.307445 19.137672 11.543283
v 15.343458 19.708981 9.159416
v 14.908538 19.422403 9.339565
v 14.703014 19.301962 9.454665
v 10.529111 17.961178 14.002507
v 10.856891 18.088564 13.689548
v 11.153061 18.166271 13.331982
v 13.270510 19.340338 12.012585
v 13.279757 19.230658 11.777208
v 22.905943 16.778175 8.449566
v 22.693911 16.752056 8.030077
v 22.532333 16.674349 7.594803
v 22.425192 16.546965 7.154458
v 22.375124 16.373039 6.719886
v 22.383362 16.156855 6.301788
v 22.449703 15.903735 5.910458
v 22.572517 15.619914 5.555532
v 22.748775 15.312378 5.245750
v 22.974138 14.988702 4.988739
v 23.243061 14.656855 4.790829
v 29.243059 14.656855 15.183134
v 28.937206 14.988702 15.317071
v 28.601944 15.312378 15.383738
v 28.245537 15.619914 15.381490
v 27.876755 15.903735 15.310387
v 27.504683 16.156855 15.172175
v 27.138479 16.373039 14.970261
v 26.787163 16.546965 14.709614
v 26.459383 16.674349 14.396655
v 26.163214 16.752056 14.039088
v 25.905943 16.778175 13.645718
v 12.635077 16.778175 13.645718
v 12.377806 16.752056 14.039088
v 12.081636 16.674349 14.396655
v 11.753857 16.546965 14.709614
v 11.402540 16.373039 14.970261
v 11.036337 16.156855 15.172175
v 10.664264 15.903735 15.310387
v 10.295483 15.619914 15.381490
v 9.939075 15.312378 15.383738
v 9.603814 14.988702 15.317071
v 9.297958 14.656855 15.183134
v 15.297958 14.656855 4.790829
v 15.566880 14.988702 4.988739
v 15.792243 15.312378 5.245750
v 15.968502 15.619914 5.555532
v 16.091314 15.903735 5.910458
v 16.157658 16.156855 6.301788
v 16.165895 16.373039 6.719886
v 16.115828 16.546965 7.154458
v 16.008686 16.674349 7.594803
v 15.847109 16.752056 8.030077
v 15.635077 16.778175 8.449566
v 13.843458 18.000002 10.249229
v 15.801207 18.000002 9.049520
v 15.343458 18.000002 9.159416
v 14.908538 18.000002 9.339565
v 14.507154 18.000002 9.585534
v 14.149189 18.000002 9.891265
v 13.597490 18.000002 10.650615
v 13.417340 18.000002 11.085534
v 13.307445 18.000002 11.543283
v 13.270510 18.000002 12.012585
v 16.270510 18.000002 9.012586
v 22.270510 18.000002 9.012586
v 25.123678 18.000002 11.085534
v 25.233574 18.000002 11.543283
v 25.270510 18.000002 12.012585
v 24.943529 18.000002 10.650615
v 24.697561 18.000002 10.249229
v 24.391830 18.000002 9.891265
v 24.033865 18.000002 9.585534
v 23.632483 18.000002 9.339565
v 23.197561 18.000002 9.159416
v 22.739813 18.000002 9.049520
v 14.120510 5.350000 5.000000
v 24.420509 5.350000 5.000000
v 24.420509 10.650001 5.000000
v 14.120510 10.650001 5.000000
v 25.920509 4.850000 5.000000
v 12.620509 11.150001 5.000000
v 12.620509 4.850000 5.000000
v 12.632821 4.693566 5.000000
v 12.669454 4.540983 5.000000
v 25.920509 11.150001 5.000000
v 25.908197 11.306435 5.000000
v 25.871565 11.459017 5.000000
v 25.811516 11.603991 5.000000
v 25.729527 11.737785 5.000000
v 25.627617 11.857107 5.000000
v 12.913403 4.142893 5.000000
v 13.032724 4.040983 5.000000
v 13.166519 3.958994 5.000000
v 13.311492 3.898943 5.000000
v 13.464074 3.862312 5.000000
v 13.620509 3.850000 5.000000
v 24.920509 3.850000 5.000000
v 25.076944 3.862312 5.000000
v 12.729504 11.603991 5.000000
v 12.811493 11.737785 5.000000
v 12.913403 11.857107 5.000000
v 12.729504 4.396009 5.000000
v 12.811493 4.262215 5.000000
v 25.508295 11.959017 5.000000
v 25.374500 12.041007 5.000000
v 25.229527 12.101057 5.000000
v 13.464074 12.137689 5.000000
v 13.311492 12.101057 5.000000
v 25.508295 4.040983 5.000000
v 25.627617 4.142893 5.000000
v 25.729527 4.262215 5.000000
v 25.811516 4.396009 5.000000
v 25.871565 4.540983 5.000000
v 25.908197 4.693566 5.000000
v 12.669454 11.459017 5.000000
v 12.632821 11.306435 5.000000
v 25.076944 12.137689 5.000000
v 24.920509 12.150001 5.000000
v 13.620509 12.150001 5.000000
v 13.166519 12.041007 5.000000
v 13.032724 11.959017 5.000000
v 25.229527 3.898943 5.000000
v 25.374500 3.958994 5.000000
# 856 vertices, 0 vertices normals

f 1 2 3
f 3 2 4
f 5 6 7
f 7 6 8
f 7 8 2
f 2 8 9
f 2 9 4
f 10 11 12
f 12 11 13
f 14 15 16
f 17 18 7
f 7 18 19
f 1 20 2
f 2 20 21
f 2 21 12
f 12 21 22
f 22 23 12
f 12 23 24
f 12 24 25
f 25 26 12
f 12 26 27
f 12 27 10
f 13 28 12
f 12 28 29
f 12 29 14
f 14 29 30
f 14 30 15
f 16 31 14
f 14 31 32
f 14 32 33
f 33 34 14
f 14 34 35
f 14 35 36
f 19 37 7
f 7 37 38
f 7 38 5
f 39 40 41
f 41 40 42
f 41 42 43
f 36 44 14
f 14 44 45
f 14 45 41
f 41 45 46
f 41 46 39
f 43 47 41
f 41 47 48
f 41 48 7
f 7 48 49
f 7 49 17
f 50 51 52
f 52 51 53
f 52 53 54
f 55 50 56
f 56 50 57
f 55 58 50
f 50 58 59
f 50 59 51
f 50 60 61
f 54 62 52
f 52 62 63
f 52 63 64
f 65 64 66
f 66 64 67
f 65 68 64
f 64 68 69
f 64 69 52
f 61 70 50
f 50 70 71
f 50 71 57
f 72 73 74
f 74 73 75
f 76 77 78
f 78 77 79
f 78 79 80
f 80 81 78
f 78 81 82
f 78 82 83
f 76 78 73
f 73 78 84
f 73 84 75
f 85 86 83
f 83 86 87
f 83 87 78
f 88 89 74
f 74 89 90
f 74 90 72
f 88 91 89
f 89 91 92
f 89 92 93
f 94 95 96
f 96 95 97
f 96 97 98
f 99 100 101
f 98 102 96
f 96 102 103
f 96 103 104
f 105 106 107
f 108 109 94
f 94 109 110
f 104 111 96
f 96 111 105
f 96 105 112
f 112 105 107
f 99 101 94
f 94 101 113
f 94 113 108
f 110 114 94
f 94 114 115
f 94 115 95
f 116 117 118
f 118 117 119
f 120 121 122
f 116 123 117
f 117 123 124
f 117 124 125
f 126 127 128
f 119 117 122
f 122 117 129
f 122 129 120
f 125 124 128
f 128 124 130
f 128 130 126
f 121 131 122
f 122 131 132
f 122 132 133
f 133 134 135
f 135 136 133
f 133 136 137
f 133 137 122
f 138 139 140
f 140 139 141
f 140 141 142
f 142 141 143
f 144 145 146
f 147 148 140
f 140 148 149
f 140 149 138
f 150 143 151
f 151 143 152
f 151 152 153
f 144 146 140
f 140 146 154
f 140 154 147
f 150 155 143
f 143 155 156
f 143 156 157
f 157 158 143
f 143 158 159
f 143 159 142
f 160 161 162
f 163 164 165
f 165 164 166
f 165 166 167
f 168 169 170
f 170 169 165
f 170 165 171
f 171 165 167
f 160 162 165
f 165 162 172
f 165 172 163
f 173 174 168
f 168 174 175
f 168 175 169
f 176 177 178
f 178 177 179
f 168 180 173
f 173 180 177
f 173 177 181
f 181 177 176
f 182 183 184
f 184 183 185
f 186 187 182
f 182 187 188
f 182 188 183
f 189 190 191
f 191 190 192
f 182 193 186
f 186 193 192
f 186 192 194
f 194 192 190
f 185 195 184
f 184 195 196
f 184 196 197
f 198 199 200
f 200 199 201
f 197 202 184
f 184 202 199
f 184 199 203
f 203 199 198
f 204 205 206
f 207 208 209
f 209 208 206
f 209 206 210
f 210 206 205
f 204 206 211
f 211 206 212
f 211 212 213
f 213 214 211
f 211 214 215
f 211 215 216
f 217 218 219
f 207 220 208
f 208 220 221
f 208 221 222
f 222 223 208
f 208 223 224
f 208 224 219
f 219 224 225
f 219 225 217
f 226 227 228
f 228 227 229
f 230 231 227
f 232 233 234
f 235 236 232
f 232 236 237
f 232 237 238
f 238 239 232
f 232 239 240
f 232 240 241
f 242 243 244
f 244 243 245
f 244 245 246
f 246 247 244
f 244 247 248
f 244 248 249
f 229 227 250
f 250 227 244
f 250 244 251
f 226 252 227
f 227 252 253
f 227 253 254
f 234 255 232
f 232 255 256
f 232 256 235
f 257 258 244
f 244 258 259
f 244 259 242
f 249 260 244
f 244 260 261
f 244 261 251
f 241 262 232
f 232 262 263
f 232 263 244
f 244 263 264
f 244 264 257
f 265 266 227
f 227 266 267
f 227 267 230
f 231 268 227
f 227 268 269
f 227 269 232
f 232 269 270
f 232 270 233
f 254 271 227
f 227 271 272
f 227 272 265
f 273 274 275
f 275 274 276
f 277 278 279
f 279 278 275
f 279 275 276
f 277 279 280
f 280 279 281
f 282 283 284
f 284 283 280
f 284 280 281
f 282 284 285
f 285 284 286
f 274 273 287
f 287 273 288
f 287 288 289
f 289 288 285
f 289 285 290
f 290 285 286
f 290 286 291
f 291 286 274
f 291 274 287
f 292 277 293
f 293 277 280
f 293 280 294
f 292 295 277
f 277 295 296
f 277 296 297
f 297 298 277
f 277 298 299
f 277 299 300
f 301 302 278
f 303 304 244
f 244 304 305
f 244 305 306
f 301 278 307
f 300 308 277
f 277 308 309
f 277 309 278
f 278 309 310
f 278 310 307
f 311 312 283
f 302 313 278
f 278 313 314
f 278 314 244
f 244 314 315
f 244 315 303
f 283 316 280
f 280 316 317
f 280 317 318
f 319 320 232
f 232 320 321
f 232 321 322
f 312 323 283
f 283 323 324
f 283 324 316
f 318 325 280
f 280 325 326
f 280 326 327
f 306 328 244
f 244 328 329
f 244 329 232
f 232 329 330
f 232 330 319
f 322 331 232
f 232 331 332
f 232 332 283
f 283 332 333
f 283 333 311
f 327 334 280
f 280 334 335
f 280 335 294
f 336 323 337
f 337 323 312
f 337 312 338
f 338 312 311
f 338 311 339
f 339 311 333
f 339 333 340
f 340 333 332
f 340 332 341
f 341 332 331
f 341 331 342
f 342 331 322
f 342 322 343
f 343 322 321
f 343 321 344
f 344 321 320
f 344 320 345
f 345 320 319
f 345 319 346
f 346 319 330
f 336 142 323
f 323 142 324
f 143 293 152
f 152 293 294
f 152 294 153
f 153 294 335
f 153 335 151
f 151 335 334
f 151 334 150
f 150 334 327
f 150 327 155
f 155 327 326
f 155 326 156
f 156 326 325
f 156 325 157
f 157 325 318
f 157 318 158
f 158 318 317
f 158 317 159
f 159 317 316
f 159 316 142
f 142 316 324
f 143 141 293
f 293 141 292
f 140 307 144
f 144 307 310
f 144 310 145
f 145 310 309
f 145 309 146
f 146 309 308
f 146 308 154
f 154 308 300
f 154 300 147
f 147 300 299
f 147 299 148
f 148 299 298
f 148 298 149
f 149 298 297
f 149 297 138
f 138 297 296
f 138 296 139
f 139 296 295
f 139 295 141
f 141 295 292
f 140 347 307
f 307 347 301
f 348 329 349
f 349 329 328
f 349 328 350
f 350 328 306
f 350 306 351
f 351 306 305
f 351 305 352
f 352 305 304
f 352 304 353
f 353 304 303
f 353 303 354
f 354 303 315
f 354 315 355
f 355 315 314
f 355 314 356
f 356 314 313
f 356 313 357
f 357 313 302
f 357 302 347
f 347 302 301
f 348 346 329
f 329 346 330
f 336 343 344
f 344 345 336
f 336 345 346
f 336 346 347
f 347 346 348
f 347 348 349
f 336 337 343
f 343 337 338
f 343 338 339
f 339 340 343
f 343 340 341
f 343 341 342
f 349 350 347
f 347 350 351
f 347 351 357
f 357 351 356
f 351 352 356
f 356 352 353
f 356 353 355
f 355 353 354
f 358 359 227
f 227 359 360
f 227 360 361
f 362 363 283
f 364 285 365
f 365 285 366
f 361 367 227
f 227 367 368
f 227 368 288
f 283 363 232
f 232 363 369
f 232 369 370
f 370 371 232
f 232 371 372
f 232 372 373
f 368 374 288
f 288 374 375
f 288 375 376
f 288 377 285
f 285 377 378
f 285 378 366
f 364 379 285
f 285 379 380
f 285 380 381
f 382 383 282
f 282 383 384
f 373 385 232
f 232 385 386
f 232 386 227
f 227 386 387
f 227 387 358
f 376 388 288
f 288 388 389
f 288 389 377
f 390 391 282
f 282 391 392
f 282 392 382
f 381 393 285
f 285 393 394
f 285 394 282
f 282 394 395
f 282 395 390
f 384 396 282
f 282 396 397
f 282 397 283
f 283 397 398
f 283 398 399
f 399 400 283
f 283 400 401
f 283 401 362
f 402 403 275
f 402 275 404
f 405 406 273
f 273 406 407
f 403 408 275
f 275 408 409
f 275 409 273
f 273 409 410
f 273 410 405
f 407 411 273
f 273 411 412
f 273 412 413
f 414 288 415
f 415 288 416
f 417 418 227
f 227 418 419
f 227 419 420
f 421 422 244
f 244 422 423
f 244 423 424
f 425 278 426
f 426 278 244
f 426 244 427
f 427 244 424
f 413 428 273
f 273 428 429
f 273 429 288
f 288 429 430
f 288 430 416
f 414 431 288
f 288 431 432
f 288 432 227
f 227 432 433
f 227 433 417
f 420 434 227
f 227 434 435
f 227 435 244
f 244 435 436
f 244 436 421
f 425 437 278
f 278 437 438
f 278 438 439
f 440 441 275
f 275 441 442
f 275 442 404
f 439 443 278
f 278 443 444
f 278 444 275
f 275 444 445
f 275 445 440
f 446 388 447
f 447 388 376
f 447 376 448
f 448 376 375
f 448 375 449
f 449 375 374
f 449 374 450
f 450 374 368
f 450 368 451
f 451 368 367
f 451 367 452
f 452 367 361
f 452 361 453
f 453 361 360
f 453 360 454
f 454 360 359
f 454 359 455
f 455 359 358
f 455 358 456
f 456 358 387
f 446 95 388
f 388 95 389
f 94 394 99
f 99 394 393
f 99 393 100
f 100 393 381
f 100 381 101
f 101 381 380
f 101 380 113
f 113 380 379
f 113 379 108
f 108 379 364
f 108 364 109
f 109 364 365
f 109 365 110
f 110 365 366
f 110 366 114
f 114 366 378
f 114 378 115
f 115 378 377
f 115 377 95
f 95 377 389
f 94 96 394
f 394 96 395
f 97 399 98
f 98 399 398
f 98 398 102
f 102 398 397
f 102 397 103
f 103 397 396
f 103 396 104
f 104 396 384
f 104 384 111
f 111 384 383
f 111 383 105
f 105 383 382
f 105 382 106
f 106 382 392
f 106 392 107
f 107 392 391
f 107 391 112
f 112 391 390
f 112 390 96
f 96 390 395
f 97 457 399
f 399 457 400
f 458 386 459
f 459 386 385
f 459 385 460
f 460 385 373
f 460 373 461
f 461 373 372
f 461 372 462
f 462 372 371
f 462 371 463
f 463 371 370
f 463 370 464
f 464 370 369
f 464 369 465
f 465 369 363
f 465 363 466
f 466 363 362
f 466 362 467
f 467 362 401
f 467 401 457
f 457 401 400
f 458 456 386
f 386 456 387
f 448 449 453
f 454 455 446
f 446 455 456
f 446 456 457
f 457 456 458
f 457 458 467
f 467 458 466
f 454 446 453
f 453 446 447
f 453 447 448
f 449 450 453
f 453 450 451
f 453 451 452
f 462 459 461
f 461 459 460
f 462 463 459
f 459 463 464
f 459 464 458
f 458 464 465
f 458 465 466
f 468 439 469
f 469 439 438
f 469 438 470
f 470 438 437
f 470 437 471
f 471 437 425
f 471 425 472
f 472 425 426
f 472 426 473
f 473 426 427
f 473 427 474
f 474 427 424
f 474 424 475
f 475 424 423
f 475 423 476
f 476 423 422
f 476 422 477
f 477 422 421
f 477 421 478
f 478 421 436
f 468 51 439
f 439 51 443
f 50 409 60
f 60 409 408
f 60 408 61
f 61 408 403
f 61 403 70
f 70 403 402
f 70 402 71
f 71 402 404
f 71 404 57
f 57 404 442
f 57 442 56
f 56 442 441
f 56 441 55
f 55 441 440
f 55 440 58
f 58 440 445
f 58 445 59
f 59 445 444
f 59 444 51
f 51 444 443
f 50 52 409
f 409 52 410
f 53 416 54
f 54 416 430
f 54 430 62
f 62 430 429
f 62 429 63
f 63 429 428
f 63 428 64
f 64 428 413
f 64 413 67
f 67 413 412
f 67 412 66
f 66 412 411
f 66 411 65
f 65 411 407
f 65 407 68
f 68 407 406
f 68 406 69
f 69 406 405
f 69 405 52
f 52 405 410
f 53 479 416
f 416 479 415
f 480 435 481
f 481 435 434
f 481 434 482
f 482 434 420
f 482 420 483
f 483 420 419
f 483 419 484
f 484 419 418
f 484 418 485
f 485 418 417
f 485 417 486
f 486 417 433
f 486 433 487
f 487 433 432
f 487 432 488
f 488 432 431
f 488 431 489
f 489 431 414
f 489 414 479
f 479 414 415
f 480 478 435
f 435 478 436
f 481 482 479
f 476 477 468
f 468 477 478
f 468 478 479
f 479 478 480
f 479 480 481
f 482 483 479
f 479 483 484
f 479 484 489
f 485 486 487
f 485 487 484
f 484 487 488
f 484 488 489
f 469 470 471
f 473 474 468
f 468 474 475
f 468 475 476
f 469 471 468
f 468 471 472
f 468 472 473
f 185 249 195
f 195 249 248
f 195 248 196
f 196 248 247
f 196 247 197
f 197 247 246
f 197 246 202
f 202 246 245
f 202 245 199
f 199 245 243
f 199 243 201
f 201 243 242
f 201 242 200
f 200 242 259
f 200 259 198
f 198 259 258
f 198 258 203
f 203 258 257
f 203 257 184
f 184 257 264
f 185 490 249
f 249 490 260
f 491 271 492
f 492 271 254
f 492 254 493
f 493 254 253
f 493 253 494
f 494 253 252
f 494 252 495
f 495 252 226
f 495 226 496
f 496 226 228
f 496 228 497
f 497 228 229
f 497 229 498
f 498 229 250
f 498 250 499
f 499 250 251
f 499 251 500
f 500 251 261
f 500 261 490
f 490 261 260
f 491 501 271
f 271 501 272
f 502 234 503
f 503 234 233
f 503 233 504
f 504 233 270
f 504 270 505
f 505 270 269
f 505 269 506
f 506 269 268
f 506 268 507
f 507 268 231
f 507 231 508
f 508 231 230
f 508 230 509
f 509 230 267
f 509 267 510
f 510 267 266
f 510 266 511
f 511 266 265
f 511 265 501
f 501 265 272
f 502 183 234
f 234 183 255
f 182 263 193
f 193 263 262
f 193 262 192
f 192 262 241
f 192 241 191
f 191 241 240
f 191 240 189
f 189 240 239
f 189 239 190
f 190 239 238
f 190 238 194
f 194 238 237
f 194 237 186
f 186 237 236
f 186 236 187
f 187 236 235
f 187 235 188
f 188 235 256
f 188 256 183
f 183 256 255
f 182 184 263
f 263 184 264
f 501 502 503
f 503 504 501
f 501 504 505
f 501 505 511
f 511 505 510
f 502 501 490
f 490 501 491
f 490 491 492
f 505 506 510
f 510 506 507
f 510 507 509
f 509 507 508
f 492 493 490
f 490 493 494
f 490 494 500
f 496 497 498
f 494 495 500
f 500 495 496
f 500 496 499
f 499 496 498
f 512 513 514
f 514 515 516
f 516 517 514
f 514 517 518
f 514 518 512
f 490 185 519
f 520 521 522
f 520 183 521
f 521 183 502
f 521 502 523
f 524 525 519
f 519 525 526
f 519 526 490
f 490 526 527
f 528 529 522
f 522 529 530
f 530 531 522
f 522 531 532
f 522 532 533
f 533 534 522
f 522 534 535
f 522 535 520
f 524 536 525
f 525 536 537
f 525 537 538
f 539 540 525
f 525 540 541
f 538 542 525
f 525 542 543
f 525 543 539
f 541 544 525
f 525 544 545
f 525 545 522
f 522 545 546
f 522 546 528
f 14 41 547
f 547 41 548
f 548 549 547
f 547 549 550
f 547 550 551
f 551 550 552
f 552 550 553
f 553 554 552
f 552 554 555
f 552 555 556
f 556 555 12
f 12 555 2
f 347 140 557
f 557 140 558
f 557 558 549
f 558 559 549
f 549 559 560
f 549 560 550
f 560 561 550
f 550 561 562
f 550 562 563
f 564 565 553
f 566 525 567
f 567 525 568
f 563 569 550
f 550 569 570
f 550 570 571
f 566 572 525
f 525 572 573
f 525 573 549
f 549 573 574
f 549 574 575
f 553 576 577
f 522 578 525
f 525 578 579
f 525 579 568
f 575 580 549
f 549 580 581
f 549 581 557
f 577 582 553
f 553 582 583
f 553 583 564
f 584 585 554
f 554 585 586
f 554 586 522
f 586 587 522
f 522 587 588
f 522 588 589
f 571 590 550
f 550 590 591
f 550 591 553
f 553 591 592
f 553 592 576
f 565 593 553
f 553 593 594
f 553 594 554
f 554 594 595
f 554 595 596
f 589 597 522
f 522 597 598
f 522 598 578
f 142 336 596
f 596 336 599
f 596 599 554
f 554 599 600
f 554 600 584
f 601 578 598
f 601 598 602
f 602 598 597
f 602 597 603
f 603 597 589
f 603 589 604
f 604 589 588
f 604 588 605
f 605 588 587
f 605 587 606
f 606 587 586
f 606 586 607
f 607 586 585
f 607 585 608
f 608 585 584
f 608 584 609
f 609 584 600
f 609 600 610
f 610 600 599
f 610 599 611
f 165 596 595
f 165 595 160
f 160 595 594
f 160 594 161
f 161 594 593
f 161 593 162
f 162 593 565
f 162 565 172
f 172 565 564
f 172 564 163
f 163 564 583
f 163 583 164
f 164 583 582
f 164 582 166
f 166 582 577
f 166 577 167
f 167 577 576
f 167 576 171
f 171 576 592
f 171 592 170
f 168 170 591
f 591 170 592
f 168 591 590
f 168 590 180
f 180 590 571
f 180 571 177
f 177 571 570
f 177 570 179
f 179 570 569
f 179 569 178
f 178 569 563
f 178 563 176
f 176 563 562
f 176 562 181
f 181 562 561
f 181 561 173
f 173 561 560
f 173 560 174
f 174 560 559
f 174 559 175
f 175 559 558
f 175 558 169
f 612 557 581
f 612 581 613
f 613 581 580
f 613 580 614
f 614 580 575
f 614 575 615
f 615 575 574
f 615 574 616
f 616 574 573
f 616 573 617
f 617 573 572
f 617 572 618
f 618 572 566
f 618 566 619
f 619 566 567
f 619 567 620
f 620 567 568
f 620 568 621
f 621 568 579
f 621 579 622
f 601 622 578
f 578 622 579
f 620 621 612
f 612 621 622
f 612 622 611
f 622 601 611
f 611 601 602
f 611 602 603
f 613 614 618
f 614 615 618
f 618 615 616
f 618 616 617
f 603 604 611
f 611 604 605
f 611 605 610
f 610 605 606
f 606 607 610
f 610 607 608
f 610 608 609
f 613 618 612
f 612 618 619
f 612 619 620
f 623 457 97
f 624 625 555
f 626 627 554
f 554 627 628
f 554 628 555
f 555 628 629
f 555 629 624
f 625 630 555
f 555 630 631
f 555 631 632
f 633 634 2
f 633 2 635
f 634 636 2
f 2 636 637
f 2 637 638
f 639 640 554
f 638 641 2
f 2 641 642
f 2 642 7
f 7 642 643
f 7 643 644
f 522 645 646
f 640 647 554
f 554 647 623
f 554 623 626
f 626 623 97
f 95 446 644
f 644 446 648
f 644 648 7
f 7 648 649
f 7 649 650
f 651 515 652
f 646 653 522
f 522 653 654
f 522 654 554
f 554 654 655
f 554 655 639
f 632 656 555
f 555 656 657
f 555 657 2
f 2 657 658
f 2 658 635
f 650 659 7
f 7 659 660
f 7 660 514
f 514 660 661
f 661 662 514
f 514 662 663
f 514 663 515
f 515 663 664
f 515 664 652
f 665 666 667
f 667 666 668
f 667 668 669
f 669 668 670
f 669 670 671
f 671 672 669
f 669 672 673
f 669 673 674
f 675 676 667
f 667 676 677
f 667 677 665
f 674 678 669
f 669 678 679
f 669 679 652
f 652 679 680
f 652 680 651
f 645 522 681
f 681 522 521
f 681 521 667
f 667 521 682
f 667 682 675
f 683 684 41
f 479 53 685
f 685 53 686
f 685 686 7
f 687 688 7
f 7 688 689
f 7 689 685
f 690 691 548
f 548 691 692
f 686 693 7
f 7 693 694
f 7 694 41
f 41 694 695
f 41 695 683
f 684 696 41
f 41 696 697
f 41 697 698
f 51 468 699
f 699 468 700
f 699 700 549
f 549 700 701
f 549 701 702
f 702 703 549
f 549 703 704
f 549 704 525
f 525 704 705
f 525 705 706
f 707 514 708
f 708 514 513
f 708 513 709
f 692 710 548
f 548 710 711
f 548 711 712
f 712 713 548
f 548 713 714
f 548 714 549
f 549 714 715
f 549 715 699
f 707 716 514
f 514 716 717
f 514 717 7
f 7 717 718
f 7 718 687
f 698 719 41
f 41 719 720
f 41 720 548
f 548 720 721
f 548 721 690
f 722 723 724
f 724 723 725
f 724 725 726
f 726 725 727
f 726 727 728
f 729 730 724
f 724 730 731
f 724 731 722
f 728 732 726
f 726 732 733
f 726 733 734
f 513 735 709
f 709 735 736
f 709 736 724
f 724 736 737
f 724 737 729
f 706 738 525
f 525 738 739
f 525 739 526
f 526 739 740
f 526 740 741
f 741 740 726
f 741 726 742
f 742 726 734
f 743 669 652
f 743 652 744
f 744 652 664
f 744 664 745
f 745 664 663
f 745 663 746
f 746 663 662
f 746 662 747
f 747 662 661
f 747 661 748
f 748 661 660
f 748 660 749
f 749 660 659
f 749 659 750
f 750 659 650
f 750 650 751
f 751 650 649
f 751 649 752
f 752 649 648
f 752 648 753
f 119 644 643
f 119 643 118
f 118 643 642
f 118 642 116
f 116 642 641
f 116 641 123
f 123 641 638
f 123 638 124
f 124 638 637
f 124 637 130
f 130 637 636
f 130 636 126
f 126 636 634
f 126 634 127
f 127 634 633
f 127 633 128
f 128 633 635
f 128 635 125
f 125 635 658
f 125 658 117
f 129 117 657
f 657 117 658
f 129 657 656
f 129 656 120
f 120 656 632
f 120 632 121
f 121 632 631
f 121 631 131
f 131 631 630
f 131 630 132
f 132 630 625
f 132 625 133
f 133 625 624
f 133 624 134
f 134 624 629
f 134 629 135
f 135 629 628
f 135 628 136
f 136 628 627
f 136 627 137
f 137 627 626
f 137 626 122
f 754 623 647
f 754 647 755
f 755 647 640
f 755 640 756
f 756 640 639
f 756 639 757
f 757 639 655
f 757 655 758
f 758 655 654
f 758 654 759
f 759 654 653
f 759 653 760
f 760 653 646
f 760 646 761
f 761 646 645
f 761 645 762
f 762 645 681
f 762 681 763
f 763 681 667
f 763 667 764
f 743 764 669
f 669 764 667
f 752 753 743
f 743 753 764
f 753 754 764
f 764 754 755
f 764 755 756
f 759 760 761
f 748 744 747
f 747 744 745
f 747 745 746
f 756 757 764
f 764 757 758
f 764 758 763
f 759 761 758
f 758 761 762
f 758 762 763
f 748 749 744
f 744 749 750
f 744 750 743
f 743 750 751
f 743 751 752
f 765 726 740
f 765 740 766
f 766 740 739
f 766 739 767
f 767 739 738
f 767 738 768
f 768 738 706
f 768 706 769
f 769 706 705
f 769 705 770
f 770 705 704
f 770 704 771
f 771 704 703
f 771 703 772
f 772 703 702
f 772 702 773
f 773 702 701
f 773 701 774
f 774 701 700
f 774 700 775
f 76 699 715
f 76 715 77
f 77 715 714
f 77 714 79
f 79 714 713
f 79 713 80
f 80 713 712
f 80 712 81
f 81 712 711
f 81 711 82
f 82 711 710
f 82 710 83
f 83 710 692
f 83 692 85
f 85 692 691
f 85 691 86
f 86 691 690
f 86 690 87
f 87 690 721
f 87 721 78
f 84 78 720
f 720 78 721
f 84 720 719
f 84 719 75
f 75 719 698
f 75 698 74
f 74 698 697
f 74 697 88
f 88 697 696
f 88 696 91
f 91 696 684
f 91 684 92
f 92 684 683
f 92 683 93
f 93 683 695
f 93 695 89
f 89 695 694
f 89 694 90
f 90 694 693
f 90 693 72
f 72 693 686
f 72 686 73
f 776 685 689
f 776 689 777
f 777 689 688
f 777 688 778
f 778 688 687
f 778 687 779
f 779 687 718
f 779 718 780
f 780 718 717
f 780 717 781
f 781 717 716
f 781 716 782
f 782 716 707
f 782 707 783
f 783 707 708
f 783 708 784
f 784 708 709
f 784 709 785
f 785 709 724
f 785 724 786
f 765 786 726
f 726 786 724
f 786 765 775
f 775 776 786
f 786 776 777
f 786 777 778
f 778 779 786
f 786 779 780
f 786 780 785
f 785 780 784
f 769 770 771
f 784 780 783
f 783 780 781
f 783 781 782
f 769 771 768
f 765 766 775
f 775 766 767
f 775 767 774
f 774 767 773
f 768 771 767
f 767 771 772
f 767 772 773
f 207 544 541
f 207 541 220
f 220 541 540
f 220 540 221
f 221 540 539
f 221 539 222
f 222 539 543
f 222 543 223
f 223 543 542
f 223 542 224
f 224 542 538
f 224 538 225
f 225 538 537
f 225 537 217
f 217 537 536
f 217 536 218
f 218 536 524
f 218 524 219
f 219 524 519
f 219 519 208
f 725 723 787
f 735 513 788
f 788 789 735
f 735 789 790
f 735 790 736
f 791 729 790
f 790 729 737
f 790 737 736
f 787 723 792
f 723 722 792
f 792 722 731
f 792 731 791
f 791 731 730
f 791 730 729
f 725 787 727
f 727 787 793
f 727 793 728
f 728 793 794
f 728 794 732
f 732 794 733
f 733 794 795
f 733 795 734
f 734 795 742
f 742 795 796
f 742 796 741
f 513 512 788
f 788 512 518
f 788 518 797
f 798 797 517
f 517 797 518
f 666 665 799
f 799 665 800
f 665 677 800
f 800 677 676
f 800 676 801
f 801 676 675
f 801 675 682
f 666 799 668
f 668 799 802
f 668 802 670
f 670 802 803
f 670 803 671
f 671 803 672
f 672 803 804
f 672 804 673
f 673 804 674
f 674 804 805
f 674 805 678
f 678 805 679
f 679 805 806
f 679 806 680
f 680 806 807
f 680 807 651
f 651 807 515
f 515 807 808
f 515 808 516
f 516 808 798
f 516 798 517
f 206 520 535
f 206 535 212
f 212 535 534
f 212 534 213
f 213 534 533
f 213 533 214
f 214 533 532
f 214 532 215
f 215 532 531
f 215 531 216
f 216 531 530
f 216 530 211
f 211 530 529
f 211 529 204
f 204 529 528
f 204 528 205
f 205 528 546
f 205 546 210
f 210 546 545
f 210 545 209
f 207 209 544
f 544 209 545
f 799 800 798
f 798 800 801
f 798 801 797
f 801 796 797
f 797 796 795
f 797 795 794
f 798 808 807
f 794 793 797
f 797 793 787
f 797 787 792
f 792 791 797
f 797 791 790
f 797 790 788
f 788 790 789
f 807 806 798
f 798 806 805
f 798 805 804
f 804 803 798
f 798 803 802
f 798 802 799
f 682 523 502
f 796 801 741
f 741 801 682
f 682 502 741
f 741 502 490
f 741 490 527
f 527 526 741
f 208 519 185
f 208 185 206
f 206 185 183
f 206 183 520
f 521 523 682
f 169 558 140
f 169 140 165
f 165 140 142
f 165 142 596
f 611 599 336
f 611 336 612
f 612 336 347
f 612 347 557
f 122 626 97
f 122 97 119
f 119 97 95
f 119 95 644
f 753 648 446
f 753 446 754
f 754 446 457
f 754 457 623
f 73 686 53
f 73 53 76
f 76 53 51
f 76 51 699
f 775 700 468
f 775 468 776
f 776 468 479
f 776 479 685
f 809 810 291
f 291 810 290
f 810 811 290
f 290 811 289
f 811 812 289
f 289 812 287
f 812 809 287
f 287 809 291
f 811 810 813
f 809 812 814
f 814 815 809
f 809 815 816
f 809 816 817
f 813 818 811
f 811 818 819
f 811 819 820
f 820 821 811
f 811 821 822
f 811 822 823
f 824 825 809
f 809 825 826
f 809 826 827
f 827 828 809
f 809 828 829
f 809 829 810
f 810 829 830
f 810 830 831
f 832 812 833
f 833 812 834
f 817 835 809
f 809 835 836
f 809 836 824
f 823 837 811
f 811 837 838
f 811 838 839
f 840 841 812
f 842 843 810
f 810 843 844
f 810 844 845
f 845 846 810
f 810 846 847
f 810 847 813
f 832 848 812
f 812 848 849
f 812 849 814
f 839 850 811
f 811 850 851
f 811 851 812
f 812 851 852
f 812 852 840
f 841 853 812
f 812 853 854
f 812 854 834
f 831 855 810
f 810 855 856
f 810 856 842
f 852 19 18
f 852 18 840
f 840 18 17
f 840 17 841
f 841 17 49
f 841 49 853
f 853 49 48
f 853 48 854
f 854 48 47
f 854 47 834
f 834 47 43
f 834 43 833
f 833 43 42
f 833 42 832
f 832 42 40
f 832 40 848
f 848 40 39
f 848 39 849
f 849 39 46
f 849 46 814
f 815 814 45
f 45 814 46
f 815 45 44
f 815 44 816
f 816 44 36
f 816 36 817
f 817 36 35
f 817 35 835
f 835 35 34
f 835 34 836
f 836 34 33
f 836 33 824
f 824 33 32
f 824 32 825
f 825 32 31
f 825 31 826
f 826 31 16
f 826 16 827
f 827 16 15
f 827 15 828
f 828 15 30
f 828 30 829
f 830 829 29
f 29 829 30
f 830 29 28
f 830 28 831
f 831 28 13
f 831 13 855
f 855 13 11
f 855 11 856
f 856 11 10
f 856 10 842
f 842 10 27
f 842 27 843
f 843 27 26
f 843 26 844
f 844 26 25
f 844 25 845
f 845 25 24
f 845 24 846
f 846 24 23
f 846 23 847
f 847 23 22
f 847 22 813
f 818 813 21
f 21 813 22
f 818 21 20
f 818 20 819
f 819 20 1
f 819 1 820
f 820 1 3
f 820 3 821
f 821 3 4
f 821 4 822
f 822 4 9
f 822 9 823
f 823 9 8
f 823 8 837
f 837 8 6
f 837 6 838
f 838 6 5
f 838 5 839
f 839 5 38
f 839 38 850
f 850 38 37
f 850 37 851
f 852 851 19
f 19 851 37
f 14 547 12
f 12 547 551
f 12 551 556
f 556 551 552
f 281 279 284
f 284 279 276
f 284 276 286
f 286 276 274
# 1724 faces, 0 coords texture

# End of File
