<?xml version="1.0" ?>
<robot name="robot" xmlns:xacro="http://www.ros.org/wiki/xacro">

<xacro:include filename="$(find nav2_bringup)/urdf/odrive.ros2_control.xacro" />

<material name="silver">
  <color rgba="0.700 0.700 0.700 1.000"/>
</material>

<link name="base_footprint"/>

<joint name="base_joint" type="fixed">
  <parent link="base_footprint"/>
  <child link="base_link" />
  <origin xyz="0 0 0.010" rpy="0 0 0"/>
</joint>

<link name="base_link">
  <inertial>
    <origin xyz="6.915356361627106e-16 1.3172107355480202e-16 0.007499999999999999" rpy="0 0 0"/>
    <mass value="17.34461031326985"/>
    <inertia ixx="0.268562" iyy="0.268562" izz="0.536474" ixy="0.0" iyz="0.0" ixz="0.0"/>
  </inertial>
  <visual>
    <origin xyz="0 0 0" rpy="0 0 0"/>
    <geometry>
      <mesh filename="package://nav2_bringup/meshes/base_link.stl" scale="0.001 0.001 0.001"/>
    </geometry>
    <material name="silver"/>
  </visual>
  <collision>
    <origin xyz="0 0 0" rpy="0 0 0"/>
    <geometry>
      <mesh filename="package://nav2_bringup/meshes/base_link.stl" scale="0.001 0.001 0.001"/>
    </geometry>
  </collision>
</link>

<joint name="imu_joint" type="fixed">
  <parent link="base_link"/>
  <child link="imu_link"/>
  <origin xyz="0.0 0 0.068" rpy="0 0 0"/>
</joint>

<link name="imu_link"/>

<link name="lidar_pole">
  <inertial>
    <origin xyz="0 0 0.15" rpy="0 0 0"/>
    <mass value="0.1"/>
    <inertia ixx="0.0001" iyy="0.0001" izz="0.0001" ixy="0.0" iyz="0.0" ixz="0.0"/>
  </inertial>
  <visual>
    <origin xyz="0 0 0.15" rpy="0 0 0"/>
    <geometry>
      <cylinder length="0.3" radius="0.01"/>
    </geometry>
    <material name="silver"/>
  </visual>
  <collision>
    <origin xyz="0 0 0.15" rpy="0 0 0"/>
    <geometry>
      <cylinder length="0.3" radius="0.01"/>
    </geometry>
  </collision>
</link>

<link name="livox_frame">
  <inertial>
    <origin xyz="0 0 0" rpy="0 0 0"/>
    <mass value="0.1"/>
    <inertia ixx="0.0001" iyy="0.0001" izz="0.0001" ixy="0.0" iyz="0.0" ixz="0.0"/>
  </inertial>
  <visual>
    <origin xyz="0 0 0" rpy="0 0 0"/>
    <geometry>
      <cylinder length="0.05" radius="0.025"/>
    </geometry>
    <material name="silver"/>
  </visual>
  <collision>
    <origin xyz="0 0 0" rpy="0 0 0"/>
    <geometry>
      <cylinder length="0.05" radius="0.025"/>
    </geometry>
  </collision>
</link>

<joint name="pole_fixed" type="fixed">
  <origin xyz="0 0 0.15" rpy="0 0 0"/>
  <parent link="base_link"/>
  <child link="lidar_pole"/>
</joint>

<joint name="lidar_fixed" type="fixed">
  <origin xyz="0 0 0.3" rpy="0 0 0"/>
  <parent link="lidar_pole"/>
  <child link="livox_frame"/>
</joint>

<link name="reduction_1_1">
  <inertial>
    <origin xyz="0.06499999999995054 -0.06831302123388397 0.02738608062155948" rpy="0 0 0"/>
    <mass value="8.830318625946362"/>
    <inertia ixx="0.026865" iyy="0.031319" izz="0.022299" ixy="-0.0" iyz="0.007158" ixz="-0.0"/>
  </inertial>
  <visual>
    <origin xyz="0.065 -0.219184 -0.0" rpy="0 0 0"/>
    <geometry>
      <mesh filename="package://nav2_bringup/meshes/reduction_1_1.stl" scale="0.001 0.001 0.001"/>
    </geometry>
    <material name="silver"/>
  </visual>
  <collision>
    <origin xyz="0.065 -0.219184 -0.0" rpy="0 0 0"/>
    <geometry>
      <mesh filename="package://nav2_bringup/meshes/reduction_1_1.stl" scale="0.001 0.001 0.001"/>
    </geometry>
  </collision>
</link>

<link name="reduction_3_1">
  <inertial>
    <origin xyz="0.09166089969471206 -0.02213548938308403 0.027386080621559516" rpy="0 0 0"/>
    <mass value="8.83031862594635"/>
    <inertia ixx="0.030206" iyy="0.027979" izz="0.022299" ixy="0.001929" iyz="-0.003579" ixz="-0.006199"/>
  </inertial>
  <visual>
    <origin xyz="0.222319 0.0533 -0.0" rpy="0 0 0"/>
    <geometry>
      <mesh filename="package://nav2_bringup/meshes/reduction_3_1.stl" scale="0.001 0.001 0.001"/>
    </geometry>
    <material name="silver"/>
  </visual>
  <collision>
    <origin xyz="0.222319 0.0533 -0.0" rpy="0 0 0"/>
    <geometry>
      <mesh filename="package://nav2_bringup/meshes/reduction_3_1.stl" scale="0.001 0.001 0.001"/>
    </geometry>
  </collision>
</link>

<link name="reduction_2_1">
  <inertial>
    <origin xyz="-0.026660899694712303 0.09044851061694174 0.027386080621559526" rpy="0 0 0"/>
    <mass value="8.830318625946338"/>
    <inertia ixx="0.030206" iyy="0.027979" izz="0.022299" ixy="-0.001929" iyz="-0.003579" ixz="0.006199"/>
  </inertial>
  <visual>
    <origin xyz="-0.157319 0.165884 -0.0" rpy="0 0 0"/>
    <geometry>
      <mesh filename="package://nav2_bringup/meshes/reduction_2_1.stl" scale="0.001 0.001 0.001"/>
    </geometry>
    <material name="silver"/>
  </visual>
  <collision>
    <origin xyz="-0.157319 0.165884 -0.0" rpy="0 0 0"/>
    <geometry>
      <mesh filename="package://nav2_bringup/meshes/reduction_2_1.stl" scale="0.001 0.001 0.001"/>
    </geometry>
  </collision>
</link>

<link name="motor_2_1">
  <inertial>
    <origin xyz="-0.014887181868104352 0.008594959068874954 -2.1510571102112408e-16" rpy="0 0 0"/>
    <mass value="0.4520453337525243"/>
    <inertia ixx="0.000193" iyy="0.000152" izz="0.000132" ixy="-3.5e-05" iyz="0.0" ixz="-0.0"/>
  </inertial>
  <visual>
    <origin xyz="-0.081133 0.046842 -0.058" rpy="0 0 0"/>
    <geometry>
      <mesh filename="package://nav2_bringup/meshes/motor_2_1.stl" scale="0.001 0.001 0.001"/>
    </geometry>
    <material name="silver"/>
  </visual>
  <collision>
    <origin xyz="-0.081133 0.046842 -0.058" rpy="0 0 0"/>
    <geometry>
      <mesh filename="package://nav2_bringup/meshes/motor_2_1.stl" scale="0.001 0.001 0.001"/>
    </geometry>
  </collision>
</link>

<link name="motor_1_1">
  <inertial>
    <origin xyz="2.4016344468691386e-14 -0.017189918137738847 2.0816681711721685e-16" rpy="0 0 0"/>
    <mass value="0.4520453337525223"/>
    <inertia ixx="0.000132" iyy="0.000213" izz="0.000132" ixy="0.0" iyz="0.0" ixz="-0.0"/>
  </inertial>
  <visual>
    <origin xyz="0.0 -0.093684 -0.058" rpy="0 0 0"/>
    <geometry>
      <mesh filename="package://nav2_bringup/meshes/motor_1_1.stl" scale="0.001 0.001 0.001"/>
    </geometry>
    <material name="silver"/>
  </visual>
  <collision>
    <origin xyz="0.0 -0.093684 -0.058" rpy="0 0 0"/>
    <geometry>
      <mesh filename="package://nav2_bringup/meshes/motor_1_1.stl" scale="0.001 0.001 0.001"/>
    </geometry>
  </collision>
</link>

<link name="motor_3_1">
  <inertial>
    <origin xyz="0.014887181868116647 0.008594959068824237 -1.3877787807814457e-16" rpy="0 0 0"/>
    <mass value="0.45204533375252404"/>
    <inertia ixx="0.000193" iyy="0.000152" izz="0.000132" ixy="3.5e-05" iyz="-0.0" ixz="-0.0"/>
  </inertial>
  <visual>
    <origin xyz="0.081133 0.046842 -0.058" rpy="0 0 0"/>
    <geometry>
      <mesh filename="package://nav2_bringup/meshes/motor_3_1.stl" scale="0.001 0.001 0.001"/>
    </geometry>
    <material name="silver"/>
  </visual>
  <collision>
    <origin xyz="0.081133 0.046842 -0.058" rpy="0 0 0"/>
    <geometry>
      <mesh filename="package://nav2_bringup/meshes/motor_3_1.stl" scale="0.001 0.001 0.001"/>
    </geometry>
  </collision>
</link>

<link name="wheel_3_1">
  <inertial>
    <origin xyz="-0.017320664249327627 -0.010000069571354894 2.185751579730777e-16" rpy="0 0 0"/>
    <mass value="2.1529260232509384"/>
    <inertia ixx="0.002561" iyy="0.001993" izz="0.001709" ixy="0.000492" iyz="0.0" ixz="-0.0"/>
  </inertial>
  <visual>
    <origin xyz="0.159941 0.092342 0.022" rpy="0 0 0"/>
    <geometry>
      <mesh filename="package://nav2_bringup/meshes/wheel_3_1.stl" scale="0.001 0.001 0.001"/>
    </geometry>
    <material name="silver"/>
  </visual>
  <collision>
    <origin xyz="0.159941 0.092342 0.022" rpy="0 0 0"/>
    <geometry>
      <mesh filename="package://nav2_bringup/meshes/wheel_3_1.stl" scale="0.001 0.001 0.001"/>
    </geometry>
  </collision>
</link>

<link name="wheel_2_1">
  <inertial>
    <origin xyz="0.017320664249318662 -0.010000069571344264 1.1102230246251565e-16" rpy="0 0 0"/>
    <mass value="2.1529260232509326"/>
    <inertia ixx="0.002561" iyy="0.001993" izz="0.001709" ixy="-0.000492" iyz="0.0" ixz="-0.0"/>
  </inertial>
  <visual>
    <origin xyz="-0.159941 0.092342 0.022" rpy="0 0 0"/>
    <geometry>
      <mesh filename="package://nav2_bringup/meshes/wheel_2_1.stl" scale="0.001 0.001 0.001"/>
    </geometry>
    <material name="silver"/>
  </visual>
  <collision>
    <origin xyz="-0.159941 0.092342 0.022" rpy="0 0 0"/>
    <geometry>
      <mesh filename="package://nav2_bringup/meshes/wheel_2_1.stl" scale="0.001 0.001 0.001"/>
    </geometry>
  </collision>
</link>

<link name="wheel_1_1">
  <inertial>
    <origin xyz="1.6079582110251066e-13 0.020000139142682255 -1.0061396160665481e-16" rpy="0 0 0"/>
    <mass value="2.152926023250926"/>
    <inertia ixx="0.001709" iyy="0.002844" izz="0.001709" ixy="-0.0" iyz="0.0" ixz="-0.0"/>
  </inertial>
  <visual>
    <origin xyz="0.0 -0.184684 0.022" rpy="0 0 0"/>
    <geometry>
      <mesh filename="package://nav2_bringup/meshes/wheel_1_1.stl" scale="0.001 0.001 0.001"/>
    </geometry>
    <material name="silver"/>
  </visual>
  <collision>
    <origin xyz="0.0 -0.184684 0.022" rpy="0 0 0"/>
    <geometry>
      <mesh filename="package://nav2_bringup/meshes/wheel_1_1.stl" scale="0.001 0.001 0.001"/>
    </geometry>
  </collision>
</link>

<joint name="reducer 1 rigid" type="fixed">
  <origin xyz="-0.065 0.219184 0.0" rpy="0 0 0"/>
  <parent link="base_link"/>
  <child link="reduction_1_1"/>
</joint>

<joint name="reducer 3 rigid" type="fixed">
  <origin xyz="-0.222319 -0.0533 0.0" rpy="0 0 0"/>
  <parent link="base_link"/>
  <child link="reduction_3_1"/>
</joint>

<joint name="reducer 2 rigid" type="fixed">
  <origin xyz="0.157319 -0.165884 0.0" rpy="0 0 0"/>
  <parent link="base_link"/>
  <child link="reduction_2_1"/>
</joint>

<joint name="joint1" type="continuous">
  <origin xyz="-0.076186 0.119042 0.058" rpy="0 0 0"/>
  <parent link="reduction_2_1"/>
  <child link="motor_2_1"/>
  <axis xyz="0.866025 -0.5 0.0"/>
</joint>

<joint name="joint0" type="continuous">
  <origin xyz="0.065 -0.1255 0.058" rpy="0 0 0"/>
  <parent link="reduction_1_1"/>
  <child link="motor_1_1"/>
  <axis xyz="0.0 1.0 -0.0"/>
</joint>

<joint name="joint2" type="continuous">
  <origin xyz="0.141186 0.006458 0.058" rpy="0 0 0"/>
  <parent link="reduction_3_1"/>
  <child link="motor_3_1"/>
  <axis xyz="-0.866025 -0.5 0.0"/>
</joint>

<joint name="wheel 3" type="continuous">
  <origin xyz="0.062378 -0.039042 -0.022" rpy="0 0 0"/>
  <parent link="reduction_3_1"/>
  <child link="wheel_3_1"/>
  <axis xyz="0.866025 0.5 -0.0"/>
  <mimic joint="joint2" multiplier="0.066"/>
</joint>

<joint name="wheel 2" type="continuous">
  <origin xyz="0.002622 0.073542 -0.022" rpy="0 0 0"/>
  <parent link="reduction_2_1"/>
  <child link="wheel_2_1"/>
  <axis xyz="-0.866025 0.5 -0.0"/>
  <mimic joint="joint1" multiplier="0.066"/>
</joint>

<joint name="wheel 1" type="continuous">
  <origin xyz="0.065 -0.0345 -0.022" rpy="0 0 0"/>
  <parent link="reduction_1_1"/>
  <child link="wheel_1_1"/>
  <axis xyz="0.0 -1.0 0.0"/>
  <mimic joint="joint0" multiplier="0.066"/>
</joint>

<xacro:odrive_ros2_control
  name="odrv0"
  enable_joint0="true"
  enable_joint1="true"
  joint0_name="joint0"
  joint1_name="joint1"
  serial_number="365B38633030" />

<xacro:odrive_ros2_control
  name="odrv1"
  enable_joint0="true"
  enable_joint1="false"
  joint0_name="joint2"
  serial_number="2057348F5748" />

</robot>
