{
    "dynamixel0": {
        "ID": 0,
        "tendon_name": "pinky_base",
        "zero_angle": 129,
        "radius": 6.5,
        "direction": "cw"
    },
    "dynamixel1": {
        "ID": 1,
        "tendon_name": "pinky_flexure",
        "zero_angle": -104,
        "radius": 6.5,
        "direction": "ccw"
    },
    "dynamixel2": {
        "ID": 2,
        "tendon_name": "ring_base",
        "zero_angle": 133,
        "radius": 6.5,
        "direction": "cw"
    },
    "dynamixel3": {
        "ID": 3,
        "tendon_name": "ring_flexure",
        "zero_angle": -93,
        "radius": 6.5,
        "direction": "ccw"
    },
    "dynamixel4": {
        "ID": 4,
        "tendon_name": "thumb_base",
        "zero_angle": 156,
        "radius": 6.5,
        "direction": "cw"
    },
    "dynamixel5": {
        "ID": 5,
        "tendon_name": "thumb_flexure",
        "zero_angle": -114,
        "radius": 6.5,
        "direction": "ccw"
    },
    "dynamixel6": {
        "ID": 6,
        "tendon_name": "index_base",
        "zero_angle": -146,
        "radius": 6.5,
        "direction": "ccw"
    },
    "dynamixel7": {
        "ID": 7,
        "tendon_name": "index_flexure",
        "zero_angle": 95,
        "radius": 6.5,
        "direction": "cw"
    },
    "dynamixel8": {
        "ID": 8,
        "tendon_name": "middle_base",
        "zero_angle": -144,
        "radius": 6.5,
        "direction": "ccw"
    },
    "dynamixel9": {
        "ID": 9,
        "tendon_name": "middle_flexure",
        "zero_angle": 91,
        "radius": 6.5,
        "direction": "cw"
    },
    "dynamixel10": {
        "ID": 10,
        "tendon_name": "thumb_base_orth",
        "zero_angle": -80,
        "radius": 6.5,
        "direction": "ccw"
    },
    "dynamixel11": {
        "ID": 11,
        "tendon_name": "orthogonal",
        "zero_angle": 9,
        "radius": 6.5,
        "direction": "cw"
    }
}