Human trial picking the raspberry twin 

 time    ||     output compensated 

      0       -801.000000 
      0       -801.000000 
      0       -801.000000 
      0       -801.000000 
      0       -801.000000 
      0       -801.000000 
      0       -801.000000 
      0       -801.000000 
      0       -801.000000 
      0       -800.999995 
      0       -800.998804 
      0       -800.891620 
      1       -797.342139 
      1       -754.100317 
      1       -560.300135 
      1       -240.758123 
      1       -46.905508 
      1       -3.629217 
      1       -0.109276 
      1       -0.041086 
      1       -0.047509 
      1       -0.039890 
      1       -0.000882 
      1       0.029074 
      1       -0.000882 
      1       -0.039917 
      1       -0.048390 
      1       -0.050688 
      2       -0.049276 
      2       -0.050688 
      2       -0.048390 
      2       -0.039890 
      2       0.000004 
      2       0.039872 
      2       0.047512 
      2       0.039872 
      2       0.000004 
      2       -0.039903 
      2       -0.048833 
      2       -0.056060 
      2       -0.072587 
      2       -0.079811 
      2       -0.025079 
      2       0.023674 
      3       -0.001326 
      3       -0.039930 
      3       -0.048390 
      3       -0.050688 
      3       -0.049276 
      3       -0.050715 
      3       -0.049276 
      3       -0.050688 
      3       -0.048390 
      3       -0.039917 
      3       -0.000882 
      4       0.029100 
      4       -0.000009 
      4       -0.029548 
      4       -0.004965 
      4       0.009873 
      4       -0.021522 
      4       -0.042561 
      4       -0.039434 
      4       0.000018 
      4       0.039872 
      4       0.047512 
      4       0.039872 
      4       0.000004 
      4       -0.039863 
      4       -0.047503 
      4       -0.039890 
      4       -0.000882 
      4       0.029074 
      5       -0.000882 
      5       -0.039890 
      5       -0.047503 
      5       -0.039863 
      5       0.000004 
      5       0.039872 
      5       0.047512 
      5       0.039872 
      5       0.000004 
      5       -0.039890 
      6       -0.048390 
      6       -0.050688 
      6       -0.049276 
      6       -0.050688 
      6       -0.048390 
      6       -0.039890 
      6       0.000004 
      6       0.039899 
      6       0.048398 
      6       0.050697 
      6       0.049285 
      6       0.050723 
      6       0.049285 
      6       0.050697 
      6       0.048399 
      6       0.039925 
      6       0.000891 
      6       -0.029092 
      6       0.000004 
      6       0.029100 
      6       -0.000882 
      7       -0.039890 
      7       -0.047503 
      7       -0.039863 
      7       0.000004 
      7       0.039872 
      7       0.047525 
      7       0.040328 
      7       0.005860 
      7       -0.009837 
      7       0.021557 
      7       0.043456 
      7       0.050268 
      7       0.049326 
      7       0.052039 
      7       0.071980 
      7       0.176017 
      7       0.380643 
      7       0.623513 
      7       0.820595 
      7       0.899769 
      7       0.909574 
      7       0.900437 
      7       0.893748 
      7       0.893226 
      7       0.923815 
      7       0.954924 
      7       0.963655 
      7       1.005295 
      7       1.055961 
      7       1.111109 
      7       1.172486 
      7       1.133505 
      7       1.035418 
      7       1.027765 
      7       1.093208 
      7       1.127676 
      7       1.085114 
      7       1.053317 
      7       1.085621 
      8       1.071671 
      8       1.057096 
      8       1.190927 
      8       1.375657 
      8       1.471089 
      8       1.516369 
      8       1.427595 
      8       1.259213 
      8       1.174940 
      8       1.167765 
      8       1.228357 
      8       1.371285 
      8       1.574383 
      8       1.762618 
      8       1.896740 
      8       1.992671 
      8       2.050199 
      8       2.096394 
      8       2.209464 
      8       2.418737 
      8       2.671116 
      8       2.808242 
      8       2.790870 
      8       2.716066 
      8       2.677112 
      8       2.716147 
      8       2.793611 
      8       2.843417 
      8       2.852776 
      8       2.855102 
      8       2.853730 
      9       2.856472 
      9       2.870425 
      9       2.936343 
      9       3.039500 
      9       3.190582 
      9       3.454645 
      9       3.710041 
      9       3.829878 
      9       3.851809 
      9       3.855074 
      9       3.853716 
      9       3.856015 
      9       3.864515 
      9       3.904409 
      9       3.944277 
      9       3.951931 
      9       3.944787 
      9       3.912106 
      9       3.918502 
      9       4.053856 
      9       4.281125 
      9       4.521407 
      9       4.725782 
      9       4.831194 
      9       4.851849 
      9       4.855074 
      9       4.853674 
      9       4.854544 
      9       4.843194 
      9       4.754402 
      9       4.279694 
      9       2.898747 
      9       0.942283 
      9       -0.004859 
      9       0.421682 
      9       1.122264 
      9       1.503050 
      9       1.393215 
      9       0.896116 
      9       0.307293 
      9       -0.277113 
      10       -0.881653 
      10       -1.423178 
      10       -1.888765 
      10       -2.237523 
      10       -2.551571 
      10       -2.851861 
      10       -3.011120 
      10       -3.052929 
      10       -3.095510 
      10       -3.135484 
      10       -3.112545 
      10       -3.083655 
      10       -3.050144 
      10       -3.006322 
      10       -2.918153 
      10       -2.833936 
      10       -2.841134 
      10       -2.857633 
      11       -2.864001 
      11       -2.863019 
      11       -2.865330 
      11       -2.873790 
      11       -2.912395 
      11       -2.937422 
      11       -2.889527 
      11       -2.844708 
      11       -2.889527 
      11       -2.937422 
      11       -2.912395 
      11       -2.873790 
      12       -2.865330 
      12       -2.863032 
      12       -2.864445 
      12       -2.863032 
      12       -2.865331 
      12       -2.873831 
      12       -2.913725 
      12       -2.953619 
      12       -2.962119 
      12       -2.964390 
      13       -2.962119 
      13       -2.953646 
      13       -2.914611 
      13       -2.884656 
      13       -2.914611 
      13       -2.953646 
      13       -2.962119 
      13       -2.964417 
      13       -2.963005 
      13       -2.964417 
      13       -2.962119 
      13       -2.953646 
      14       -2.914612 
      14       -2.884669 
      14       -2.915055 
      14       -2.959045 
      14       -2.986316 
      14       -3.004311 
      14       -2.987189 
      14       -2.969400 
      14       -2.958050 
      14       -2.940260 
      14       -2.923112 
      14       -2.940247 
      15       -2.957607 
      15       -2.964001 
      15       -2.962992 
      15       -2.964444 
      15       -2.963006 
      15       -2.964444 
      15       -2.963005 
      15       -2.964417 
      15       -2.962119 
      15       -2.953619 
      15       -2.913725 
      15       -2.845119 
      15       -2.809104 
      15       -2.788577 
      15       -2.800160 
      15       -2.811653 
      16       -2.791952 
      16       -2.766307 
      16       -2.737247 
      16       -2.711298 
      16       -2.682761 
      16       -2.657358 
      16       -2.629360 
      16       -2.604491 
      16       -2.577021 
      16       -2.552649 
      16       -2.524847 
      16       -2.491184 
      16       -2.426777 
      16       -2.363040 
      17       -2.331846 
      17       -2.316091 
      17       -2.332399 
      17       -2.348570 
      17       -2.333499 
      17       -2.312413 
      17       -2.287041 
      17       -2.255782 
      17       -2.194580 
      17       -2.142978 
      17       -2.151204 
      17       -2.168310 
      17       -2.154164 
      17       -2.125085 
      17       -2.065216 
      17       -2.014908 
      17       -2.024415 
      17       -2.042815 
      18       -2.030776 
      18       -2.012743 
      18       -1.991218 
      18       -1.972730 
      18       -1.951578 
      18       -1.933460 
      18       -1.911851 
      18       -1.884344 
      18       -1.826856 
      18       -1.778905 
      18       -1.789921 
      18       -1.800853 
      18       -1.754013 
      18       -1.707668 
      18       -1.720274 
      18       -1.741715 
      18       -1.732687 
      18       -1.717635 
      18       -1.699061 
      18       -1.683494 
      18       -1.665236 
      18       -1.650007 
      18       -1.632083 
      18       -1.617160 
      19       -1.598713 
      19       -1.574311 
      19       -1.519073 
      19       -1.464413 
      19       -1.442205 
      19       -1.435347 
      19       -1.460462 
      19       -1.485366 
      19       -1.479353 
      19       -1.471741 
      19       -1.474236 
      19       -1.476458 
      19       -1.444729 
      19       -1.413096 
      19       -1.392634 
      19       -1.379707 
      19       -1.364472 
      20       -1.352225 
      20       -1.336428 
      20       -1.314675 
      20       -1.262884 
      20       -1.220599 
      20       -1.238049 
      20       -1.264313 
      20       -1.260085 
      20       -1.250610 
      20       -1.246519 
      20       -1.272698 
      20       -1.289627 
      20       -1.247075 
      20       -1.195960 
      20       -1.175612 
      20       -1.161580 
      20       -1.151362 
      20       -1.138425 
      20       -1.128464 
      21       -1.115755 
