Human trial picking the raspberry twin 

 time    ||     output     ||     loadcell

      0.000000       -810.014062       0.080000 
      0.031036       -810.014062       0.190000 
      0.062009       -810.014062       0.080000 
      0.093295       -810.014062       0.160000 
      0.123810       -810.014062       0.140000 
      0.154739       -810.014062       0.200000 
      0.186700       -810.014062       0.060000 
      0.216308       -810.014062       0.110000 
      0.247672       -810.014062       0.270000 
      0.278887       -810.014058       0.010000 
      0.309830       -810.012853       0.190000 
      0.341023       -809.904451       0.160000 
      0.371825       -806.314654       0.040000 
      0.402890       -762.581971       0.110000 
      0.433972       -566.585671       0.250000 
      0.465238       -243.441994       0.070000 
      0.496772       -47.440751       0.110000 
      0.527429       -3.689270       0.160000 
      0.557776       -0.083776       0.160000 
      0.588572       0.008930       0.210000 
      0.619798       -0.008664       0.320000 
      0.650436       -0.013615       0.190000 
      0.681108       -0.014045       0.040000 
      0.711625       -0.014058       0.050000 
      0.742795       -0.014058       0.050000 
      0.773626       -0.014058       0.110000 
      0.805048       -0.014058       0.080000 
      0.836082       -0.014058       0.040000 
      0.866450       -0.014058       0.090000 
      0.897817       -0.014058       0.060000 
      0.929271       -0.014058       0.010000 
      0.961214       -0.014058       0.030000 
      0.991680       -0.014045       0.120000 
      1.022313       -0.013615       0.040000 
      1.052926       -0.008646       0.090000 
      1.084246       0.010582       0.010000 
      1.115160       0.031235       0.010000 
      1.145791       0.034349       0.280000 
      1.176662       0.031678       0.020000 
      1.206987       0.015981       0.200000 
      1.239063       0.015551       0.150000 
      1.269584       0.026279       0.030000 
      1.300704       0.010152       0.210000 
      1.331486       -0.008659       0.060000 
      1.362525       -0.013615       0.020000 
      1.393023       -0.014045       0.010000 
      1.424942       -0.014058       0.060000 
      1.455920       -0.014058       0.290000 
      1.486905       -0.014058       0.000000 
      1.517655       -0.014058       0.280000 
      1.549001       -0.014058       0.030000 
      1.580384       -0.014058       0.130000 
      1.611857       -0.014058       0.160000 
      1.643219       -0.014058       0.190000 
      1.675132       -0.014058       0.200000 
      1.705088       -0.014058       0.040000 
      1.734972       -0.014058       0.210000 
      1.766889       -0.014058       0.310000 
      1.812183       -0.014058       0.070000 
      1.842106       -0.014058       0.040000 
      1.874017       -0.014058       0.330000 
      1.905934       -0.014058       0.280000 
      1.935874       -0.014058       0.160000 
      1.965777       -0.014058       0.120000 
      1.996691       -0.014058       0.310000 
      2.028606       -0.014058       0.020000 
      2.056531       -0.014058       0.190000 
      2.086450       -0.014058       0.070000 
      2.116370       -0.014058       0.070000 
      2.163245       -0.014058       0.070000 
      2.193214       -0.014058       0.230000 
      2.224535       -0.014058       0.020000 
      2.256479       -0.014058       0.100000 
      2.287369       -0.014058       0.230000 
      2.318307       -0.014058       0.070000 
      2.350221       -0.014058       0.030000 
      2.396062       -0.014058       0.050000 
      2.426982       -0.014058       0.220000 
      2.457898       -0.014058       0.040000 
      2.489814       -0.014058       0.380000 
      2.519734       -0.014058       0.260000 
      2.551647       -0.014058       0.180000 
      2.581771       -0.014058       0.200000 
      2.613686       -0.014058       0.030000 
      2.644627       -0.014058       0.030000 
      2.675577       -0.014058       0.100000 
      2.706611       -0.014058       0.110000 
      2.737770       -0.014058       0.100000 
      2.769837       -0.014058       0.090000 
      2.801241       -0.014058       0.060000 
      2.833156       -0.014058       0.050000 
      2.863591       -0.014058       0.050000 
      2.894025       -0.014058       0.080000 
      2.925195       -0.014058       0.040000 
      2.955950       -0.014058       0.100000 
      2.986461       -0.014058       0.070000 
      3.016353       -0.014058       0.160000 
      3.046966       -0.014058       0.180000 
      3.078100       -0.014058       0.150000 
      3.108509       -0.014058       0.220000 
      3.140678       -0.014058       0.130000 
      3.171299       -0.014058       0.080000 
      3.201530       -0.014058       0.070000 
      3.231431       -0.014058       0.210000 
      3.263408       -0.014058       0.320000 
      3.295115       -0.014058       0.380000 
      3.327093       -0.014058       0.180000 
      3.358523       -0.014058       0.150000 
      3.389131       -0.014058       0.270000 
      3.420239       -0.014058       0.000000 
      3.451494       -0.014058       0.270000 
      3.482960       -0.014058       0.010000 
      3.513998       -0.014058       0.200000 
      3.544400       -0.014058       0.210000 
      3.576261       -0.014058       0.060000 
      3.621996       -0.014058       0.000000 
      3.653162       -0.014058       0.160000 
      3.684104       -0.014058       0.050000 
      3.714276       -0.014058       0.040000 
      3.760389       -0.014058       0.050000 
      3.791445       -0.014058       0.090000 
      3.821843       -0.014058       0.240000 
      3.868329       -0.014058       0.090000 
      3.898970       -0.014058       0.380000 
      3.930466       -0.014058       0.230000 
      3.961663       -0.014058       0.090000 
      3.993002       -0.014072       0.220000 
      4.025172       -0.014501       0.170000 
      4.056093       -0.019457       0.370000 
      4.086128       -0.038255       0.100000 
      4.117986       -0.053952       0.030000 
      4.150162       -0.038255       0.250000 
      4.180906       -0.019457       0.080000 
      4.211678       -0.014501       0.150000 
      4.242859       -0.014072       0.190000 
      4.274104       -0.014058       0.150000 
      4.305340       -0.014058       0.090000 
      4.336237       -0.014058       0.000000 
      4.367861       -0.014058       0.010000 
      4.399188       -0.014058       0.210000 
      4.430641       -0.014058       0.090000 
      4.462400       -0.014058       0.100000 
      4.493649       -0.014058       0.100000 
      4.523955       -0.014058       0.010000 
      4.555569       -0.014058       0.040000 
      4.600663       -0.014058       0.190000 
      4.631039       -0.014058       0.040000 
      4.661530       -0.014058       0.140000 
      4.693478       -0.014058       0.060000 
      4.723728       -0.014058       0.090000 
      4.754043       -0.014072       0.310000 
      4.784880       -0.014501       0.160000 
      4.815745       -0.019457       0.230000 
      4.846758       -0.038255       0.080000 
      4.877056       -0.053953       0.000000 
      4.908105       -0.038282       0.160000 
      4.939375       -0.020344       0.200000 
      4.970848       -0.025300       0.220000 
      5.000708       -0.062466       0.000000 
      5.032238       -0.093860       0.080000 
      5.063356       -0.062895       0.300000 
      5.095218       -0.030255       0.060000 
      5.126092       -0.039142       0.240000 
      5.158171       -0.053993       0.120000 
      5.188362       -0.038699       0.170000 
      5.219957       -0.024856       0.320000 
      5.250560       -0.038698       0.110000 
      5.281759       -0.053966       0.150000 
      5.312999       -0.038255       0.070000 
      5.359415       -0.019457       0.020000 
      5.391002       -0.014501       0.080000 
      5.422912       -0.014072       0.030000 
      5.453820       -0.014058       0.160000 
      5.484484       -0.014058       0.190000 
      5.515941       -0.014058       0.010000 
      5.547519       -0.014072       0.010000 
      5.577843       -0.014501       0.430000 
      5.608243       -0.019457       0.200000 
      5.639072       -0.038255       0.050000 
      5.669940       -0.053952       0.040000 
      5.718015       -0.038255       0.220000 
      5.749658       -0.019471       0.090000 
      5.781057       -0.014945       0.270000 
      5.811943       -0.019484       0.040000 
      5.859740       -0.038699       0.210000 
      5.889596       -0.059351       0.170000 
      5.920202       -0.062452       0.020000 
      5.950917       -0.059365       0.000000 
      5.981940       -0.039142       0.050000 
      6.013759       -0.024870       0.180000 
      6.045380       -0.038699       0.220000 
      6.076179       -0.053966       0.120000 
      6.107006       -0.038255       0.140000 
      6.137656       -0.019457       0.040000 
      6.169024       -0.014501       0.320000 
      6.200241       -0.014072       0.510000 
      6.230889       -0.014072       0.180000 
      6.261656       -0.014501       0.150000 
      6.293777       -0.019457       0.030000 
      6.324989       -0.038255       0.310000 
      6.355013       -0.053952       0.070000 
      6.386809       -0.038255       0.090000 
      6.418058       -0.019457       0.140000 
      6.449437       -0.014515       0.220000 
      6.480325       -0.014515       0.200000 
      6.511084       -0.019471       0.470000 
      6.541949       -0.038698       0.030000 
      6.572768       -0.059351       0.150000 
      6.603204       -0.062452       0.270000 
      6.634905       -0.059351       0.150000 
      6.665729       -0.038698       0.310000 
      6.696929       -0.019471       0.140000 
      6.728812       -0.014502       0.270000 
      6.759729       -0.014098       0.200000 
      6.790647       -0.014945       0.130000 
      6.822562       -0.024856       0.020000 
      6.853479       -0.062452       0.060000 
      6.884396       -0.093860       0.150000 
      6.916311       -0.062895       0.150000 
      6.946231       -0.030256       0.040000 
      6.978146       -0.039155       0.140000 
      7.008066       -0.054422       0.020000 
      7.038985       -0.043655       0.120000 
      7.068903       -0.043654       0.270000 
      7.098824       -0.054396       0.080000 
      7.129742       -0.038269       0.190000 
      7.159583       -0.019471       0.100000 
      7.191370       -0.014958       0.110000 
      7.222274       -0.019914       0.030000 
      7.253198       -0.043654       0.100000 
      7.284554       -0.078149       0.100000 
      7.314500       -0.078150       0.050000 
      7.346449       -0.043668       0.070000 
      7.376562       -0.020344       0.070000 
      7.406900       -0.019914       0.290000 
      7.438536       -0.038269       0.290000 
      7.470479       -0.053953       0.240000 
      7.500402       -0.038269       0.140000 
      7.532281       -0.019914       0.100000 
      7.562229       -0.020344       0.050000 
      7.594291       -0.043668       1.210000 
      7.625167       -0.078150       0.690000 
      7.656608       -0.078150       0.080000 
      7.687883       -0.043668       0.710000 
      7.719795       -0.020357       3.190000 
      7.749716       -0.020384       4.140000 
      7.780175       -0.044554       4.650000 
      7.811671       -0.088948       5.630000 
      7.843734       -0.126557       7.260000 
      7.874326       -0.123886       9.620000 
      7.904992       -0.073694       10.800000 
      7.936322       -0.049524       15.210000 
      7.967173       -0.055309       25.250000 
      7.997093       -0.044125       36.950000 
      8.027977       -0.049080       48.030000 
      8.057930       -0.079479       61.540000 
      8.089844       -0.088961       79.370000 
      8.119731       -0.092049       102.480000 
      8.151680       -0.099702       111.780000 
      8.183589       -0.063352       127.190000 
      8.213515       -0.030269       142.340000 
      8.245432       -0.039142       149.620000 
      8.277321       -0.053979       164.240000 
      8.307262       -0.038256       179.300000 
      8.339173       -0.019457       191.180000 
      8.370098       -0.014501       203.160000 
      8.400580       -0.014072       216.210000 
      8.432083       -0.014058       226.670000 
      8.464097       -0.014058       232.720000 
      8.496008       -0.014004       245.170000 
      8.526745       -0.012258       248.400000 
      8.558256       0.008519       254.980000 
      8.589576       0.096739       260.480000 
      8.619935       0.235387       264.310000 
      8.650935       0.379658       268.840000 
      8.682263       0.587313       278.990000 
      8.713477       0.787132       286.390000 
      8.743397       0.912324       288.700000 
      8.774091       0.949482       293.630000 
      8.804410       0.944234       295.690000 
      8.834890       0.950919       291.720000 
      8.865981       0.932148       295.360000 
      8.897648       0.905710       302.620000 
      8.929564       0.937534       308.180000 
      8.959788       0.975143       313.090000 
      8.990724       0.985055       319.210000 
      9.020544       0.985915       322.190000 
      9.051788       0.985942       321.860000 
      9.082397       0.985942       323.210000 
      9.112946       0.985942       328.840000 
      9.144460       0.985942       334.440000 
      9.175594       0.985942       340.240000 
      9.206552       0.985942       341.590000 
      9.238180       0.985942       346.740000 
      9.269560       0.985942       344.420000 
      9.300554       0.985942       341.300000 
      9.331305       0.985996       354.140000 
      9.362846       0.987796       353.230000 
      9.393634       1.010292       359.270000 
      9.425226       1.118335       362.680000 
      9.456370       1.332122       355.490000 
      9.488289       1.537422       366.220000 
      9.518209       1.661189       361.120000 
      9.550156       1.696172       358.110000 
      9.582068       1.686885       364.370000 
      9.611985       1.751890       360.580000 
      9.643897       1.866630       367.700000 
      9.675814       1.928037       81.890000 
      9.705740       1.959918       7.080000 
      9.737654       1.975103       4.460000 
      9.769537       1.961301       7.380000 
      9.799493       1.946035       4.660000 
      9.831063       1.961812       9.180000 
      9.862979       1.982759       2.400000 
      9.892873       2.012494       9.750000 
      9.923399       2.106927       5.010000 
      9.955365       2.185856       6.190000 
      9.986655       2.112306       6.860000 
      10.017226       2.036056       6.080000 
      10.049380       2.001240       6.090000 
      10.080200       1.712531       7.130000 
      10.111634       0.559631       5.220000 
      10.143086       -1.240708       5.280000 
      10.173939       -2.350714       8.090000 
      10.205422       -2.769875       4.840000 
      10.237629       -2.997834       7.220000 
      10.268569       -3.257631       5.350000 
      10.299785       -3.632760       7.050000 
      10.330321       -3.901692       4.880000 
      10.361727       -3.974496       7.330000 
      10.393073       -3.973142       4.120000 
      10.424763       -3.989833       6.960000 
      10.455685       -4.008659       4.800000 
      10.487499       -4.013615       6.820000 
      10.517723       -4.014045       5.820000 
      10.548706       -4.014058       6.570000 
      10.580276       -4.014058       5.230000 
      10.611090       -4.014058       6.480000 
      10.641683       -4.014058       5.690000 
      10.672748       -4.014058       5.580000 
      10.704128       -4.014058       7.160000 
      10.736112       -4.014058       5.760000 
      10.767193       -4.014058       6.750000 
      10.798749       -4.014058       6.120000 
      10.829289       -4.014058       7.310000 
      10.860316       -4.014058       5.450000 
      10.891021       -4.014058       6.870000 
      10.922474       -4.014058       5.310000 
      10.953681       -4.014058       7.030000 
      10.984932       -4.014058       4.960000 
      11.015851       -4.014058       6.390000 
      11.045493       -4.014058       5.400000 
      11.076183       -4.014058       6.360000 
      11.106238       -4.014058       5.410000 
      11.136321       -4.014058       5.630000 
      11.167926       -4.014058       6.220000 
      11.197769       -4.014058       5.900000 
      11.228886       -4.014058       6.110000 
      11.260074       -4.014058       6.050000 
      11.291312       -4.014058       6.730000 
      11.321757       -4.014045       5.720000 
      11.353248       -4.013615       6.650000 
      11.383975       -4.008659       5.720000 
      11.414363       -3.989861       6.810000 
      11.446089       -3.974151       5.650000 
      11.477492       -3.989418       6.140000 
      11.509222       -4.003260       5.770000 
      11.539620       -3.989418       6.470000 
      11.570086       -3.974151       5.850000 
      11.601254       -3.989861       6.680000 
      11.633297       -4.008659       6.210000 
      11.665255       -4.013602       6.030000 
      11.695313       -4.013602       6.370000 
      11.726027       -4.008659       6.200000 
      11.757952       -3.989861       6.190000 
      11.788762       -3.974151       5.840000 
      11.820130       -3.989418       5.840000 
      11.851156       -4.003260       5.580000 
      11.882273       -3.989405       6.380000 
      11.912811       -3.973707       5.650000 
      11.943402       -3.984462       6.130000 
      11.974691       -3.984462       5.780000 
      12.006632       -3.973721       6.280000 
      12.037060       -3.989848       5.550000 
      12.068445       -4.008659       6.180000 
      12.100164       -4.013615       5.630000 
      12.131097       -4.014031       6.570000 
      12.162016       -4.013615       6.030000 
      12.193029       -4.008659       6.200000 
      12.223297       -3.989861       6.010000 
      12.254765       -3.974164       6.250000 
      12.285151       -3.989861       5.880000 
      12.316995       -4.008659       5.940000 
      12.347636       -4.013615       6.220000 
      12.378279       -4.014031       6.120000 
      12.409857       -4.013615       6.330000 
      12.440779       -4.008659       6.090000 
      12.472269       -3.989834       6.190000 
      12.503675       -3.973264       5.860000 
      12.533731       -3.978606       6.410000 
      12.564060       -3.954423       5.870000 
      12.595236       -3.904230       5.990000 
      12.626107       -3.901559       6.090000 
      12.657965       -3.939169       6.300000 
      12.687928       -3.983575       5.800000 
      12.719153       -4.008175       6.120000 
      12.750084       -4.013131       5.770000 
      12.781737       -4.007746       6.120000 
      12.812824       -3.978620       5.930000 
      12.844049       -3.920371       6.020000 
      12.875239       -3.885862       5.880000 
      12.905800       -3.919928       5.870000 
      12.936388       -3.973221       5.940000 
      12.967720       -3.983562       5.950000 
      12.998280       -3.973667       6.270000 
      13.029561       -3.988948       5.770000 
      13.060466       -3.997404       6.250000 
      13.091998       -3.959379       5.730000 
      13.122999       -3.904660       6.330000 
      13.153782       -3.901573       5.800000 
      13.185086       -3.939169       6.390000 
      13.216333       -3.983562       5.760000 
      13.247217       -4.007732       6.070000 
      13.277796       -4.007732       5.920000 
      13.308324       -3.983535       6.190000 
      13.340174       -3.938282       5.970000 
      13.370900       -3.890748       5.910000 
      13.402456       -3.855380       6.000000 
      13.433801       -3.868792       6.210000 
      13.465950       -3.900603       6.180000 
      13.496557       -3.897918       5.770000 
      13.528502       -3.919001       6.190000 
      13.558914       -3.948996       6.060000 
      13.589631       -3.938268       5.980000 
      13.620916       -3.924843       5.940000 
      13.651746       -3.938698       5.900000 
      13.683430       -3.953979       6.120000 
      13.713672       -3.938712       6.060000 
      13.744972       -3.925313       5.850000 
      13.776920       -3.944554       6.090000 
      13.808053       -3.984005       6.040000 
      13.839794       -4.007759       6.100000 
      13.871417       -4.008202       5.920000 
      13.902089       -3.989834       6.310000 
      13.933066       -3.973720       5.990000 
      13.963614       -3.984448       6.190000 
      13.994637       -3.984005       5.980000 
      14.026858       -3.967865       6.190000 
      14.057616       -3.959808       5.840000 
      14.089425       -3.939141       5.970000 
      14.120577       -3.924413       6.190000 
      14.150981       -3.932856       6.180000 
      14.182288       -3.924369       6.100000 
      14.212681       -3.874151       5.810000 
      14.244030       -3.854909       6.060000 
      14.275874       -3.879063       5.910000 
      14.307225       -3.878633       5.990000 
      14.338883       -3.849497       6.010000 
      14.369781       -3.849510       6.110000 
      14.401005       -3.879036       5.930000 
      14.431719       -3.883119       6.170000 
      14.462254       -3.862479       5.670000 
      14.493952       -3.836484       6.040000 
      14.525007       -3.809643       6.050000 
      14.556155       -3.844554       6.170000 
      14.587493       -3.899676       6.090000 
      14.618856       -3.909960       6.160000 
      14.650101       -3.898776       6.310000 
      14.682351       -3.833313       6.040000 
      14.714168       -3.755836       6.300000 
      14.745324       -3.732069       6.300000 
      14.776267       -3.769248       6.030000 
      14.806362       -3.829769       5.970000 
      14.836934       -3.862426       6.040000 
      14.868314       -3.888048       5.870000 
      14.898850       -3.897404       6.250000 
      14.930281       -3.860251       6.300000 
      14.961694       -3.815002       6.340000 
      14.992810       -3.844111       6.150000 
      15.023820       -3.888904       6.270000 
      15.055229       -3.862036       5.850000 
      15.086470       -3.825286       6.220000 
      15.116415       -3.820357       5.780000 
      15.148137       -3.838712       6.060000 
      15.180075       -3.858922       5.790000 
      15.210582       -3.857483       6.180000 
      15.241419       -3.840110       6.070000 
      15.271966       -3.817562       5.930000 
      15.302840       -3.809601       5.990000 
      15.334841       -3.775892       6.040000 
      15.366211       -3.706458       5.890000 
      15.397259       -3.621328       6.120000 
      15.428739       -3.634753       6.090000 
      15.459812       -3.716770       5.970000 
      15.506368       -3.741369       6.100000 
      15.536293       -3.774636       5.950000 
      15.568361       -3.822030       5.900000 
      15.599179       -3.823899       5.860000 
      15.631032       -3.778650       5.860000 
      15.661930       -3.768764       5.740000 
      15.694003       -3.776378       6.030000 
      15.725140       -3.751738       6.230000 
      15.756087       -3.759379       6.260000 
      15.788004       -3.750326       6.040000 
      15.817954       -3.714168       6.190000 
      15.849391       -3.744944       5.920000 
      15.879983       -3.798789       6.230000 
      15.910798       -3.798732       6.040000 
      15.941824       -3.745426       6.320000 
      15.972435       -3.634740       6.000000 
      16.004045       -3.592188       6.030000 
      16.034836       -3.642327       6.000000 
      16.066627       -3.710001       6.160000 
      16.097297       -3.757496       5.990000 
      16.128974       -3.703246       6.090000 
      16.160000       -3.620844       6.260000 
      16.190970       -3.631142       6.160000 
      16.221544       -3.692045       6.190000 
      16.253501       -3.693874       5.970000 
      16.283787       -3.633773       6.300000 
      16.315577       -3.630229       6.020000 
      16.347466       -3.667392       6.020000 
      16.377603       -3.643651       6.190000 
      16.409127       -3.567064       6.020000 
      16.440253       -3.575980       5.890000 
      16.471054       -3.699273       6.160000 
      16.502875       -3.774451       5.890000 
      16.534060       -3.733355       6.130000 
      16.565782       -3.658883       5.830000 
      16.597220       -3.647752       6.020000 
      16.627580       -3.668805       5.890000 
      16.657984       -3.708686       5.950000 
      16.688920       -3.735557       6.110000 
      16.719790       -3.751254       5.970000 
      16.750637       -3.793390       6.090000 
      16.781935       -3.767781       6.040000 
      16.813971       -3.684089       6.000000 
      16.845980       -3.650787       6.270000 
      16.876783       -3.658975       6.330000 
      16.907277       -3.647169       6.080000 
      16.938065       -3.597572       6.090000 
      16.969939       -3.567866       5.930000 
      17.001474       -3.632443       6.150000 
      17.032305       -3.674092       6.010000 
      17.064334       -3.661079       5.990000 
      17.095467       -3.563409       6.010000 
      17.126455       -3.468380       6.000000 
      17.156937       -3.537950       5.920000 
      17.189154       -3.601805       6.020000 
      17.220436       -3.579686       5.980000 
      17.251667       -3.583913       6.110000 
      17.283642       -3.655807       6.030000 
      17.314059       -3.694206       5.990000 
      17.345228       -3.674189       6.120000 
      17.376510       -3.600093       6.190000 
      17.407783       -3.571133       6.110000 
      17.439062       -3.627860       6.110000 
      17.470636       -3.657106       6.220000 
      17.501803       -3.581761       5.960000 
      17.532469       -3.489919       6.180000 
      17.564245       -3.486792       6.160000 
      17.594540       -3.626168       6.160000 
      17.625178       -3.722417       6.110000 
      17.656412       -3.626211       6.200000 
      17.687324       -3.551756       5.770000 
      17.719243       -3.593945       6.120000 
      17.750123       -3.660181       6.050000 
      17.780712       -3.718530       5.970000 
      17.812643       -3.694179       6.050000 
      17.843983       -3.610527       6.150000 
      17.875431       -3.511389       5.950000 
      17.906870       -3.491355       5.960000 
      17.937643       -3.556639       5.760000 
      17.969239       -3.618585       6.110000 
      18.000156       -3.685777       6.040000 
      18.031074       -3.735043       6.040000 
      18.060994       -3.702833       6.020000 
      18.091878       -3.702377       5.990000 
      18.122798       -3.728798       5.930000 
      18.154550       -3.652138       5.870000 
      18.185463       -3.547394       5.790000 
      18.216385       -3.536499       5.890000 
      18.247902       -3.611454       6.000000 
      18.278818       -3.681264       6.120000 
      18.309762       -3.728399       6.230000 
      18.341649       -3.732802       6.410000 
      18.372597       -3.718543       6.060000 
      18.403517       -3.708176       5.960000 
      18.435124       -3.678176       6.150000 
      18.466342       -3.614528       6.110000 
      18.497633       -3.556239       5.810000 
      18.529775       -3.554923       6.060000 
      18.560727       -3.597431       5.890000 
      18.591639       -3.594290       5.990000 
      18.622243       -3.532913       5.900000 
      18.653899       -3.519914       6.100000 
      18.685029       -3.525726       6.090000 
      18.716285       -3.504243       6.090000 
      18.747030       -3.530672       6.060000 
      18.778013       -3.602333       6.060000 
      18.809206       -3.635956       6.140000 
      18.840637       -3.577720       5.990000 
      18.872120       -3.480879       6.100000 
      18.902589       -3.442424       6.010000 
      18.933804       -3.488020       5.930000 
      18.965900       -3.539207       6.360000 
      18.997324       -3.512163       6.030000 
      19.027918       -3.485904       6.030000 
      19.058332       -3.506804       6.060000 
      19.089214       -3.515883       6.130000 
      19.120399       -3.458467       6.190000 
      19.150385       -3.460765       6.040000 
      19.180675       -3.525230       6.030000 
      19.211887       -3.556221       5.890000 
      19.244082       -3.559795       6.160000 
      19.275944       -3.550409       6.050000 
      19.306842       -3.579993       6.020000 
      19.337242       -3.658895       5.820000 
      19.368092       -3.715289       6.230000 
      19.399190       -3.698359       6.170000 
      19.429271       -3.623418       6.240000 
      19.459776       -3.581888       5.960000 
      19.491694       -3.588906       6.330000 
      19.523567       -3.610514       6.140000 
      19.553487       -3.616260       6.000000 
      19.585429       -3.623913       6.020000 
      19.617346       -3.584892       6.090000 
      19.647254       -3.539239       5.890000 
      19.679182       -3.566107       6.260000 
      19.711097       -3.603703       6.040000 
      19.741013       -3.618101       6.180000 
      19.772935       -3.631916       6.070000 
      19.804849       -3.618057       6.110000 
      19.834735       -3.538699       5.950000 
      19.865685       -3.460806       6.200000 
      19.896629       -3.446381       5.890000 
      19.928520       -3.471963       6.260000 
      19.959052       -3.527111       5.850000 
      19.990326       -3.613517       6.080000 
      20.022376       -3.628815       6.190000 
      20.053193       -3.605034       6.060000 
      20.084157       -3.614916       5.870000 
      20.115147       -3.546738       6.240000 
      20.146221       -3.436595       5.940000 
      20.177703       -3.392564       6.170000 
      20.208144       -3.443681       5.980000 
      20.239193       -3.506373       6.040000 
      20.269977       -3.466921       5.820000 
      20.300767       -3.361168       6.030000 
      20.331416       -3.320897       5.940000 
      20.362122       -3.375020       6.090000 
      20.393970       -3.405142       5.910000 
      20.424943       -3.406391       6.190000 
      20.456250       -3.455767       5.910000 
      20.486953       -3.470452       6.110000 
      20.517979       -3.434295       6.250000 
      20.549836       -3.375507       6.110000 
      20.581125       -3.362161       6.120000 
      20.611083       -3.426629       6.060000 
      20.642042       -3.536912       6.090000 
      20.674016       -3.630086       6.000000 
      20.705177       -3.612174       6.150000 
      20.736730       -3.509119       6.040000 
      20.767651       -3.460778       6.050000 
      20.799040       -3.475020       6.160000 
      20.829979       -3.465194       6.200000 
      20.860769       -3.456197       6.120000 
      20.891160       -3.482565       6.150000 
      20.923166       -3.412698       6.060000 
      20.953802       -3.264767       6.080000 
      20.984199       -3.199913       5.910000 
      21.015585       -3.245023       5.950000 
