Human trial picking the raspberry twin 

 time    ||     output compensated 

      0       -800.940000 
      0       -800.940000 
      0       -800.940000 
      0       -800.940000 
      0       -800.940000 
      0       -800.940000 
      0       -800.940000 
      0       -800.940000 
      0       -800.940000 
      0       -800.939995 
      0       -800.938804 
      0       -800.831606 
      0       -797.281709 
      0       -754.035375 
      0       -560.221807 
      0       -240.688698 
      0       -46.895770 
      0       -3.671335 
      0       -0.138989 
      0       -0.014669 
      0       0.003881 
      0       0.010280 
      0       0.009272 
      0       0.010723 
      0       0.009272 
      0       0.010280 
      0       0.003886 
      0       -0.013474 
      0       -0.030609 
      0       -0.013474 
      0       0.003886 
      0       0.010280 
      0       0.009272 
      0       0.010723 
      1       0.009285 
      1       0.010723 
      1       0.009285 
      1       0.010723 
      1       0.009272 
      1       0.010280 
      1       0.003886 
      1       -0.013474 
      1       -0.030609 
      1       -0.013474 
      1       0.003886 
      1       0.010280 
      1       0.009272 
      1       0.010723 
      1       0.009272 
      1       0.010267 
      1       0.003456 
      1       -0.018456 
      1       -0.050280 
      1       -0.039539 
      1       -0.023842 
      1       -0.031496 
      1       -0.013943 
      1       -0.001513 
      1       -0.013917 
      1       -0.030623 
      1       -0.013474 
      1       0.003886 
      1       0.010280 
      1       0.009258 
      1       0.010267 
      1       0.003456 
      2       -0.018443 
      2       -0.049837 
      2       -0.034140 
      2       0.000355 
      2       0.008412 
      2       0.010697 
      2       0.009285 
      2       0.010723 
      2       0.009285 
      2       0.010723 
      2       0.009285 
      2       0.010697 
      2       0.008399 
      2       -0.000075 
      2       -0.039109 
      2       -0.069065 
      2       -0.039109 
      2       -0.000075 
      2       0.008399 
      2       0.010697 
      2       0.009285 
      2       0.010723 
      2       0.009285 
      2       0.010723 
      2       0.009285 
      2       0.010723 
      2       0.009285 
      2       0.010723 
      2       0.009285 
      2       0.010723 
      2       0.009258 
      2       0.009824 
      2       -0.001943 
      2       -0.042640 
      2       -0.089731 
      2       -0.058337 
      3       -0.005044 
      3       0.007969 
      3       0.010683 
      3       0.009285 
      3       0.010723 
      3       0.009285 
      3       0.010723 
      3       0.009285 
      3       0.010723 
      3       0.009285 
      3       0.010723 
      3       0.009285 
      3       0.010723 
      3       0.009285 
      3       0.010723 
      3       0.009285 
      3       0.010723 
      3       0.009285 
      3       0.010616 
      3       0.009086 
      3       0.010419 
      3       0.008891 
      3       0.010226 
      3       0.008700 
      3       0.010037 
      3       0.008512 
      3       0.009851 
      3       0.008329 
      3       0.009670 
      3       0.008149 
      3       0.009491 
      3       0.007959 
      3       0.008878 
      3       0.002432 
      3       -0.015629 
      3       -0.042249 
      3       -0.062083 
      3       -0.075356 
      3       -0.037192 
      3       -0.000599 
      4       0.010657 
      4       0.009965 
      4       0.010889 
      4       0.004424 
      4       -0.013671 
      4       -0.040776 
      4       -0.066807 
      4       -0.113362 
      4       -0.146188 
      4       -0.139585 
      4       -0.061709 
      4       -0.000941 
      4       0.015237 
      4       0.010045 
      4       -0.007202 
      4       -0.024094 
      4       -0.006889 
      4       0.010366 
      4       0.016593 
      4       0.015428 
      4       0.016711 
      4       0.015120 
      4       0.016393 
      4       0.014805 
      4       0.016081 
      4       0.014483 
      4       0.015323 
      4       0.008401 
      4       -0.014201 
      4       -0.054540 
      4       -0.071180 
      4       -0.053282 
      4       -0.012269 
      5       0.010345 
      5       0.016146 
      5       0.004774 
      5       -0.035550 
      5       -0.081815 
      5       -0.049916 
      5       0.003343 
      5       0.016192 
      5       0.018718 
      5       0.017146 
      5       0.018399 
      5       0.016791 
      5       0.018047 
      5       0.016442 
      5       0.017702 
      5       0.016101 
      5       0.017364 
      5       0.015766 
      5       0.017033 
      5       0.015438 
      5       0.016708 
      5       0.015117 
      5       0.016363 
      5       0.013938 
      5       0.005822 
      5       -0.028386 
      5       -0.043656 
      5       -0.012564 
      5       0.004335 
      5       -0.007576 
      5       -0.024026 
      5       -0.006808 
      5       0.010446 
      5       0.016646 
      6       0.014629 
      6       0.006081 
      6       -0.033474 
      6       -0.072609 
      6       -0.079446 
      6       -0.071088 
      6       -0.030908 
      6       0.008896 
      6       0.017222 
      6       0.019325 
      6       0.017734 
      6       0.018981 
      6       0.017367 
      6       0.018617 
      6       0.017007 
      6       0.018261 
      6       0.016654 
      6       0.017912 
      6       0.016296 
      6       0.017131 
      6       0.010629 
      6       -0.006663 
      6       -0.023587 
      6       -0.007238 
      6       0.000208 
      6       -0.030684 
      6       -0.062456 
      6       -0.029314 
      6       0.006775 
      6       0.017944 
      6       0.017192 
      6       0.018470 
      6       0.016862 
      6       0.018117 
      6       0.016512 
      6       0.017771 
      6       0.016169 
      6       0.017431 
      6       0.015833 
      6       0.017099 
      6       0.015504 
      6       0.016746 
      7       0.014304 
      7       0.005772 
      7       -0.032943 
      7       -0.062695 
      7       -0.037332 
      7       -0.017350 
      7       -0.029234 
      7       -0.029737 
      7       -0.027767 
      7       -0.005619 
      7       0.012049 
      7       0.018272 
      7       0.017091 
      7       0.018357 
      7       0.016749 
      7       0.017980 
      7       0.015525 
      7       0.006981 
      7       -0.031746 
      7       -0.061511 
      7       -0.036145 
      7       -0.015750 
      7       -0.022744 
      7       -0.004728 
      7       0.011681 
      7       0.008082 
      7       -0.030231 
      7       -0.059997 
      7       -0.034647 
      7       -0.014267 
      7       -0.021275 
      7       -0.003248 
      7       0.013984 
      7       0.019736 
      8       0.013221 
      8       -0.008578 
      8       -0.039572 
      8       -0.023636 
      8       0.010750 
      8       0.018619 
      8       0.020695 
      8       0.019090 
      8       0.020323 
      8       0.018696 
      8       0.019934 
      8       0.018336 
      8       0.020415 
      8       0.028161 
      8       0.061191 
      8       0.066719 
      8       0.002246 
      8       -0.036421 
      8       -0.010282 
      8       0.011488 
      8       0.023009 
      8       0.040403 
      8       0.056976 
      8       0.039443 
      8       0.021862 
      8       0.015313 
      8       0.016159 
      8       0.014560 
      8       0.015838 
      8       0.014256 
      9       0.015537 
      9       0.013958 
      9       0.015242 
      9       0.013666 
      9       0.014953 
      9       0.013380 
      9       0.014670 
      9       0.013099 
      9       0.014392 
      9       0.012824 
      9       0.014120 
      9       0.012582 
      9       0.014771 
      9       0.024355 
      9       0.079708 
      9       0.192466 
      9       0.344194 
      9       0.535519 
      9       0.752117 
      9       0.905183 
      9       0.962405 
      9       0.963816 
      9       0.971137 
      9       0.988551 
      9       1.006600 
      9       1.001176 
      9       1.043896 
      9       1.176522 
      9       1.355451 
      9       1.509620 
      9       1.649128 
      9       1.803280 
      9       1.918118 
      9       1.957101 
      9       1.965268 
      9       1.964340 
      9       1.966652 
      9       1.975179 
      9       2.015946 
      9       2.066196 
      9       2.117744 
      9       2.177367 
      10       2.204789 
      10       2.275635 
      10       2.383666 
      10       2.482791 
      10       2.630205 
      10       2.741804 
      10       2.767772 
      10       2.702782 
      10       2.505978 
      10       2.277907 
      10       2.088677 
      10       1.987831 
      10       1.967593 
      10       1.964381 
      10       1.965766 
      10       1.964313 
      10       1.965309 
      10       1.958498 
      10       1.936599 
      10       1.905178 
      10       1.920029 
      10       1.945056 
      10       1.920916 
      10       1.916016 
      10       1.986323 
      10       2.054510 
      10       2.087181 
      10       2.105674 
      10       2.090405 
      10       2.096415 
      10       2.208432 
      10       2.466665 
      10       2.731516 
      10       2.889699 
      10       2.949654 
      10       2.915100 
      10       2.652716 
      10       1.839339 
      10       0.377065 
      11       -0.881849 
      11       -1.003763 
      11       -0.716831 
      11       -0.587468 
      11       -0.607396 
      11       -0.785981 
      11       -0.998614 
      11       -1.272538 
      11       -1.675626 
      11       -2.130109 
      11       -2.565074 
      11       -2.831713 
      11       -2.921610 
      11       -2.944051 
      11       -2.955077 
      11       -2.965049 
      11       -2.943813 
      11       -2.916651 
      11       -2.886086 
      11       -2.858650 
      11       -2.828639 
      11       -2.830078 
      12       -2.828639 
      12       -2.830078 
      12       -2.828639 
      12       -2.830091 
      12       -2.829082 
      12       -2.835477 
      12       -2.852836 
      12       -2.869972 
      12       -2.852836 
      12       -2.835490 
      12       -2.829539 
      12       -2.835947 
      12       -2.858679 
      12       -2.899568 
      12       -2.916928 
      12       -2.899568 
      12       -2.858679 
      12       -2.835933 
      12       -2.829096 
      12       -2.830091 
      12       -2.828639 
      12       -2.830078 
      12       -2.828639 
      12       -2.830078 
      12       -2.828639 
      12       -2.830078 
      12       -2.828639 
      12       -2.830078 
      12       -2.828639 
      12       -2.830078 
      12       -2.828639 
      12       -2.830078 
      12       -2.828639 
      12       -2.830078 
      13       -2.828639 
      13       -2.830078 
      13       -2.828639 
      13       -2.830078 
      13       -2.828639 
      13       -2.830078 
      13       -2.828639 
      13       -2.830078 
      13       -2.828639 
      13       -2.830078 
      13       -2.828639 
      13       -2.830078 
      13       -2.828639 
      13       -2.830078 
      13       -2.828639 
      14       -2.830078 
      14       -2.828639 
      14       -2.830078 
      14       -2.828639 
      14       -2.830077 
      14       -2.828626 
      14       -2.829621 
      14       -2.822810 
      14       -2.800911 
      14       -2.769517 
      14       -2.785214 
      14       -2.819709 
      14       -2.827766 
      14       -2.830051 
      14       -2.828639 
      14       -2.830078 
      14       -2.828639 
      14       -2.830078 
      15       -2.800353 
      15       -2.773773 
      15       -2.744612 
      15       -2.718603 
      15       -2.690418 
      15       -2.669818 
      15       -2.659455 
      15       -2.640012 
      15       -2.559427 
      15       -2.485567 
      15       -2.485461 
      15       -2.498825 
      15       -2.482212 
      15       -2.459665 
      15       -2.433670 
      16       -2.410758 
      16       -2.385213 
      16       -2.362346 
      16       -2.331954 
      16       -2.286103 
      16       -2.222349 
      16       -2.178446 
      16       -2.159731 
      16       -2.177190 
      16       -2.194901 
      16       -2.181366 
      16       -2.161828 
      16       -2.138812 
      16       -2.118848 
      16       -2.096262 
      16       -2.077574 
      16       -2.065187 
      16       -2.083180 
      16       -2.092004 
      16       -2.041428 
      16       -1.982370 
      16       -1.954170 
      16       -1.932779 
      17       -1.919755 
      17       -1.917744 
      17       -1.915530 
      17       -1.879411 
      17       -1.843431 
      17       -1.818666 
      17       -1.801478 
      17       -1.782026 
      17       -1.765630 
      17       -1.746549 
      17       -1.730508 
      17       -1.711779 
      17       -1.696085 
      17       -1.677700 
      17       -1.662347 
      17       -1.644300 
      17       -1.629281 
      17       -1.611564 
      17       -1.596846 
      17       -1.578602 
      17       -1.554428 
      18       -1.500239 
      18       -1.455581 
      18       -1.470681 
      18       -1.494618 
      18       -1.488061 
      18       -1.475455 
      18       -1.459303 
      18       -1.446134 
      18       -1.430249 
      18       -1.417370 
      18       -1.401773 
      18       -1.389179 
      18       -1.373863 
      18       -1.361548 
      18       -1.346509 
      18       -1.334441 
      18       -1.318822 
      18       -1.297219 
      18       -1.244751 
      18       -1.192848 
      18       -1.173781 
      18       -1.174487 
      18       -1.219970 
      18       -1.252993 
      18       -1.196118 
      19       -1.136742 
      19       -1.150150 
      19       -1.176868 
      19       -1.173475 
      19       -1.164015 
      19       -1.150977 
      19       -1.140905 
      19       -1.128510 
      19       -1.123968 
      19       -1.134408 
      19       -1.154144 
      19       -1.127063 
      19       -1.081642 
      19       -1.062849 
      19       -1.049959 
      19       -1.040857 
      19       -1.029011 
      19       -1.019706 
      19       -1.002766 
      19       -0.971059 
      19       -0.930268 
      20       -0.936505 
      20       -0.961291 
      20       -0.959654 
      20       -0.952319 
      20       -0.941398 
      20       -0.933408 
      20       -0.922650 
      20       -0.914848 
      20       -0.904275 
      20       -0.896657 
      20       -0.886266 
