

 time    ||    gripping force   ||   raspberry measurement 

      0       0.200000       -794.174468 
      0       1.270000       -794.174468 
      0       0.070000       -794.174468 
      0       0.220000       -794.174468 
      0       0.410000       -794.174468 
      0       0.190000       -794.174468 
      0       0.180000       -794.174468 
      0       0.210000       -794.174468 
      0       0.100000       -794.174468 
      0       0.320000       -794.174463 
      0       0.200000       -794.173282 
      0       0.250000       -794.066981 
      0       0.050000       -790.546791 
      1       0.160000       -747.662639 
      1       0.030000       -555.475621 
      1       0.060000       -238.637903 
      1       0.020000       -46.486209 
      1       0.060000       -3.571256 
      1       0.120000       0.002794 
      1       0.060000       0.109481 
      1       0.230000       0.062742 
      1       0.240000       -0.024173 
      1       0.160000       -0.031813 
      1       0.130000       0.022852 
      2       0.060000       0.069913 
      2       0.350000       0.091882 
      2       10.300000       0.016984 
      2       22.950000       0.001466 
      2       52.160000       0.120013 
      2       59.420000       0.157341 
      2       65.430000       0.057751 
      2       68.820000       -0.025459 
      2       68.080000       -0.044010 
      3       67.680000       -0.020976 
      3       67.370000       0.007111 
      3       67.140000       0.056931 
      3       66.960000       0.050177 
      3       66.780000       0.044915 
      3       66.630000       0.095110 
      3       66.550000       0.147615 
      3       66.390000       0.284010 
      3       66.330000       0.521964 
      3       66.200000       0.765928 
      3       66.000000       0.984729 
      3       65.950000       1.225012 
      3       65.860000       1.458190 
      3       65.770000       1.625826 
      4       65.580000       1.709300 
      4       65.510000       1.727253 
      4       65.350000       1.741192 
      4       65.280000       1.725522 
      4       65.230000       1.709382 
      4       65.190000       1.716580 
      4       65.100000       1.693642 
      4       65.100000       1.657458 
      4       65.020000       1.635366 
      5       64.940000       1.652072 
      5       64.890000       1.669445 
      5       64.870000       1.676699 
      5       64.880000       1.685602 
      5       64.780000       1.724649 
      5       64.730000       1.754606 
      5       64.660000       1.724663 
      5       64.670000       1.686059 
      5       64.560000       1.682554 
      5       64.540000       1.699484 
      5       64.550000       1.721563 
      6       64.470000       1.723668 
      6       64.490000       1.727404 
      6       64.490000       1.729510 
      6       64.250000       1.751588 
      6       64.190000       1.768464 
      6       64.040000       1.763214 
      6       63.730000       1.703926 
      6       63.120000       1.588853 
      6       62.510000       1.517539 
      6       62.040000       1.577196 
      6       61.770000       1.644747 
      6       61.750000       1.635448 
      7       61.700000       1.644781 
      7       61.750000       1.705337 
      7       61.750000       1.703456 
      7       61.560000       1.640391 
      7       61.370000       1.604870 
      7       61.260000       1.587897 
      7       60.180000       1.539919 
      7       59.810000       1.536751 
      7       59.830000       1.564974 
      7       59.780000       1.556887 
      7       59.820000       1.493256 
      7       59.800000       1.411279 
      7       59.780000       1.438161 
      8       59.780000       1.512524 
      8       59.200000       1.556930 
      8       58.870000       1.610657 
      8       58.820000       1.613394 
      8       58.790000       1.574360 
      8       58.850000       1.533247 
      8       58.830000       1.508883 
      8       57.930000       1.524277 
      8       57.430000       1.525882 
      8       57.450000       1.531390 
      8       57.430000       1.469404 
      9       57.430000       1.396024 
      9       57.450000       1.378015 
      9       57.480000       1.374857 
      9       57.430000       1.375813 
      9       57.380000       1.369405 
      9       57.330000       1.351628 
      9       56.410000       1.329954 
      9       56.080000       1.332844 
      9       56.100000       1.349221 
      9       56.110000       1.378527 
      9       56.150000       1.406614 
      9       56.140000       1.450201 
      9       56.070000       1.409728 
      10       56.060000       1.330549 
      10       56.110000       1.325952 
      10       56.130000       1.325036 
      10       56.080000       1.254260 
      10       56.020000       1.185642 
      10       56.030000       1.148459 
      10       55.480000       1.116621 
      10       55.330000       1.142150 
      10       54.880000       1.212952 
      10       54.860000       1.237575 
      10       54.830000       1.153334 
      10       54.900000       1.081243 
      10       54.890000       1.166357 
      11       54.900000       1.230378 
      11       54.830000       1.173088 
      11       54.850000       1.165474 
      11       54.860000       1.191356 
      11       54.840000       1.135919 
      11       54.820000       1.104524 
      11       54.750000       1.153734 
      11       54.530000       1.154716 
      11       54.250000       1.162719 
      11       54.190000       1.196785 
      11       54.060000       1.141619 
      11       54.000000       1.063273 
      11       54.050000       1.016568 
      11       54.000000       1.025616 
      12       53.950000       1.037165 
      12       54.040000       1.020248 
      12       53.960000       1.056449 
      12       53.970000       1.116606 
      12       53.940000       1.147421 
      12       54.020000       1.172188 
      12       53.900000       1.171162 
      12       53.010000       1.156057 
      12       53.000000       1.075703 
      12       53.000000       1.007252 
      12       52.990000       1.026020 
      12       53.020000       1.050616 
      12       53.030000       1.017524 
      13       53.040000       1.028707 
      13       53.010000       1.116952 
      13       53.000000       1.113825 
      13       52.980000       1.073114 
      13       52.970000       1.082874 
      13       53.000000       1.050230 
      13       52.700000       1.010445 
      13       52.570000       1.026939 
      14       52.580000       1.037937 
      14       52.570000       1.034261 
      14       52.550000       1.022082 
      14       52.520000       1.003446 
      14       52.520000       0.953478 
      14       52.470000       0.899142 
      14       52.390000       0.859071 
      14       52.350000       0.823894 
      14       52.440000       0.855123 
      14       52.400000       0.920191 
      14       52.040000       0.942043 
      15       52.030000       0.929539 
      15       52.060000       0.871375 
      15       52.020000       0.785121 
      15       51.980000       0.728375 
      15       52.000000       0.717184 
      15       51.980000       0.732143 
      15       51.950000       0.772310 
      15       51.920000       0.824954 
      15       51.930000       0.909385 
      15       51.830000       0.936717 
      15       51.850000       0.865202 
      16       51.890000       0.808258 
      16       51.850000       0.766816 
      16       51.780000       0.731259 
      16       51.840000       0.684824 
      16       51.820000       0.661159 
      16       51.860000       0.675802 
      16       51.750000       0.653530 
      16       51.790000       0.623548 
      16       51.830000       0.658496 
      16       51.770000       0.742507 
      16       51.780000       0.830368 
      16       51.780000       0.839441 
      17       51.760000       0.740489 
      17       51.760000       0.645749 
      17       51.750000       0.592229 
      17       51.760000       0.596063 
      17       51.750000       0.610484 
      17       51.750000       0.614626 
      17       51.740000       0.633711 
      17       51.610000       0.611438 
      17       51.590000       0.635965 
      17       51.560000       0.711597 
      17       51.490000       0.656597 
      18       51.560000       0.544497 
      18       51.490000       0.498585 
      18       51.460000       0.494568 
      18       51.470000       0.523746 
      18       51.460000       0.540218 
      18       51.420000       0.537091 
      18       51.400000       0.582262 
      18       51.470000       0.610615 
      18       51.420000       0.578322 
      18       51.400000       0.550846 
      18       51.430000       0.533289 
      18       51.430000       0.505864 
      18       51.380000       0.470550 
      18       51.390000       0.490758 
      19       51.420000       0.551876 
      19       51.420000       0.561485 
      19       51.440000       0.488408 
      19       51.320000       0.430790 
      19       51.370000       0.450820 
      19       51.360000       0.484544 
      19       51.350000       0.488951 
      19       51.370000       0.496974 
      19       51.340000       0.536801 
      19       51.330000       0.591783 
      19       51.380000       0.552540 
      20       51.310000       0.472149 
      20       51.310000       0.479295 
      20       51.300000       0.483872 
      20       51.340000       0.436855 
      20       51.290000       0.426759 
      20       51.270000       0.434424 
      20       51.270000       0.437661 
      20       51.300000       0.451485 
      20       51.320000       0.518340 
      20       51.280000       0.559352 
      20       51.270000       0.486692 
      20       51.320000       0.404328 
      20       51.300000       0.368627 
      20       51.310000       0.385922 
      21       51.280000       0.421875 
      21       51.280000       0.448350 
      21       51.300000       0.406511 
      21       51.330000       0.348865 
      21       51.270000       0.392792 
      21       51.290000       0.462067 
      21       51.230000       0.413061 
      21       51.260000       0.332232 
      21       51.310000       0.347928 
      21       51.280000       0.383037 
      21       51.210000       0.333559 
      21       51.270000       0.273820 
      21       51.270000       0.268064 
      21       51.290000       0.306112 
      21       51.280000       0.369697 
      22       51.270000       0.414744 
      22       51.230000       0.445228 
      22       51.300000       0.419921 
      22       51.220000       0.417581 
      22       51.300000       0.439020 
      22       51.240000       0.367727 
      22       51.220000       0.352977 
      22       51.190000       0.426971 
      22       51.140000       0.402827 
      22       51.120000       0.351744 
      22       51.280000       0.351322 
      23       51.150000       0.347779 
      23       51.140000       0.342603 
      23       51.180000       0.317306 
      23       51.160000       0.296522 
      23       51.110000       0.287239 
      23       51.100000       0.286203 
      23       51.120000       0.291278 
      23       51.120000       0.321677 
      23       51.150000       0.324600 
      23       51.100000       0.257548 
      23       51.140000       0.216328 
      24       51.130000       0.239940 
      24       51.090000       0.259207 
      24       51.080000       0.268251 
      24       51.080000       0.283192 
      24       51.070000       0.297312 
      24       51.120000       0.276563 
      24       51.080000       0.248076 
      24       51.080000       0.216790 
      24       51.060000       0.241208 
      25       51.060000       0.324460 
      25       51.070000       0.345952 
      25       51.100000       0.311577 
      25       51.010000       0.258220 
      25       51.070000       0.210454 
      25       51.050000       0.181698 
      25       51.030000       0.231365 
      25       50.970000       0.284868 
      25       51.070000       0.226189 
      25       50.960000       0.171991 
      25       51.060000       0.191126 
      26       51.020000       0.204699 
      26       51.070000       0.185441 
      26       51.060000       0.143982 
      26       51.030000       0.130675 
      26       51.010000       0.169220 
      26       51.010000       0.232319 
      26       51.010000       0.214456 
      26       50.990000       0.144436 
      26       50.990000       0.116406 
      26       50.990000       0.126298 
      27       50.980000       0.142811 
      27       50.950000       0.139124 
      27       50.980000       0.176376 
      27       50.980000       0.214903 
      27       50.990000       0.167145 
      27       51.020000       0.108645 
      27       50.990000       0.099582 
      27       50.950000       0.118990 
      27       50.920000       0.148867 
      27       50.910000       0.132676 
      28       50.970000       0.106600 
      28       50.870000       0.130323 
      28       50.890000       0.145012 
      28       50.930000       0.127640 
      28       50.910000       0.166709 
      28       50.880000       0.238687 
      28       50.930000       0.267355 
      28       50.890000       0.261612 
      28       50.860000       0.210604 
      28       50.930000       0.137580 
      28       50.870000       0.125983 
      28       50.870000       0.216088 
      29       50.860000       0.304879 
      29       50.820000       0.286689 
      29       50.810000       0.193842 
      29       50.760000       0.122162 
      29       50.800000       0.103273 
      29       50.800000       0.079080 
      29       50.710000       0.061476 
      29       50.800000       0.063918 
      29       50.720000       0.097043 
      30       50.760000       0.112876 
      30       50.740000       0.095386 
      30       50.690000       0.128582 
      30       50.770000       0.167200 
      30       50.670000       0.120731 
      30       50.720000       0.071657 
      30       50.750000       0.090411 
      30       50.700000       0.105034 
      30       50.870000       0.087171 
      30       50.630000       0.115981 
      30       50.750000       0.141434 
      30       50.660000       0.102773 
      31       50.610000       0.098663 
      31       50.530000       0.117146 
      31       50.400000       0.086718 
      31       50.380000       0.061500 
      31       50.290000       0.104258 
      31       50.320000       0.138378 
      31       50.280000       0.109808 
      31       50.280000       0.093773 
      32       50.260000       0.102866 
      32       50.250000       0.114868 
      32       50.290000       0.076308 
      32       50.260000       0.040174 
      32       50.260000       0.038335 
      32       50.250000       0.075745 
      32       50.290000       0.104644 
      32       50.250000       0.074792 
      32       50.260000       0.045213 
      33       50.190000       0.073605 
      33       50.290000       0.102113 
      33       50.270000       0.076728 
      33       50.220000       0.060421 
      33       50.250000       0.081084 
      33       50.260000       0.063882 
      33       50.170000       0.029067 
      33       50.200000       0.020813 
      33       50.180000       0.018768 
      33       50.200000       0.024885 
      33       50.190000       0.041861 
      33       50.200000       0.059684 
      34       50.230000       0.056881 
      34       50.180000       0.096220 
      34       50.150000       0.149868 
      34       50.190000       0.154522 
      34       50.200000       0.133533 
      34       50.220000       0.093975 
      34       50.180000       0.081550 
      34       50.200000       0.059837 
      34       50.220000       0.042834 
      35       50.180000       0.049943 
      35       50.190000       0.031641 
      35       50.200000       0.014113 
      35       50.170000       0.007641 
      35       50.150000       0.008563 
      35       50.160000       0.007040 
      35       50.160000       0.008407 
      35       50.160000       0.007338 
      35       50.160000       0.014033 
      35       50.230000       0.036411 
      35       50.200000       0.076527 
      35       50.150000       0.092948 
      35       50.150000       0.074846 
      36       50.140000       0.034042 
      36       50.160000       0.016104 
      36       50.130000       0.028222 
      36       50.180000       0.049811 
      36       50.240000       0.056277 
      36       50.140000       0.077585 
      36       50.190000       0.089088 
      36       50.080000       0.070586 
      36       50.080000       0.029413 
      36       49.970000       0.007439 
      37       49.970000       0.009996 
      37       49.980000       0.043607 
      37       49.950000       0.058698 
      37       50.010000       0.027030 
      37       49.990000       0.005080 
      37       49.990000       -0.001713 
      37       49.920000       -0.000697 
      37       49.920000       -0.001689 
      37       49.950000       0.005070 
      37       49.970000       0.026700 
      37       49.970000       0.057513 
      37       49.980000       0.041398 
      38       49.860000       0.006834 
      38       49.920000       -0.001185 
      38       49.930000       -0.002584 
      38       49.900000       0.008653 
      38       49.930000       0.044362 
      38       49.890000       0.076423 
      38       49.900000       0.043154 
      38       49.900000       0.006900 
      38       49.860000       -0.005244 
      38       49.950000       -0.014018 
      39       49.870000       -0.048054 
      39       49.900000       -0.063114 
      39       49.830000       -0.031403 
      39       49.880000       -0.009409 
      39       49.850000       -0.002572 
      39       49.860000       -0.003532 
      39       49.820000       -0.002059 
      39       49.850000       -0.003462 
      39       49.870000       -0.001991 
      40       49.920000       -0.002969 
      40       49.810000       0.003404 
      40       49.860000       0.020982 
      40       49.820000       0.042656 
      40       49.850000       0.044313 
      40       49.770000       0.047530 
      40       49.770000       0.047862 
      40       49.810000       0.054522 
      40       49.790000       0.014907 
      40       49.780000       -0.035358 
      40       49.840000       -0.027453 
      41       49.840000       -0.010804 
      41       49.850000       -0.003554 
      41       49.870000       0.004896 
      41       49.860000       0.039436 
      41       49.760000       0.059488 
      41       49.870000       0.046423 
      41       49.800000       0.039832 
      41       49.840000       0.017577 
      42       49.780000       0.004683 
      42       49.760000       0.016929 
      42       49.830000       0.034136 
      42       49.760000       0.026231 
      42       49.790000       0.041934 
      42       49.770000       0.057055 
      42       49.810000       0.043588 
      42       49.770000       0.037013 
      42       49.770000       0.014785 
      43       49.810000       0.001919 
      43       49.740000       0.014193 
      43       49.750000       0.031427 
      43       49.740000       0.023549 
      43       49.760000       0.039293 
      43       49.790000       0.054879 
      43       49.780000       0.046779 
      43       49.770000       0.064074 
      43       49.790000       0.079368 
      44       49.710000       0.070160 
      44       49.770000       0.011779 
      44       49.730000       -0.043361 
      44       49.720000       -0.035802 
      44       49.730000       -0.019110 
      44       49.810000       -0.012614 
      44       49.740000       -0.013487 
      44       49.730000       -0.011902 
      45       49.740000       -0.012781 
      45       49.770000       -0.006350 
      45       49.750000       0.010049 
      45       49.680000       0.017100 
      45       49.750000       -0.037255 
      45       49.730000       -0.085149 
      45       49.710000       -0.059521 
      46       49.700000       -0.019869 
      46       49.720000       -0.001895 
      46       49.730000       0.033112 
      46       49.710000       0.047908 
      46       49.640000       0.011004 
      46       49.750000       -0.034714 
      46       49.720000       -0.079728 
      46       49.700000       -0.091236 
      46       49.780000       -0.050034 
      46       49.740000       0.021041 
      47       49.680000       0.034552 
      47       49.640000       0.028505 
      47       49.730000       0.050339 
      47       49.760000       0.033470 
      47       49.700000       -0.001041 
      47       49.680000       -0.009007 
      47       49.720000       -0.011179 
      47       49.710000       -0.009695 
      47       49.670000       -0.011874 
      47       49.640000       -0.020144 
      47       49.680000       -0.058586 
      48       49.660000       -0.087643 
      48       49.690000       -0.056672 
      48       49.680000       -0.012142 
      48       49.700000       0.019471 
      48       49.710000       0.051208 
      48       49.680000       0.035182 
      48       49.700000       0.000680 
      49       49.710000       -0.007302 
      49       49.720000       -0.009465 
      49       49.700000       -0.007135 
      49       49.700000       0.000913 
      49       49.710000       0.035053 
      49       49.630000       0.050217 
      49       49.660000       0.017810 
      49       49.690000       -0.013023 
      49       49.710000       -0.047442 
      49       49.720000       -0.043924 
      49       49.670000       0.007590 
      49       49.700000       0.026945 
      50       49.730000       0.007245 
      50       49.620000       -0.043916 
      50       49.850000       -0.046959 
      50       49.520000       -0.017246 
      50       49.760000       -0.009110 
      50       49.680000       -0.002302 
      51       49.480000       0.009653 
      51       49.430000       0.004694 
      51       49.350000       -0.027254 
      51       49.460000       0.025778 
      51       49.400000       0.101385 
      51       49.310000       0.061301 
      51       49.040000       0.007120 
      51       49.100000       -0.008629 
      52       49.000000       -0.003050 
      52       49.060000       0.019472 
      52       48.960000       0.060170 
      52       48.960000       0.081248 
      52       49.040000       0.077366 
      52       49.040000       0.037536 
      52       48.970000       -0.002322 
      52       48.980000       -0.010713 
      52       48.930000       -0.012881 
      53       49.010000       -0.011342 
      53       48.950000       -0.012227 
      53       48.970000       -0.005774 
      53       48.960000       0.011469 
      53       48.940000       0.028319 
      53       48.840000       0.011072 
      53       48.930000       -0.006212 
      53       48.870000       -0.012055 
      53       48.880000       -0.006029 
      54       48.980000       0.011204 
      54       48.940000       0.028056 
      54       48.860000       0.010811 
      54       48.910000       -0.006483 
      54       48.910000       -0.012749 
      54       48.850000       -0.011662 
      54       48.940000       -0.014259 
      54       48.920000       -0.027412 
      54       48.920000       -0.084392 
      54       48.890000       -0.128744 
      54       48.830000       -0.082260 
      54       48.860000       -0.024184 
      54       48.860000       -0.010660 
      54       48.820000       -0.008292 
      54       48.840000       -0.014939 
      55       48.840000       -0.037320 
      55       48.850000       -0.077826 
      55       48.890000       -0.098302 
      55       48.780000       -0.089343 
      55       48.810000       -0.030783 
      55       48.800000       0.024547 
      55       48.820000       0.017176 
      55       48.790000       0.000643 
      55       48.830000       -0.006519 
      55       48.870000       -0.015268 
      55       48.860000       -0.053785 
      56       48.760000       -0.083329 
      56       48.880000       -0.057746 
      56       48.750000       -0.037134 
      56       48.890000       -0.043914 
      56       48.850000       -0.025647 
      56       48.860000       -0.007740 
      56       48.830000       0.003987 
      56       48.820000       0.026053 
      56       48.770000       0.056886 
      56       48.830000       0.040777 
      56       48.800000       0.006219 
      57       48.830000       -0.001806 
      57       48.830000       -0.003612 
      57       48.810000       0.003141 
      57       48.790000       0.024789 
      57       48.810000       0.055622 
      57       48.850000       0.039525 
      57       48.830000       0.004980 
      57       48.850000       -0.003046 
      57       48.780000       -0.005278 
      57       48.810000       -0.003827 
      57       48.840000       -0.005213 
      58       48.800000       -0.003737 
      58       48.860000       -0.005123 
      58       48.770000       -0.003648 
      58       48.760000       -0.005036 
      58       48.790000       -0.003561 
      58       48.760000       -0.004950 
      58       48.850000       -0.003476 
      58       48.810000       -0.004865 
      58       48.690000       -0.003393 
      58       48.880000       -0.004783 
      58       48.640000       -0.003311 
      58       49.220000       -0.004702 
      59       49.110000       -0.003231 
      59       48.540000       -0.004623 
      59       49.010000       -0.003152 
      59       48.530000       -0.004505 
      59       48.780000       -0.001773 
      59       48.790000       0.011127 
      59       48.850000       0.063763 
      60       48.770000       0.093767 
      60       48.850000       0.040890 
      60       48.810000       -0.022912 
      60       48.760000       -0.063989 
      60       48.830000       -0.048673 
      60       48.830000       -0.014062 
      60       48.800000       -0.005919 
      60       48.870000       -0.002760 
      60       48.780000       0.005270 
