Human trial picking the raspberry twin 

 time    ||     output compensated 

      0       -800.000000 
      0       -800.000000 
      0       -800.000000 
      0       -800.000000 
      0       -800.000000 
      0       -800.000000 
      0       -800.000000 
      0       -800.000000 
      0       -800.000000 
      0       -799.999995 
      0       -799.998806 
      0       -799.891755 
      0       -796.346706 
      0       -753.158902 
      0       -559.601550 
      0       -240.468392 
      0       -46.895344 
      0       -3.704439 
      1       -0.157535 
      1       -0.051882 
      1       -0.048395 
      1       -0.039890 
      1       0.000004 
      1       0.039899 
      1       0.048398 
      1       0.050697 
      1       0.049284 
      1       0.050697 
      1       0.048398 
      1       0.039899 
      1       0.000005 
      1       -0.039863 
      1       -0.047503 
      1       -0.039863 
      1       0.000004 
      1       0.039872 
      1       0.047512 
      1       0.039899 
      2       0.000891 
      2       -0.029065 
      2       0.000891 
      2       0.039925 
      2       0.048398 
      2       0.050670 
      3       0.048398 
      3       0.039925 
      3       0.000891 
      3       -0.029065 
      3       0.000891 
      3       0.039899 
      3       0.047512 
      3       0.039899 
      3       0.000890 
      3       -0.029092 
      3       0.000004 
      3       0.029100 
      4       -0.000882 
      4       -0.039890 
      4       -0.047504 
      4       -0.039890 
      4       -0.000882 
      4       0.029100 
      4       0.000004 
      4       -0.029119 
      4       0.000004 
      4       0.029127 
      4       0.000004 
      4       -0.029118 
      4       0.000018 
      4       0.029557 
      4       0.004974 
      4       -0.009864 
      4       0.021557 
      4       0.043456 
      4       0.050267 
      4       0.049271 
      4       0.050697 
      4       0.048399 
      4       0.039925 
      4       0.000891 
      5       -0.029065 
      5       0.000891 
      5       0.039899 
      5       0.047512 
      5       0.039872 
      5       0.000004 
      5       -0.039890 
      5       -0.048390 
      5       -0.050661 
      5       -0.048390 
      5       -0.039917 
      5       -0.000882 
      5       0.029100 
      5       0.000004 
      5       -0.029119 
      5       0.000004 
      5       0.029100 
      5       -0.000882 
      5       -0.039917 
      5       -0.048377 
      6       -0.050231 
      6       -0.043420 
      6       -0.020662 
      6       0.020671 
      6       0.043429 
      6       0.050267 
      6       0.049271 
      6       0.050697 
      6       0.048398 
      6       0.039899 
      6       0.000004 
      6       -0.039890 
      6       -0.048390 
      6       -0.050688 
      6       -0.049276 
      6       -0.050715 
      6       -0.049277 
      6       -0.050715 
      6       -0.049276 
      6       -0.050688 
      6       -0.047906 
      7       -0.039012 
      7       0.000873 
      7       0.040360 
      7       0.048371 
      7       0.050163 
      7       0.048263 
      7       0.049205 
      7       0.047289 
      7       0.048240 
      7       0.046333 
      7       0.047268 
      7       0.044520 
      7       0.035660 
      7       -0.004192 
      8       -0.043619 
      8       -0.050746 
      8       -0.042675 
      8       -0.002793 
      8       0.036292 
      8       0.039025 
      8       0.017806 
      8       -0.013453 
      8       0.001371 
      8       0.025669 
      8       -0.004683 
      8       -0.043294 
      8       -0.051249 
      8       -0.052971 
      8       -0.049674 
      8       -0.032772 
      8       0.063542 
      8       0.291851 
      8       0.592921 
      8       0.825868 
      8       0.955656 
      8       1.063562 
      8       1.310102 
      8       1.777335 
      8       2.268514 
      8       2.669428 
      8       2.881017 
      8       2.959753 
      8       3.071427 
      8       3.272809 
      8       3.558879 
      8       3.805861 
      9       3.948129 
      9       4.172450 
      9       4.543098 
      9       4.857066 
      9       5.132792 
      9       5.500425 
      9       5.789042 
      9       5.900893 
      9       5.918741 
      9       5.921173 
      9       5.914820 
      9       5.897434 
      9       5.879411 
      9       5.885722 
      9       5.853774 
      9       5.768655 
      9       5.658730 
      9       5.504976 
      9       5.300937 
      9       5.110863 
      9       4.953828 
      9       4.745355 
      9       4.461138 
      9       4.225329 
      9       4.090373 
      9       4.032925 
      9       4.028415 
      9       4.049427 
      9       4.081264 
      9       4.071879 
      9       4.073293 
      9       4.165222 
      9       4.326545 
      9       4.514862 
      9       4.670759 
      9       4.737215 
      9       4.684283 
      9       4.598807 
      9       4.591150 
      10       4.646242 
      10       4.634641 
      10       4.585778 
      10       4.586722 
      10       4.645883 
      10       4.786193 
      10       4.893709 
      10       4.917976 
      10       4.921591 
      10       4.920272 
      10       4.923458 
      10       4.942729 
      10       5.030131 
      10       5.139056 
      10       5.148927 
      10       5.099802 
      10       5.140997 
      10       5.339865 
      10       5.593255 
      10       5.685332 
      10       5.159901 
      10       3.678756 
      10       1.614363 
      10       0.354784 
      10       0.827015 
      10       1.551439 
      10       1.516361 
      10       0.951064 
      10       0.271851 
      10       -0.248067 
      10       -0.644069 
      10       -0.892890 
      10       -1.015024 
      10       -1.073360 
      10       -1.101625 
      10       -1.119648 
      10       -1.102579 
      10       -1.086523 
      10       -1.095426 
      11       -1.157811 
      11       -1.223109 
      11       -1.191047 
      11       -1.144041 
      11       -1.149883 
      11       -1.149480 
      11       -1.205475 
      11       -1.261469 
      11       -1.261025 
      11       -1.265539 
      11       -1.213930 
      11       -1.122585 
      11       -1.082665 
      11       -1.124783 
      11       -1.156580 
      11       -1.124760 
      11       -1.145413 
      11       -1.199562 
      11       -1.169593 
      11       -1.105975 
      11       -1.112230 
      11       -1.146738 
      11       -1.164668 
      11       -1.204132 
      11       -1.229601 
      11       -1.186220 
      11       -1.154839 
      11       -1.192462 
      11       -1.200102 
      11       -1.194720 
      11       -1.226544 
      11       -1.243097 
      11       -1.226558 
      11       -1.195203 
      11       -1.206818 
      11       -1.232427 
      11       -1.262422 
      11       -1.313075 
      11       -1.313558 
      11       -1.335527 
      11       -1.373154 
      11       -1.391118 
      11       -1.430987 
      11       -1.394663 
      11       -1.330239 
      11       -1.334629 
      11       -1.365553 
      11       -1.426986 
      11       -1.457301 
      11       -1.344053 
      11       -1.186262 
      11       -1.128013 
      11       -1.156249 
      12       -1.269580 
      12       -1.348925 
      12       -1.326903 
      12       -1.293864 
      12       -1.287479 
      12       -1.306830 
      12       -1.254326 
      12       -1.200603 
      12       -1.203717 
      12       -1.209502 
      12       -1.236980 
      12       -1.274910 
      12       -1.313172 
      12       -1.367782 
      12       -1.455666 
      12       -1.469955 
      12       -1.452583 
      12       -1.480293 
      12       -1.435443 
      12       -1.340111 
      12       -1.331015 
      12       -1.332840 
      12       -1.279091 
      12       -1.292990 
      12       -1.347639 
      12       -1.395203 
      12       -1.485724 
      12       -1.582064 
      12       -1.603577 
      12       -1.539516 
      12       -1.488864 
      12       -1.456580 
      12       -1.360625 
      12       -1.286801 
      12       -1.284376 
      12       -1.281931 
      12       -1.284491 
      12       -1.346745 
      12       -1.385026 
      12       -1.412669 
      12       -1.379221 
      12       -1.271172 
      12       -1.225956 
      12       -1.304688 
      12       -1.336400 
      12       -1.304043 
      12       -1.285154 
      12       -1.279480 
      12       -1.300849 
      12       -1.304657 
      12       -1.275223 
      12       -1.295757 
      12       -1.312451 
      12       -1.211952 
      13       -1.096531 
      13       -1.092539 
      13       -1.100810 
      13       -1.091013 
      13       -1.138811 
      13       -1.180470 
      13       -1.179108 
      13       -1.139158 
      13       -1.146129 
      13       -1.159375 
      13       -1.120343 
      13       -1.017696 
      13       -0.951659 
      13       -0.973645 
      13       -0.967842 
      13       -0.954237 
      13       -1.039143 
      13       -1.131251 
      13       -1.034717 
      13       -0.873696 
      13       -0.914485 
      13       -1.036743 
      13       -1.028941 
      13       -0.962387 
      13       -0.881237 
      13       -0.821059 
      13       -0.773727 
      13       -0.772689 
      13       -0.825725 
      13       -0.826733 
      13       -0.809299 
      13       -0.869359 
      13       -0.934459 
      13       -0.910807 
      13       -0.840554 
      13       -0.759377 
      13       -0.754441 
      13       -0.767290 
      13       -0.777336 
      13       -0.823721 
      13       -0.772768 
      13       -0.665451 
      13       -0.625732 
      13       -0.663612 
      13       -0.734898 
      13       -0.787082 
      13       -0.764535 
      13       -0.769851 
      13       -0.769583 
      13       -0.733655 
      13       -0.772353 
      13       -0.814372 
      13       -0.788470 
      13       -0.785548 
      13       -0.813953 
      13       -0.850789 
      14       -0.860304 
      14       -0.839408 
      14       -0.808240 
      14       -0.781678 
      14       -0.695132 
      14       -0.569903 
      14       -0.544113 
      14       -0.639872 
      14       -0.644919 
      14       -0.595153 
      14       -0.631619 
      14       -0.686252 
      14       -0.701895 
      14       -0.680803 
      14       -0.644573 
      14       -0.666711 
      14       -0.665568 
      14       -0.613454 
      14       -0.565375 
      14       -0.566994 
      14       -0.546948 
      14       -0.481688 
      14       -0.401376 
      14       -0.383655 
      14       -0.390852 
      14       -0.388792 
      14       -0.441177 
      14       -0.499377 
      14       -0.521408 
      14       -0.515773 
      14       -0.476447 
      14       -0.450372 
      14       -0.382392 
      14       -0.306290 
      14       -0.292937 
      14       -0.252331 
      14       -0.215606 
      14       -0.225946 
      14       -0.244420 
      14       -0.276786 
      14       -0.327521 
      14       -0.427369 
      14       -0.491248 
      14       -0.513139 
      14       -0.479012 
      14       -0.401575 
      14       -0.347361 
      14       -0.319450 
      14       -0.251942 
      14       -0.170883 
      14       -0.143439 
      14       -0.173497 
      14       -0.273392 
      14       -0.363738 
      14       -0.359319 
      14       -0.317985 
      14       -0.289083 
      14       -0.277365 
      14       -0.319323 
      15       -0.330819 
      15       -0.275957 
      15       -0.229386 
      15       -0.197241 
      15       -0.185608 
      15       -0.157261 
      15       -0.176625 
      15       -0.212392 
      15       -0.167612 
      15       -0.130060 
      15       -0.198471 
      15       -0.296294 
      15       -0.315894 
      15       -0.249202 
      15       -0.123249 
      15       -0.096005 
      15       -0.160886 
      15       -0.225932 
      15       -0.311039 
      15       -0.364815 
      15       -0.330737 
      15       -0.257799 
      15       -0.217309 
      15       -0.190591 
      15       -0.155460 
      15       -0.171766 
      15       -0.195770 
      15       -0.243457 
      15       -0.280071 
      15       -0.282396 
      15       -0.253717 
      15       -0.256844 
      15       -0.303936 
      15       -0.310164 
      15       -0.299037 
      15       -0.302983 
      15       -0.341132 
      15       -0.364869 
      15       -0.302524 
      15       -0.205849 
      15       -0.217823 
      15       -0.313804 
      15       -0.322623 
      15       -0.272611 
      15       -0.217766 
      15       -0.181635 
      15       -0.193170 
      15       -0.284040 
      16       -0.348089 
      16       -0.302086 
      16       -0.231216 
      16       -0.230164 
      16       -0.247019 
      16       -0.250197 
      16       -0.256205 
      16       -0.205182 
      16       -0.120701 
      16       -0.049344 
      16       -0.082150 
      16       -0.165156 
      16       -0.179921 
      16       -0.173276 
      16       -0.198620 
      16       -0.265360 
      16       -0.287608 
      16       -0.251402 
      16       -0.211669 
      16       -0.136741 
      16       -0.112816 
      16       -0.135973 
      16       -0.140927 
      16       -0.133217 
      16       -0.107986 
      16       -0.133080 
      16       -0.208079 
      16       -0.199724 
      16       -0.169950 
      16       -0.231523 
      16       -0.303413 
      16       -0.295446 
      16       -0.263647 
      16       -0.200231 
      16       -0.147631 
      16       -0.105783 
      16       -0.031474 
      16       -0.006358 
      16       -0.022654 
      16       -0.061471 
      16       -0.086582 
      16       -0.091018 
      16       -0.089696 
      16       -0.013795 
      16       0.052394 
      16       0.017734 
      16       -0.071573 
      16       -0.111764 
      16       -0.066179 
      16       -0.040824 
      16       -0.094436 
      16       -0.178770 
      17       -0.170655 
      17       -0.130521 
      17       -0.145031 
      17       -0.144566 
      17       -0.119126 
      17       -0.136159 
      17       -0.110295 
      17       -0.059640 
      17       -0.101965 
      17       -0.155551 
      17       -0.094057 
      17       -0.031546 
      17       -0.064365 
      17       -0.093100 
      17       -0.045522 
      17       -0.005654 
      17       -0.004638 
      17       -0.053023 
      17       -0.128743 
      17       -0.161632 
      17       -0.108159 
      17       -0.040479 
      17       -0.064590 
      17       -0.162270 
      17       -0.197659 
      17       -0.115602 
      17       -0.071702 
      17       -0.127033 
      17       -0.189921 
      17       -0.128770 
      17       -0.085563 
      17       -0.128849 
      17       -0.189812 
      17       -0.139019 
      17       0.006071 
      17       0.076942 
      17       -0.008489 
      17       -0.140676 
      17       -0.179988 
      17       -0.172104 
      17       -0.159611 
      17       -0.135098 
      17       -0.093214 
      17       -0.073780 
      18       -0.074232 
      18       -0.043395 
      18       0.037823 
      18       0.040515 
      18       -0.023245 
      18       -0.052790 
      18       -0.044685 
      18       0.017897 
      18       0.086843 
      18       0.079861 
      18       0.041282 
      18       0.019216 
      18       0.019818 
      18       0.051673 
      18       0.047896 
      18       0.016540 
      18       -0.004632 
      18       0.017285 
      18       0.057403 
      18       0.093241 
      18       0.082100 
      18       0.065739 
      18       0.072220 
      18       0.048789 
      18       0.012440 
      18       -0.010819 
      18       -0.008479 
      18       -0.042544 
      18       -0.067867 
      18       -0.015236 
      18       0.043816 
      18       0.070155 
      18       0.048859 
      18       0.017082 
      18       0.008744 
      18       0.022139 
      18       0.008422 
      18       0.016066 
      18       0.041915 
      18       0.040289 
      19       -0.000977 
      19       0.019918 
      19       0.088019 
      19       0.113300 
      19       0.095819 
      19       0.054845 
      19       0.037124 
      19       0.053926 
      19       0.093441 
      19       0.110105 
      19       0.096738 
      19       0.074325 
      19       0.071511 
      19       0.067123 
      19       0.065218 
      19       0.052521 
      19       0.072442 
      19       0.105855 
      19       0.107467 
      19       0.085551 
      19       0.053615 
      19       0.067768 
      19       0.091428 
      19       0.061270 
      19       0.031839 
      19       0.061203 
      19       0.099235 
      19       0.106631 
      19       0.107800 
      19       0.104034 
      19       0.089260 
      19       0.026002 
      19       -0.044720 
      19       -0.049277 
      19       -0.057374 
      19       -0.090900 
      19       -0.049774 
      19       -0.018393 
      19       -0.053734 
      19       -0.052445 
      19       -0.067421 
      19       -0.069830 
      19       -0.006159 
      19       0.017840 
      19       0.001327 
      19       -0.036067 
      19       -0.043097 
      19       0.011302 
      19       0.012174 
      20       -0.050148 
      20       -0.064187 
      20       -0.077431 
      20       -0.107572 
      20       -0.118129 
      20       -0.062325 
      20       -0.003609 
      20       0.009748 
      20       0.012351 
      20       0.010830 
      20       0.011721 
      20       0.005300 
      20       -0.011088 
      20       -0.018102 
      20       0.037114 
      20       0.094822 
      20       0.106357 
      20       0.098594 
      20       0.063470 
      20       0.046419 
      20       0.066358 
      20       0.039929 
      20       -0.026522 
      20       -0.041358 
      20       0.027369 
      20       0.089668 
      20       0.102492 
      20       0.103755 
      20       0.096414 
      20       0.077825 
      20       0.054764 
      20       0.048063 
      20       0.034673 
      20       0.049402 
      20       0.058691 
      20       0.017211 
      20       -0.036968 
      20       -0.055812 
      20       -0.007687 
      20       0.011369 
      20       -0.010425 
      20       -0.067123 
      20       -0.097493 
      20       -0.044591 
      20       0.019248 
      21       0.060388 
