Human trial picking the raspberry twin 

 time    ||     output     ||     loadcell

      0.000000       -798.000000       0.070000 
      0.017328       -798.000000       0.100000 
      0.031372       -798.000000       0.060000 
      0.046836       -798.000000       0.020000 
      0.062980       -798.000000       0.070000 
      0.076022       -798.000000       0.020000 
      0.091443       -798.000000       0.060000 
      0.107823       -798.000000       0.070000 
      0.123370       -798.000000       0.030000 
      0.137771       -797.999995       0.000000 
      0.153288       -797.998809       0.070000 
      0.169163       -797.892012       0.050000 
      0.184116       -794.355397       0.000000 
      0.199080       -751.270606       0.070000 
      0.213904       -558.177968       0.040000 
      0.229892       -239.822028       0.020000 
      0.244192       -46.729390       0.040000 
      0.260812       -3.644599       0.080000 
      0.275388       -0.107984       0.050000 
      0.290911       -0.001187       0.060000 
      0.306504       -0.000001       0.010000 
      0.321300       0.000004       0.000000 
      0.336422       0.000004       0.020000 
      0.352205       0.000004       0.100000 
      0.369151       0.000004       0.040000 
      0.385388       0.000004       0.000000 
      0.401622       0.000004       0.030000 
      0.417342       0.000004       0.030000 
      0.433305       0.000004       0.020000 
      0.449270       0.000004       0.060000 
      0.464734       0.000004       0.010000 
      0.480794       0.000004       0.070000 
      0.496455       0.000004       0.050000 
      0.511096       0.000004       0.040000 
      0.541665       0.000004       0.080000 
      0.558760       0.000004       0.050000 
      0.574059       0.000004       0.030000 
      0.589408       0.000004       0.060000 
      0.619332       0.000004       0.070000 
      0.635950       0.000004       0.080000 
      0.652001       0.000004       0.050000 
      0.683173       0.000004       0.100000 
      0.700248       0.000004       0.080000 
      0.715630       0.000004       0.060000 
      0.730830       0.000004       0.010000 
      0.746246       0.000004       0.020000 
      0.761406       0.000004       0.010000 
      0.776727       0.000004       0.030000 
      0.790883       0.000004       0.060000 
      0.805941       0.000004       0.030000 
      0.823163       0.000004       0.050000 
      0.837117       0.000004       0.090000 
      0.854353       0.000004       0.030000 
      0.869893       0.000004       0.110000 
      0.900928       0.000004       0.080000 
      0.916845       0.000004       0.030000 
      0.933882       0.000004       0.050000 
      0.949105       0.000004       0.030000 
      0.964317       0.000004       0.110000 
      0.980169       0.000004       0.050000 
      0.995343       0.000004       0.030000 
      1.010668       0.000004       0.070000 
      1.026419       0.000004       0.020000 
      1.042168       0.000004       0.060000 
      1.057773       0.000004       0.070000 
      1.073813       0.000004       0.030000 
      1.089169       0.000004       0.070000 
      1.117445       0.000004       0.040000 
      1.134187       0.000004       0.030000 
      1.149399       0.000004       0.050000 
      1.165026       0.000004       0.020000 
      1.180992       0.000004       0.050000 
      1.197718       0.000004       0.010000 
      1.213260       0.000004       0.000000 
      1.228723       0.000004       0.030000 
      1.243922       0.000004       0.030000 
      1.258981       0.000004       0.050000 
      1.275761       0.000004       0.000000 
      1.291151       0.000004       0.010000 
      1.305621       0.000004       0.070000 
      1.320460       0.000004       0.030000 
      1.336166       0.000004       0.020000 
      1.366603       0.000004       0.050000 
      1.382284       0.000004       0.100000 
      1.397299       0.000004       0.040000 
      1.414080       0.000004       0.010000 
      1.429989       0.000004       0.010000 
      1.445219       0.000004       0.090000 
      1.489067       0.000004       0.010000 
      1.520234       0.000004       0.040000 
      1.535269       0.000004       0.030000 
      1.552200       0.000004       0.010000 
      1.567155       0.000004       0.070000 
      1.582391       0.000004       0.030000 
      1.597522       0.000004       0.080000 
      1.613206       0.000004       0.050000 
      1.629019       0.000004       0.000000 
      1.645127       0.000004       0.050000 
      1.659120       0.000004       0.070000 
      1.674120       0.000004       0.020000 
      1.690079       0.000004       0.030000 
      1.705037       0.000004       0.020000 
      1.719853       0.000004       0.050000 
      1.736687       0.000004       0.020000 
      1.751785       0.000004       0.120000 
      1.768673       0.000004       0.030000 
      1.783995       0.000004       0.050000 
      1.798954       0.000004       0.010000 
      1.813920       0.000004       0.070000 
      1.828902       0.000004       0.090000 
      1.844841       0.000004       0.040000 
      1.859833       0.000004       0.070000 
      1.875394       0.000004       0.060000 
      1.889798       0.000004       0.000000 
      1.905389       0.000004       0.040000 
      1.922099       0.000004       0.010000 
      1.937574       0.000004       0.080000 
      1.953333       0.000004       0.010000 
      1.969205       0.000004       0.030000 
      1.983539       0.000004       0.040000 
      2.000360       0.000004       0.080000 
      2.015495       0.000004       0.170000 
      2.031254       0.000004       0.030000 
      2.046202       0.000004       0.070000 
      2.060228       0.000004       0.000000 
      2.076671       0.000004       0.020000 
      2.091833       0.000004       0.030000 
      2.107372       0.000004       0.010000 
      2.123695       0.000004       0.040000 
      2.138974       0.000004       0.170000 
      2.154375       0.000004       0.040000 
      2.170381       0.000004       0.130000 
      2.185749       0.000004       0.010000 
      2.201747       0.000004       0.080000 
      2.217510       0.000004       0.010000 
      2.231965       0.000004       0.010000 
      2.248800       0.000004       0.080000 
      2.263922       0.000004       0.090000 
      2.280175       0.000004       0.050000 
      2.295567       0.000004       0.090000 
      2.310768       0.000004       0.070000 
      2.325315       0.000004       0.040000 
      2.340891       0.000004       0.060000 
      2.357636       0.000004       0.080000 
      2.372960       0.000004       0.090000 
      2.387301       0.000004       0.010000 
      2.404037       0.000004       0.040000 
      2.419637       0.000004       0.050000 
      2.434463       0.000004       0.100000 
      2.450932       0.000004       0.140000 
      2.467048       0.000004       0.070000 
      2.481722       0.000004       0.030000 
      2.496816       0.000004       0.060000 
      2.512182       0.000004       0.030000 
      2.528969       0.000004       0.040000 
      2.542853       0.000004       0.040000 
      2.572343       0.000004       0.010000 
      2.589084       0.000004       0.060000 
      2.604199       0.000004       0.020000 
      2.619430       0.000004       0.040000 
      2.634534       0.000004       0.010000 
      2.664596       0.000004       0.050000 
      2.681636       0.000004       0.020000 
      2.696812       0.000004       0.090000 
      2.712148       0.000004       0.110000 
      2.728029       0.000004       0.050000 
      2.744131       0.000004       0.010000 
      2.760094       0.000004       0.060000 
      2.805667       0.000004       0.010000 
      2.821842       0.000004       0.000000 
      2.836453       0.000004       0.070000 
      2.853424       0.000004       0.000000 
      2.868632       0.000004       0.030000 
      2.884418       0.000004       0.020000 
      2.899907       0.000004       0.080000 
      2.915403       0.000004       0.050000 
      2.930524       0.000004       0.090000 
      2.946309       0.000004       0.070000 
      2.962956       0.000004       0.040000 
      2.979986       0.000004       0.010000 
      2.994715       0.000004       0.040000 
      3.010295       0.000004       0.010000 
      3.025286       0.000004       0.000000 
      3.041042       0.000004       0.060000 
      3.056641       0.000004       0.020000 
      3.073238       0.000004       0.030000 
      3.088223       0.000004       0.010000 
      3.105007       0.000004       0.040000 
      3.120032       0.000004       0.030000 
      3.135516       0.000004       0.100000 
      3.151120       0.000004       0.030000 
      3.167104       0.000004       0.060000 
      3.182006       0.000004       0.040000 
      3.197800       0.000004       0.020000 
      3.213370       0.000004       0.050000 
      3.228509       0.000004       0.030000 
      3.244534       0.000004       0.020000 
      3.260183       0.000004       0.000000 
      3.275567       0.000004       0.010000 
      3.291439       0.000004       0.130000 
      3.307193       0.000004       0.050000 
      3.323274       0.000004       0.050000 
      3.338219       0.000004       0.000000 
      3.353279       0.000004       0.040000 
      3.368017       0.000004       0.060000 
      3.383789       0.000004       0.050000 
      3.399651       0.000004       0.040000 
      3.415828       0.000004       0.120000 
      3.430773       0.000004       0.080000 
      3.445950       0.000004       0.020000 
      3.461826       0.000004       0.020000 
      3.477416       0.000004       0.120000 
      3.493654       0.000004       0.090000 
      3.507852       0.000004       0.040000 
      3.524183       0.000004       0.030000 
      3.539412       0.000004       0.060000 
      3.555617       0.000004       0.050000 
      3.571489       0.000004       0.040000 
      3.586982       0.000004       0.080000 
      3.618117       0.000004       0.010000 
      3.633529       0.000004       0.020000 
      3.650088       0.000004       0.010000 
      3.665142       0.000004       0.050000 
      3.680974       0.000004       0.020000 
      3.696351       0.000004       0.070000 
      3.711820       0.000004       0.000000 
      3.727202       0.000004       0.040000 
      3.742867       0.000004       0.080000 
      3.756938       0.000004       0.010000 
      3.772178       0.000004       0.000000 
      3.787199       0.000004       0.080000 
      3.803190       0.000004       0.020000 
      3.818709       0.000004       0.050000 
      3.835361       0.000004       0.090000 
      3.850265       0.000004       0.110000 
      3.864468       0.000004       0.020000 
      3.880479       0.000004       0.070000 
      3.896533       0.000004       0.040000 
      3.912921       0.000004       0.090000 
      3.926108       0.000004       0.020000 
      3.941380       0.000004       0.010000 
      3.957897       0.000004       0.010000 
      3.974008       0.000004       0.080000 
      3.989169       0.000004       0.000000 
      4.004653       0.000004       0.050000 
      4.020099       0.000004       0.060000 
      4.036341       0.000004       0.110000 
      4.050701       0.000004       0.150000 
      4.067519       0.000004       0.010000 
      4.081912       0.000004       0.110000 
      4.096884       0.000004       0.000000 
      4.113314       0.000004       0.070000 
      4.128372       0.000004       0.010000 
      4.159035       0.000004       0.050000 
      4.175515       0.000004       0.080000 
      4.205701       0.000004       0.010000 
      4.220665       0.000004       0.030000 
      4.236468       0.000004       0.000000 
      4.252436       0.000004       0.080000 
      4.267473       0.000004       0.030000 
      4.283090       0.000004       0.020000 
      4.298133       0.000004       0.020000 
      4.313089       0.000004       0.010000 
      4.329078       0.000004       0.020000 
      4.345069       0.000004       0.050000 
      4.360444       0.000004       0.090000 
      4.375572       0.000004       0.070000 
      4.391857       0.000004       0.000000 
      4.405565       0.000004       0.050000 
      4.423111       0.000004       0.040000 
      4.437059       0.000004       0.060000 
      4.451975       0.000004       0.030000 
      4.467461       0.000004       0.050000 
      4.483733       0.000004       0.030000 
      4.499773       0.000004       0.020000 
      4.514771       0.000004       0.120000 
      4.530039       0.000004       0.110000 
      4.545322       0.000004       0.050000 
      4.561474       0.000004       0.000000 
      4.575722       0.000004       0.040000 
      4.591480       0.000004       0.090000 
      4.606552       0.000004       0.130000 
      4.621986       0.000004       0.060000 
      4.637655       0.000004       0.050000 
      4.652814       0.000004       0.040000 
      4.669028       0.000004       0.090000 
      4.684619       0.000004       0.000000 
      4.700155       0.000004       0.170000 
      4.716486       0.000004       0.070000 
      4.730540       0.000004       0.050000 
      4.745998       0.000004       0.030000 
      4.761680       0.000004       0.060000 
      4.776552       0.000004       0.000000 
      4.792430       0.000004       0.000000 
      4.807526       0.000004       0.040000 
      4.823556       0.000004       0.120000 
      4.838560       0.000004       0.100000 
      4.854625       0.000004       0.070000 
      4.885942       0.000004       0.120000 
      4.901235       0.000004       0.100000 
      4.917186       0.000004       0.030000 
      4.947114       0.000004       0.050000 
      4.963180       0.000004       0.010000 
      4.978146       0.000004       0.010000 
      4.994098       0.000004       0.050000 
      5.010085       0.000004       0.010000 
      5.025041       0.000004       0.020000 
      5.040011       0.000004       0.040000 
      5.054899       0.000004       0.070000 
      5.070870       0.000004       0.020000 
      5.084857       0.000004       0.000000 
      5.101478       0.000004       0.070000 
      5.117025       0.000004       0.090000 
      5.133109       0.000004       0.010000 
      5.161896       0.000004       0.040000 
      5.178818       0.000004       0.080000 
      5.194431       0.000004       0.010000 
      5.210057       0.000004       0.060000 
      5.224017       0.000004       0.020000 
      5.239043       0.000004       0.010000 
      5.254997       0.000004       0.020000 
      5.270298       0.000004       0.050000 
      5.286787       0.000004       0.120000 
      5.302150       0.000004       0.040000 
      5.317520       0.000004       0.080000 
      5.333495       0.000004       0.020000 
      5.347713       0.000004       0.020000 
      5.362682       0.000004       0.020000 
      5.378876       0.000004       0.030000 
      5.393414       0.000004       0.020000 
      5.410242       0.000004       0.020000 
      5.424377       0.000004       0.050000 
      5.440181       0.000004       0.070000 
      5.456573       0.000004       0.000000 
      5.471065       0.000004       0.100000 
      5.487303       0.000004       0.010000 
      5.503400       0.000004       0.100000 
      5.518528       0.000004       0.000000 
      5.534534       0.000004       0.050000 
      5.551192       0.000004       0.100000 
      5.566178       0.000004       0.090000 
      5.581411       0.000004       0.070000 
      5.612163       0.000004       0.050000 
      5.628340       0.000004       0.090000 
      5.644295       0.000004       0.060000 
      5.659092       0.000004       0.010000 
      5.675389       0.000004       0.070000 
      5.690489       0.000004       0.050000 
      5.705769       0.000004       0.110000 
      5.722978       0.000004       0.040000 
      5.737662       0.000004       0.080000 
      5.752798       0.000004       0.140000 
      5.768400       0.000004       0.110000 
      5.784145       0.000004       0.000000 
      5.799538       0.000004       0.040000 
      5.815309       0.000004       0.030000 
      5.845507       0.000004       0.070000 
      5.861506       0.000004       0.090000 
      5.876570       0.000004       0.060000 
      5.892258       0.000004       0.080000 
      5.907293       0.000004       0.040000 
      5.923872       0.000004       0.120000 
      5.938337       0.000004       0.100000 
      5.953878       0.000004       0.080000 
      5.970529       0.000004       0.060000 
      5.985576       0.000004       0.000000 
      6.000788       0.000004       0.050000 
      6.016718       0.000004       0.060000 
      6.031970       0.000004       0.040000 
      6.047956       0.000004       0.050000 
      6.063481       0.000004       0.110000 
      6.079351       0.000004       0.050000 
      6.094568       0.000004       0.110000 
      6.109607       0.000004       0.080000 
      6.125283       0.000004       0.090000 
      6.140192       0.000004       0.050000 
      6.156940       0.000004       0.110000 
      6.172474       0.000004       0.050000 
      6.187277       0.000004       0.000000 
      6.218021       0.000004       0.110000 
      6.234154       0.000004       0.030000 
      6.250282       0.000004       0.110000 
      6.264634       0.000004       0.010000 
      6.280839       0.000004       0.080000 
      6.296920       0.000004       0.010000 
      6.310470       0.000004       0.000000 
      6.326653       0.000004       0.050000 
      6.342117       0.000004       0.000000 
      6.357862       0.000004       0.020000 
      6.373323       0.000004       0.030000 
      6.388098       0.000004       0.020000 
      6.403195       0.000004       0.040000 
      6.417595       0.000004       0.010000 
      6.434647       0.000004       0.050000 
      6.448903       -0.000009       0.030000 
      6.464724       -0.000439       0.040000 
      6.480736       -0.005395       0.020000 
      6.497250       -0.024193       0.120000 
      6.512106       -0.039890       0.050000 
      6.527266       -0.024193       0.050000 
      6.543324       -0.005395       0.010000 
      6.558544       -0.000439       0.040000 
      6.574503       -0.000009       0.000000 
      6.590090       0.000004       0.080000 
      6.605319       0.000004       0.060000 
      6.620899       0.000004       0.080000 
      6.635409       0.000004       0.040000 
      6.651214       0.000004       0.070000 
      6.668076       0.000004       0.050000 
      6.684134       0.000004       0.020000 
      6.698411       0.000004       0.070000 
      6.728539       0.000004       0.010000 
      6.744795       0.000004       0.060000 
      6.760650       0.000004       0.020000 
      6.776260       0.000004       0.020000 
      6.791763       0.000004       0.040000 
      6.806967       0.000004       0.020000 
      6.822214       0.000004       0.090000 
      6.837813       0.000004       0.180000 
      6.852974       0.000004       0.090000 
      6.868637       0.000004       0.080000 
      6.884690       0.000004       0.110000 
      6.899046       0.000004       0.100000 
      6.915590       0.000004       0.010000 
      6.930966       0.000004       0.040000 
      6.945541       0.000004       0.060000 
      6.960876       0.000004       0.010000 
      6.977126       0.000004       0.010000 
      6.992813       0.000004       0.050000 
      7.007259       0.000004       0.020000 
      7.023130       0.000004       0.030000 
      7.038687       0.000004       0.000000 
      7.054304       0.000004       0.010000 
      7.069231       0.000004       0.060000 
      7.085346       0.000004       0.110000 
      7.100111       0.000004       0.030000 
      7.115482       0.000004       0.090000 
      7.131920       0.000004       0.010000 
      7.148072       0.000004       0.090000 
      7.163267       0.000004       0.070000 
      7.179375       0.000004       0.080000 
      7.195311       0.000004       0.020000 
      7.210773       0.000004       0.100000 
      7.226327       0.000004       0.030000 
      7.241438       0.000004       0.080000 
      7.257171       0.000004       0.040000 
      7.273276       0.000004       0.030000 
      7.287599       0.000004       0.090000 
      7.302584       0.000004       1.160000 
      7.317279       0.000004       5.400000 
      7.333431       0.000004       7.440000 
      7.349601       0.000004       9.060000 
      7.365311       0.000004       10.090000 
      7.380355       0.000004       9.640000 
      7.395825       0.000004       10.890000 
      7.411477       0.000004       13.560000 
      7.426551       0.000004       18.180000 
      7.440979       0.000004       30.340000 
      7.457499       0.000004       37.900000 
      7.471985       0.000004       56.110000 
      7.488113       0.000004       68.560000 
      7.503457       0.000004       84.260000 
      7.518662       0.000018       124.140000 
      7.534368       0.000488       146.370000 
      7.549556       0.006761       168.630000 
      7.564575       0.041380       209.960000 
      7.579907       0.126512       229.220000 
      7.595472       0.234196       266.540000 
      7.610793       0.380322       281.810000 
      7.626534       0.620631       295.190000 
      7.641883       0.841157       319.150000 
      7.657487       0.957864       331.260000 
      7.673140       1.018888       354.610000 
      7.689143       1.149467       364.270000 
      7.704617       1.435899       377.510000 
      7.719625       1.756398       383.010000 
      7.734926       1.939867       395.550000 
      7.752022       2.007204       401.560000 
      7.766924       2.107453       407.180000 
      7.782024       2.395673       413.950000 
      7.797195       2.854837       413.470000 
      7.812321       3.333140       399.660000 
      7.827772       3.754155       323.160000 
      7.842882       4.034905       243.750000 
      7.858337       4.337244       21.330000 
      7.874343       4.730871       16.300000 
      7.889336       4.997205       15.010000 
      7.904044       5.191134       3.210000 
      7.920184       5.484629       0.970000 
      7.935495       5.807101       7.600000 
      7.950352       5.989079       10.120000 
      7.966474       6.055501       1.770000 
      7.980596       6.122540       1.560000 
      7.996487       6.225329       8.980000 
      8.011372       6.079882       12.650000 
      8.026556       5.114732       0.680000 
      8.042120       2.905400       0.870000 
      8.058261       0.602817       10.010000 
      8.073918       0.147486       11.660000 
      8.089580       0.803281       1.390000 
      8.104317       1.267481       1.170000 
      8.119938       1.337063       11.050000 
      8.136418       1.163419       11.070000 
      8.150679       0.986288       6.340000 
      8.166174       0.746014       3.870000 
      8.182219       0.321736       7.980000 
      8.197061       -0.197252       11.850000 
      8.213777       -0.731862       5.600000 
      8.228691       -1.192564       3.090000 
      8.244123       -1.615526       7.940000 
      8.259563       -1.898307       10.600000 
      8.274231       -2.008840       8.510000 
      8.289230       -2.039338       2.080000 
      8.304296       -2.030464       3.670000 
      8.319537       -2.040873       7.180000 
      8.335293       -2.095469       6.910000 
      8.351157       -2.144832       3.390000 
      8.366451       -2.171700       4.180000 
      8.381044       -2.180200       7.610000 
      8.398060       -2.129578       8.740000 
      8.413019       -2.089254       3.430000 
      8.429174       -2.086527       3.040000 
      8.444399       -2.048873       8.450000 
      8.459736       -2.010808       8.850000 
      8.476275       -2.000882       3.890000 
      8.492272       -2.000023       4.180000 
      8.508018       -1.999996       9.240000 
      8.523450       -1.999996       8.780000 
      8.537730       -2.000023       5.960000 
      8.554399       -2.000882       4.900000 
      8.569659       -2.010794       7.440000 
      8.584296       -2.048390       8.240000 
      8.600362       -2.079784       5.430000 
      8.616152       -2.048390       4.950000 
      8.631405       -2.010794       7.270000 
      8.648098       -2.000882       8.500000 
      8.662205       -2.000023       4.720000 
      8.677950       -1.999996       3.780000 
      8.694170       -1.999996       7.090000 
      8.708405       -1.999996       7.870000 
      8.725144       -1.999996       6.220000 
      8.740829       -1.999996       3.760000 
      8.755791       -1.999996       5.230000 
      8.771116       -1.999996       7.760000 
      8.786370       -1.999996       5.950000 
      8.803563       -1.999996       4.200000 
      8.819520       -1.999996       6.010000 
      8.834940       -1.999996       7.760000 
      8.848986       -1.999996       5.930000 
      8.865315       -1.999996       4.780000 
      8.880618       -1.999996       5.240000 
      8.895066       -1.999996       8.180000 
      8.912022       -1.999996       7.760000 
      8.927593       -1.999996       5.100000 
      8.942159       -1.999996       5.600000 
      8.958555       -1.999996       7.110000 
      8.973206       -1.999996       7.200000 
      8.989463       -1.999996       5.560000 
      9.019076       -1.999996       6.820000 
      9.035304       -1.999996       7.420000 
      9.050453       -1.999996       5.030000 
      9.066914       -1.999996       4.440000 
      9.081199       -1.999996       6.540000 
      9.097853       -1.999996       6.990000 
      9.113177       -1.999996       5.040000 
      9.128868       -1.999996       4.670000 
      9.144007       -1.999996       5.460000 
      9.159058       -2.000009       6.940000 
      9.173076       -2.000439       6.140000 
      9.187927       -2.005395       5.230000 
      9.204426       -2.024193       6.130000 
      9.219337       -2.039890       7.190000 
      9.235009       -2.024193       6.320000 
      9.250266       -2.005395       5.550000 
      9.266400       -2.000439       5.720000 
      9.281775       -2.000009       7.190000 
      9.296049       -1.999996       7.050000 
      9.311733       -1.999996       6.100000 
      9.327680       -1.999996       5.620000 
      9.342590       -1.999996       6.490000 
      9.356291       -1.999996       6.740000 
      9.372429       -1.999996       5.950000 
      9.389019       -1.999996       5.510000 
      9.404338       -1.999996       6.250000 
      9.418567       -1.999996       6.830000 
      9.434721       -1.999996       5.950000 
      9.450093       -1.999996       5.320000 
      9.465213       -1.999996       6.330000 
      9.480384       -1.999996       6.730000 
      9.496374       -1.999996       6.340000 
      9.512022       -1.999996       5.550000 
      9.527492       -1.999996       5.830000 
      9.543443       -1.999996       6.840000 
      9.558860       -1.999996       6.400000 
      9.574442       -1.999996       5.660000 
      9.590155       -1.999996       6.210000 
      9.605987       -1.999996       6.780000 
      9.621722       -1.999996       6.450000 
      9.637252       -1.999996       5.880000 
      9.653299       -1.999996       6.000000 
      9.669370       -1.999996       6.530000 
      9.685238       -1.999996       6.780000 
      9.700919       -1.999996       5.790000 
      9.716813       -1.999996       5.640000 
      9.731660       -1.999996       6.540000 
      9.747895       -1.999996       6.390000 
      9.763690       -1.999996       5.740000 
      9.779756       -1.999996       5.790000 
      9.795554       -1.999996       6.110000 
      9.810912       -1.999996       6.510000 
      9.826840       -1.999996       5.800000 
      9.841015       -1.999996       5.820000 
      9.856844       -1.999996       6.390000 
      9.873159       -2.000009       6.500000 
      9.889232       -2.000452       5.990000 
      9.903677       -2.005838       5.710000 
      9.920890       -2.029592       6.390000 
      9.936285       -2.064087       6.730000 
      9.951544       -2.064087       6.110000 
      9.966372       -2.029592       5.890000 
      9.983238       -2.005851       5.960000 
      9.998678       -2.000895       6.500000 
      10.013433       -2.005409       6.310000 
      10.029522       -2.024206       5.930000 
      10.045071       -2.040333       6.020000 
      10.061625       -2.029592       6.570000 
      10.077069       -2.029592       6.230000 
      10.091289       -2.040347       5.790000 
      10.107723       -2.024649       6.120000 
      10.123203       -2.010794       6.360000 
      10.137377       -2.024636       6.200000 
      10.153422       -2.039903       5.850000 
      10.169050       -2.024193       6.090000 
      10.184615       -2.005395       6.400000 
      10.199682       -2.000439       6.450000 
      10.216810       -2.000009       5.930000 
      10.230217       -1.999996       5.860000 
      10.245725       -1.999996       6.390000 
      10.262070       -1.999996       6.440000 
      10.277799       -1.999996       6.250000 
      10.292192       -2.000009       6.030000 
      10.308963       -2.000439       6.240000 
      10.323691       -2.005408       6.480000 
      10.339713       -2.024636       6.160000 
      10.356669       -2.045289       6.150000 
      10.373624       -2.048390       6.350000 
      10.388629       -2.045289       6.540000 
      10.404013       -2.024636       6.040000 
      10.418106       -2.005408       5.860000 
      10.434014       -2.000439       6.340000 
      10.449544       -2.000009       6.500000 
      10.466093       -1.999996       6.430000 
      10.480157       -1.999996       6.000000 
      10.496403       -1.999996       6.010000 
      10.511000       -1.999996       6.420000 
      10.526092       -1.999996       6.380000 
      10.542662       -1.999996       6.080000 
      10.556897       -1.999996       5.960000 
      10.572792       -1.999996       6.250000 
      10.589299       -1.999996       6.340000 
      10.604620       -1.999996       6.100000 
      10.620273       -1.999996       6.000000 
      10.635669       -1.999996       6.280000 
      10.651264       -2.000009       6.320000 
      10.665463       -2.000439       6.050000 
      10.680699       -2.005395       6.040000 
      10.695920       -2.024193       6.180000 
      10.712477       -2.039890       6.370000 
      10.726697       -2.024193       6.160000 
      10.743047       -2.005395       6.070000 
      10.758267       -2.000439       6.260000 
      10.773249       -2.000009       6.320000 
      10.789222       -1.999996       6.140000 
      10.806207       -1.999996       6.010000 
      10.820961       -1.999996       6.180000 
      10.836555       -1.999996       6.290000 
      10.853420       -1.999996       6.160000 
      10.868619       -1.999996       6.070000 
      10.883537       -1.999996       6.140000 
      10.900141       -1.999996       6.260000 
      10.915097       -2.000009       6.190000 
      10.931041       -2.000439       6.070000 
      10.947911       -2.005408       6.120000 
      10.963672       -2.024636       6.380000 
      10.979656       -2.045302       6.420000 
      10.995421       -2.048833       6.240000 
      11.009918       -2.050688       6.110000 
      11.026908       -2.048833       6.220000 
      11.042472       -2.045302       6.320000 
      11.057430       -2.024636       6.130000 
      11.072820       -2.005408       6.040000 
      11.089731       -2.000439       6.190000 
      11.105827       -2.000009       6.340000 
      11.121035       -1.999996       6.060000 
      11.136644       -1.999996       5.990000 
      11.152051       -1.999996       6.200000 
      11.165935       -1.999996       6.310000 
      11.182365       -1.999996       6.200000 
      11.196917       -1.999996       5.990000 
      11.212914       -1.999996       6.170000 
      11.227676       -1.999996       6.330000 
      11.243468       -1.999996       6.140000 
      11.258746       -1.999996       6.030000 
      11.274512       -1.999996       6.200000 
      11.289786       -1.999996       6.320000 
      11.304802       -1.999996       6.190000 
      11.320373       -1.999996       6.000000 
      11.335917       -1.999996       6.040000 
      11.351674       -1.999996       6.450000 
      11.367214       -1.999996       6.360000 
      11.383286       -1.999996       6.140000 
      11.398142       -1.999996       6.170000 
      11.413362       -1.999996       6.300000 
      11.429874       -1.999996       6.260000 
      11.445194       -1.999996       6.140000 
      11.460479       -1.999996       6.230000 
      11.476244       -1.999996       6.280000 
      11.505884       -1.999996       6.170000 
      11.522748       -1.999996       6.190000 
      11.538437       -1.999996       6.270000 
      11.553878       -1.999996       6.220000 
      11.569351       -1.999996       6.100000 
      11.584389       -1.999996       6.130000 
      11.599472       -1.999996       6.210000 
      11.615650       -1.999996       6.290000 
      11.630984       -1.999996       6.160000 
      11.646685       -2.000009       6.090000 
      11.662361       -2.000439       6.060000 
      11.678171       -2.005395       6.230000 
      11.693661       -2.024193       6.160000 
      11.708748       -2.039890       6.130000 
      11.723740       -2.024193       6.230000 
      11.739751       -2.005395       6.320000 
      11.755312       -2.000439       6.110000 
      11.771969       -2.000009       6.130000 
      11.786515       -1.999996       6.190000 
      11.801920       -1.999996       6.250000 
      11.817873       -1.999996       6.240000 
      11.832833       -2.000009       6.100000 
      11.848052       -2.000439       6.170000 
      11.863660       -2.005395       6.180000 
      11.880651       -2.024193       6.250000 
      11.896268       -2.039890       6.230000 
      11.910544       -2.024193       6.200000 
      11.927529       -2.005395       6.260000 
      11.943116       -2.000439       6.310000 
      11.958364       -2.000009       6.280000 
      11.974260       -1.999996       6.170000 
      11.990947       -1.999996       6.150000 
      12.006373       -1.999996       6.080000 
      12.022373       -1.999996       6.180000 
      12.038388       -1.999996       6.220000 
      12.052785       -1.999996       6.180000 
      12.068723       -1.999996       6.240000 
      12.083138       -1.999996       6.150000 
      12.099895       -1.999996       6.180000 
      12.113844       -1.999996       6.280000 
      12.130399       -1.999996       6.080000 
      12.145698       -1.999996       6.110000 
      12.160204       -1.999996       6.220000 
      12.176321       -1.999996       6.250000 
      12.191730       -1.999996       6.290000 
      12.207099       -1.999996       6.230000 
      12.222367       -1.999996       5.980000 
      12.238194       -1.999996       6.050000 
      12.253933       -1.999996       6.260000 
      12.268671       -1.999996       6.220000 
      12.284347       -1.999996       6.250000 
      12.300083       -1.999996       6.300000 
      12.315443       -1.999996       6.340000 
      12.330441       -1.999996       6.180000 
      12.346379       -1.999996       5.980000 
      12.362066       -1.999996       6.200000 
      12.376502       -1.999996       6.400000 
      12.393216       -1.999996       6.200000 
      12.408799       -1.999996       6.130000 
      12.424313       -1.999996       6.160000 
      12.454981       -1.999996       6.200000 
      12.471274       -1.999996       6.170000 
      12.485588       -1.999996       6.140000 
      12.502920       -1.999996       6.150000 
      12.519114       -1.999996       6.180000 
      12.533614       -1.999996       6.170000 
      12.549293       -1.999996       6.120000 
      12.564983       -1.999996       6.180000 
      12.580365       -1.999996       6.250000 
      12.609905       -1.999996       6.090000 
      12.625993       -1.999996       6.250000 
      12.641943       -1.999996       6.420000 
      12.657939       -1.999996       6.280000 
      12.674018       -1.999996       6.020000 
      12.690308       -1.999996       6.060000 
      12.706161       -1.999996       6.190000 
      12.736749       -1.999996       6.180000 
      12.754875       -1.999996       6.130000 
      12.769818       -1.999996       6.250000 
      12.785880       -1.999996       6.240000 
      12.800376       -1.999996       6.060000 
      12.816073       -1.999996       6.180000 
      12.832330       -1.999996       6.250000 
      12.846615       -1.999996       6.240000 
      12.863490       -1.999996       6.120000 
      12.879045       -1.999996       6.130000 
      12.895280       -1.999996       6.240000 
      12.910903       -1.999996       6.330000 
      12.926395       -1.999996       5.990000 
      12.942180       -1.999996       6.000000 
      12.956151       -1.999996       6.230000 
      12.971151       -2.000009       6.270000 
      12.987450       -2.000439       6.180000 
      13.002577       -2.005395       6.210000 
      13.017753       -2.024193       6.260000 
      13.033601       -2.039890       6.210000 
      13.049342       -2.024193       6.110000 
      13.065414       -2.005395       6.220000 
      13.081410       -2.000439       6.350000 
      13.096033       -2.000009       6.220000 
      13.112072       -1.999996       6.090000 
      13.127863       -1.999996       6.030000 
      13.142974       -1.999996       6.230000 
      13.158083       -1.999996       6.260000 
      13.173484       -1.999996       6.090000 
      13.189429       -1.999996       6.050000 
      13.206107       -1.999996       6.130000 
      13.220777       -1.999996       6.190000 
      13.236662       -1.999996       6.150000 
      13.252877       -1.999996       6.110000 
      13.268915       -1.999996       6.290000 
      13.285577       -1.999996       6.410000 
      13.301030       -1.999996       6.160000 
      13.315866       -1.999996       6.060000 
      13.331743       -1.999996       6.220000 
      13.346539       -1.999996       6.280000 
      13.361654       -1.999996       6.370000 
      13.377530       -1.999996       6.260000 
      13.393067       -1.999996       6.130000 
      13.408447       -1.999996       6.210000 
      13.424499       -1.999996       6.350000 
      13.439500       -1.999996       6.290000 
      13.453762       -1.999996       6.060000 
      13.470802       -1.999996       6.190000 
      13.486880       -1.999996       6.220000 
      13.502179       -1.999996       6.180000 
      13.516881       -1.999996       6.110000 
      13.532361       -1.999996       6.180000 
      13.547670       -1.999996       6.270000 
      13.563323       -1.999996       6.130000 
      13.578155       -1.999996       6.090000 
      13.593715       -1.999996       6.220000 
      13.608716       -1.999996       6.270000 
      13.624100       -1.999996       6.150000 
      13.640783       -1.999996       6.030000 
      13.654990       -2.000009       6.130000 
      13.670949       -2.000439       6.260000 
      13.685773       -2.005395       6.150000 
      13.701684       -2.024193       6.080000 
      13.716681       -2.039890       6.200000 
      13.733309       -2.024193       6.220000 
      13.747362       -2.005395       6.190000 
      13.763572       -2.000439       6.230000 
      13.779172       -2.000009       6.290000 
      13.794271       -1.999996       6.210000 
      13.810301       -1.999996       6.250000 
      13.825486       -1.999996       6.090000 
      13.841191       -1.999996       6.140000 
      13.855626       -1.999996       6.230000 
      13.871198       -1.999996       6.190000 
      13.886892       -1.999996       6.090000 
      13.918333       -1.999996       6.130000 
      13.934488       -1.999996       6.150000 
      13.950481       -1.999996       6.220000 
      13.979473       -1.999996       6.260000 
      13.995626       -1.999996       6.220000 
      14.011681       -1.999996       6.140000 
      14.026134       -1.999996       6.170000 
      14.041377       -1.999996       6.180000 
      14.057670       -1.999996       6.230000 
      14.073182       -1.999996       6.170000 
      14.088855       -1.999996       6.180000 
      14.104817       -1.999996       6.190000 
      14.121170       -1.999996       6.120000 
      14.136307       -1.999996       6.190000 
      14.152311       -2.000009       6.250000 
      14.166259       -2.000439       6.190000 
      14.181345       -2.005395       6.170000 
      14.197937       -2.024193       6.260000 
      14.211887       -2.039890       6.160000 
      14.243542       -2.024193       6.150000 
      14.260328       -2.005408       6.190000 
      14.274672       -2.000882       6.290000 
      14.290947       -2.005408       6.160000 
      14.306520       -2.024193       6.180000 
      14.320498       -2.039890       6.140000 
      14.336195       -2.024193       6.240000 
      14.351649       -2.005395       6.280000 
      14.367079       -2.000439       6.090000 
      14.382065       -2.000009       6.120000 
      14.397692       -1.999996       6.190000 
      14.414201       -1.999996       6.180000 
      14.428373       -1.999996       6.080000 
      14.444418       -1.999996       6.090000 
      14.460068       -1.999996       6.270000 
      14.476416       -1.999996       6.210000 
      14.490819       -1.999996       6.200000 
      14.507154       -1.999996       6.060000 
      14.522108       -1.999996       6.050000 
      14.538216       -1.999996       6.160000 
      14.553565       -1.999996       6.210000 
      14.569561       -1.999996       6.200000 
      14.585627       -1.999996       6.280000 
      14.600046       -1.999996       6.330000 
      14.616400       -1.999996       6.130000 
      14.631925       -1.999996       6.120000 
      14.646877       -1.999996       6.170000 
      14.662757       -1.999996       6.180000 
      14.692431       -1.999996       6.170000 
      14.708980       -1.999996       6.080000 
      14.724373       -1.999996       6.090000 
      14.739395       -1.999996       6.110000 
      14.754300       -1.999996       6.090000 
      14.770628       -1.999996       6.180000 
      14.785459       -1.999996       6.310000 
      14.800514       -1.999996       6.260000 
      14.816226       -1.999996       6.070000 
      14.831186       -1.999996       6.140000 
      14.847171       -1.999996       6.120000 
      14.861133       -1.999996       6.170000 
      14.878093       -1.999996       6.130000 
      14.894054       -1.999996       6.140000 
      14.909975       -1.999996       6.150000 
      14.923976       -1.999996       6.170000 
      14.938955       -1.999996       6.200000 
      14.954892       -1.999996       6.150000 
      14.970879       -1.999996       6.130000 
      14.987616       -1.999996       6.180000 
      15.002463       -1.999996       6.190000 
      15.018234       -1.999996       6.170000 
      15.033617       -1.999996       6.190000 
      15.049598       -1.999996       6.260000 
      15.066256       -1.999996       6.270000 
      15.082189       -1.999996       6.130000 
      15.096826       -1.999996       6.060000 
      15.112482       -1.999996       6.300000 
      15.128574       -1.999996       6.170000 
      15.143006       -1.999996       6.090000 
      15.158193       -1.999996       6.240000 
      15.175155       -1.999996       6.180000 
      15.190148       -1.999996       6.300000 
      15.206106       -1.999996       6.200000 
      15.222068       -1.999996       6.120000 
      15.238015       -1.999996       6.160000 
      15.253670       -1.999996       6.110000 
      15.269734       -1.999996       6.250000 
      15.284361       -1.999996       6.170000 
      15.300644       -1.999996       6.240000 
      15.315411       -1.999996       6.220000 
      15.330366       -1.999996       6.170000 
      15.345770       -1.999996       6.200000 
      15.361788       -1.999996       6.180000 
      15.377516       -1.999996       6.070000 
      15.391379       -1.999996       6.110000 
      15.406801       -1.999996       6.160000 
      15.422352       -1.999996       6.210000 
      15.437911       -1.999996       6.150000 
      15.453531       -1.999996       6.170000 
      15.469196       -1.999996       6.160000 
      15.484935       -1.999996       6.150000 
      15.500928       -1.999996       6.180000 
      15.516805       -1.999996       6.240000 
      15.532308       -1.999996       6.230000 
      15.547038       -1.999996       6.100000 
      15.562230       -1.999996       6.110000 
      15.577592       -1.999996       6.320000 
      15.594301       -1.999996       6.260000 
      15.609579       -1.999996       6.090000 
      15.625816       -1.999996       6.160000 
      15.640693       -1.999996       6.250000 
      15.655301       -1.999996       6.220000 
      15.671351       -1.999996       6.140000 
      15.686803       -2.000009       6.150000 
      15.702002       -2.000439       6.210000 
      15.717349       -2.005395       6.190000 
      15.732962       -2.024193       6.220000 
      15.748202       -2.039890       6.160000 
      15.763947       -2.024193       6.100000 
      15.779811       -2.005395       6.230000 
      15.794933       -2.000439       6.250000 
      15.810506       -2.000009       6.160000 
      15.825634       -1.999996       6.170000 
      15.840866       -1.999996       6.240000 
      15.857156       -1.999996       6.200000 
      15.872776       -1.999996       6.110000 
      15.888446       -1.999996       6.220000 
      15.918406       -1.999996       6.240000 
      15.934901       -1.999996       6.180000 
      15.949884       -1.999996       6.150000 
      15.964354       -1.999996       6.120000 
      15.980389       -1.999996       6.180000 
      15.996851       -1.999996       6.270000 
      16.010771       -1.999996       6.160000 
      16.025630       -1.999996       6.120000 
      16.041944       -1.999996       6.290000 
      16.057111       -1.999996       6.310000 
      16.072155       -1.999996       6.160000 
      16.088099       -1.999996       6.050000 
      16.102555       -1.999996       6.240000 
      16.133281       -1.999996       6.110000 
      16.149846       -1.999996       6.220000 
      16.164961       -1.999996       6.250000 
      16.179858       -1.999996       6.150000 
      16.195760       -1.999996       6.100000 
      16.225458       -1.999996       6.230000 
      16.242259       -1.999996       6.200000 
      16.258450       -1.999996       5.990000 
      16.273398       -1.999996       6.010000 
      16.289034       -1.999996       6.100000 
      16.304147       -1.999996       6.290000 
      16.320095       -1.999996       6.310000 
      16.334075       -1.999996       6.100000 
      16.350488       -1.999996       6.120000 
      16.366571       -1.999996       6.230000 
      16.381705       -1.999996       6.080000 
      16.397379       -1.999996       6.050000 
      16.412369       -1.999996       6.300000 
      16.427130       -1.999996       6.320000 
      16.443985       -1.999996       5.970000 
      16.459983       -1.999996       5.900000 
      16.474894       -1.999996       6.080000 
      16.488890       -1.999996       6.240000 
      16.505960       -1.999996       5.980000 
      16.521957       -1.999996       6.050000 
      16.536457       -1.999996       6.360000 
      16.553478       -1.999996       6.390000 
      16.569016       -1.999996       5.910000 
      16.600168       -1.999996       6.460000 
      16.616865       -1.999996       6.470000 
      16.632234       -1.999996       5.920000 
      16.648176       -1.999996       6.060000 
      16.663564       -1.999996       6.340000 
      16.679090       -1.999996       6.180000 
      16.694042       -1.999996       5.980000 
      16.709572       -1.999996       6.210000 
      16.725977       -1.999996       6.430000 
      16.741004       -1.999996       6.390000 
      16.756722       -1.999996       5.970000 
      16.772049       -1.999996       6.160000 
      16.787414       -1.999996       6.310000 
      16.802144       -1.999996       6.300000 
      16.819645       -1.999996       6.160000 
      16.834916       -1.999996       6.100000 
      16.850868       -1.999996       6.230000 
      16.866707       -1.999996       6.270000 
      16.882701       -1.999996       6.210000 
      16.897940       -1.999996       6.230000 
      16.914018       -1.999996       6.280000 
      16.931120       -1.999996       6.080000 
      16.946240       -1.999996       6.090000 
      16.961544       -1.999996       6.210000 
      16.976330       -1.999996       6.230000 
      16.993392       -1.999996       6.280000 
      17.008822       -1.999996       6.150000 
      17.024377       -1.999996       6.110000 
      17.038812       -1.999996       6.240000 
      17.055600       -1.999996       6.230000 
      17.070558       -1.999996       6.220000 
      17.087479       -1.999996       6.150000 
      17.103648       -1.999996       6.230000 
      17.118887       -1.999996       6.280000 
      17.134068       -1.999996       6.230000 
      17.149976       -1.999996       6.070000 
      17.166358       -1.999996       6.100000 
      17.181479       -1.999996       6.200000 
      17.196556       -1.999996       6.300000 
      17.212419       -1.999996       6.230000 
      17.226470       -1.999996       6.130000 
      17.242970       -1.999996       6.230000 
      17.258408       -1.999996       6.220000 
      17.273968       -1.999996       6.100000 
      17.289143       -1.999996       6.210000 
      17.305226       -1.999996       6.260000 
      17.320750       -1.999996       6.310000 
      17.336860       -1.999996       5.940000 
      17.352186       -1.999996       6.060000 
      17.366555       -1.999996       6.270000 
      17.397914       -1.999996       6.120000 
      17.414915       -1.999996       6.130000 
      17.430352       -1.999996       6.210000 
      17.445888       -1.999996       6.290000 
      17.461833       -1.999996       6.240000 
      17.477822       -1.999996       6.150000 
      17.493326       -1.999996       6.230000 
      17.522180       -1.999996       6.190000 
      17.538868       -1.999996       6.160000 
      17.553981       -1.999996       6.190000 
      17.570130       -1.999996       6.250000 
      17.585206       -1.999996       6.150000 
      17.602302       -1.999996       6.100000 
      17.616883       -1.999996       6.260000 
      17.632245       -1.999996       6.270000 
      17.648327       -1.999996       6.130000 
      17.664378       -1.999996       6.150000 
      17.679490       -1.999996       6.190000 
      17.709241       -1.999996       6.180000 
      17.725783       -1.999996       6.130000 
      17.741325       -1.999996       6.100000 
      17.757221       -1.999996       6.210000 
      17.786695       -1.999996       6.120000 
      17.803477       -1.999996       6.020000 
      17.818926       -1.999996       6.120000 
      17.835316       -1.999996       6.210000 
      17.849212       -1.999996       6.220000 
      17.863549       -1.999996       6.180000 
      17.879674       -1.999996       6.140000 
      17.895460       -1.999996       6.150000 
      17.910752       -1.999996       6.230000 
      17.926091       -1.999996       6.140000 
      17.941454       -1.999996       6.150000 
      17.956253       -1.999996       6.270000 
      17.971165       -1.999996       6.140000 
      17.986130       -1.999996       6.040000 
      18.002087       -1.999996       6.110000 
      18.017125       -1.999996       6.140000 
      18.033273       -1.999996       6.320000 
      18.049254       -1.999996       6.270000 
      18.065503       -1.999996       6.120000 
      18.080873       -1.999996       6.150000 
      18.095669       -1.999996       6.140000 
      18.111615       -1.999996       6.130000 
      18.141072       -1.999996       6.170000 
      18.157320       -1.999996       6.150000 
      18.172652       -1.999996       6.140000 
      18.188002       -1.999996       6.100000 
      18.203160       -1.999996       6.160000 
      18.217244       -1.999996       6.180000 
      18.234064       -1.999996       6.140000 
      18.248737       -1.999996       6.110000 
      18.264150       -1.999996       6.190000 
      18.280380       -1.999996       6.180000 
      18.295880       -1.999996       6.170000 
      18.311012       -1.999996       6.120000 
      18.325346       -1.999996       6.090000 
      18.340959       -1.999996       6.130000 
      18.357237       -1.999996       6.140000 
      18.371178       -1.999996       6.250000 
      18.387791       -1.999996       6.170000 
      18.403138       -1.999996       6.120000 
      18.418279       -1.999996       6.080000 
      18.434702       -1.999996       6.210000 
      18.450777       -1.999996       6.150000 
      18.466843       -1.999996       6.180000 
      18.496172       -1.999996       6.130000 
      18.513669       -1.999996       6.120000 
      18.527295       -1.999996       6.130000 
      18.543134       -1.999996       6.150000 
      18.558898       -1.999996       6.130000 
      18.573353       -1.999996       6.170000 
      18.588695       -1.999996       6.200000 
      18.605306       -1.999996       6.150000 
      18.621414       -1.999996       6.070000 
      18.636303       -1.999996       6.140000 
      18.653579       -1.999996       6.150000 
      18.684017       -1.999996       6.110000 
      18.698979       -1.999996       6.150000 
      18.715242       -1.999996       6.240000 
      18.731382       -1.999996       6.220000 
      18.746880       -1.999996       6.080000 
      18.761379       -1.999996       6.200000 
      18.777468       -1.999996       6.230000 
      18.793456       -1.999996       6.180000 
      18.808443       -1.999996       6.230000 
      18.824148       -1.999996       6.210000 
      18.839403       -1.999996       6.170000 
      18.854747       -1.999996       6.090000 
      18.870226       -1.999996       6.210000 
      18.885526       -1.999996       6.300000 
      18.901238       -1.999996       6.140000 
      18.916713       -1.999996       6.060000 
      18.932336       -1.999996       6.130000 
      18.947819       -1.999996       6.250000 
      18.963653       -1.999996       6.150000 
      18.978715       -1.999996       6.190000 
      18.994673       -1.999996       6.270000 
      19.009639       -1.999996       6.170000 
      19.040131       -1.999996       6.110000 
      19.055870       -1.999996       6.150000 
      19.086346       -1.999996       6.200000 
      19.101984       -1.999996       6.150000 
      19.116932       -1.999996       6.130000 
      19.133579       -1.999996       6.160000 
      19.149657       -1.999996       6.190000 
      19.179322       -1.999996       6.230000 
      19.196304       -1.999996       6.260000 
      19.212294       -1.999996       6.190000 
      19.226718       -1.999996       6.120000 
      19.241247       -1.999996       6.110000 
      19.257031       -1.999996       6.260000 
      19.272157       -1.999996       6.220000 
      19.317518       -1.999996       6.090000 
      19.332994       -1.999996       6.120000 
      19.349150       -1.999996       6.130000 
      19.365207       -1.999996       6.190000 
      19.380320       -1.999996       6.220000 
      19.395873       -1.999996       6.300000 
      19.411858       -1.999996       6.240000 
      19.427262       -1.999996       6.110000 
      19.443322       -1.999996       6.140000 
      19.457833       -1.999996       6.220000 
      19.473340       -1.999996       6.270000 
      19.489560       -1.999996       6.210000 
      19.504430       -1.999996       6.160000 
      19.519642       -1.999996       6.190000 
      19.550600       -1.999996       6.180000 
      19.566729       -1.999996       6.220000 
      19.581231       -1.999996       6.230000 
      19.598381       -1.999996       6.130000 
      19.614218       -1.999996       6.150000 
      19.628501       -1.999996       6.220000 
      19.644848       -1.999996       6.240000 
      19.660572       -1.999996       6.010000 
      19.676525       -1.999996       6.130000 
      19.692001       -1.999996       6.190000 
      19.707292       -1.999996       6.060000 
      19.723613       -1.999996       6.110000 
      19.740243       -1.999996       6.280000 
      19.755759       -1.999996       6.230000 
      19.769974       -1.999996       6.030000 
      19.784642       -1.999996       6.120000 
      19.799913       -1.999996       6.340000 
      19.816786       -1.999996       6.230000 
      19.831423       -1.999996       6.010000 
      19.846927       -1.999996       6.270000 
      19.862334       -1.999996       6.480000 
      19.877619       -1.999996       6.210000 
      19.893200       -1.999996       5.860000 
      19.909067       -1.999996       6.270000 
      19.924244       -1.999996       6.440000 
      19.939493       -1.999996       5.910000 
      19.955421       -1.999996       6.130000 
      19.971077       -1.999996       6.530000 
      19.986130       -1.999996       6.390000 
      20.002118       -1.999996       5.780000 
      20.017046       -1.999996       5.930000 
      20.033962       -1.999996       6.600000 
      20.051003       -1.999996       6.240000 
      20.065794       -1.999996       5.780000 
      20.081204       -1.999996       6.180000 
      20.095841       -1.999996       6.420000 
      20.112352       -1.999996       5.920000 
      20.127758       -1.999996       5.620000 
      20.143275       -1.999996       6.500000 
      20.158652       -1.999996       6.590000 
      20.173236       -1.999996       5.590000 
      20.189033       -1.999996       5.800000 
      20.204329       -1.999996       6.420000 
      20.219800       -1.999996       6.390000 
      20.235867       -1.999996       5.780000 
      20.250826       -1.999996       6.130000 
      20.266364       -1.999996       6.590000 
      20.283025       -1.999996       6.580000 
      20.298096       -1.999996       5.790000 
      20.313039       -1.999996       5.930000 
      20.327960       -1.999996       6.330000 
      20.343876       -1.999996       6.170000 
      20.359406       -1.999996       5.840000 
      20.375131       -1.999996       6.240000 
      20.389740       -1.999996       6.350000 
      20.406426       -1.999996       6.310000 
      20.422148       -1.999996       6.070000 
      20.437710       -1.999996       6.090000 
      20.453724       -1.999996       6.240000 
      20.469945       -1.999996       6.210000 
      20.484967       -1.999996       6.110000 
      20.500705       -1.999996       6.120000 
      20.516492       -1.999996       6.190000 
      20.532549       -1.999996       6.220000 
      20.548359       -1.999996       6.260000 
      20.563818       -1.999996       6.140000 
      20.579173       -1.999996       6.220000 
      20.594295       -1.999996       6.350000 
      20.610839       -1.999996       6.170000 
      20.640526       -1.999996       6.200000 
      20.656847       -1.999996       6.260000 
      20.671325       -2.000009       5.990000 
      20.687679       -2.000439       6.090000 
      20.703712       -2.005395       6.330000 
      20.719501       -2.024193       6.240000 
      20.735545       -2.039890       6.090000 
      20.750679       -2.024193       6.220000 
      20.765549       -2.005395       6.240000 
      20.780509       -2.000439       6.180000 
      20.795409       -2.000009       6.120000 
      20.825950       -1.999996       6.230000 
      20.841342       -1.999996       6.110000 
      20.856324       -1.999996       6.040000 
      20.872331       -1.999996       6.090000 
      20.888345       -1.999996       6.140000 
      20.903839       -1.999996       6.190000 
      20.918978       -1.999996       6.110000 
      20.935434       -1.999996       5.960000 
      20.950931       -1.999996       6.150000 
      20.966247       -1.999996       6.190000 
      20.981899       -1.999996       6.160000 
      20.997924       -1.999996       6.070000 
      21.012560       -1.999996       6.210000 
