Human trial picking the raspberry twin 

 time    ||     output compensated 

      0       -799.398214 
      0       -799.398214 
      0       -799.398214 
      0       -799.398214 
      0       -799.398214 
      0       -799.398214 
      0       -799.398214 
      0       -799.398214 
      0       -799.398214 
      0       -799.398209 
      0       -799.397021 
      0       -799.290024 
      0       -795.746774 
      0       -752.581453 
      0       -559.131674 
      0       -240.205991 
      0       -46.802427 
      0       -3.638352 
      0       0.001129 
      0       0.154345 
      0       0.058223 
      0       -0.024994 
      0       -0.046231 
      0       -0.036236 
      0       0.003549 
      0       0.040767 
      0       -0.026946 
      0       -0.097156 
      0       -0.026047 
      0       0.051982 
      0       0.056469 
      0       0.057354 
      0       -0.002293 
      0       -0.062647 
      0       -0.026463 
      0       0.012988 
      0       0.019799 
      0       0.067211 
      0       0.093679 
      0       0.097789 
      0       0.146959 
      0       0.111188 
      0       0.023786 
      0       -0.002626 
      0       -0.033217 
      0       -0.002503 
      0       0.071128 
      0       0.078547 
      0       0.077486 
      0       0.142152 
      0       0.094465 
      0       -0.030806 
      0       -0.047932 
      0       0.013844 
      0       -0.012441 
      0       -0.015276 
      1       0.081622 
      1       0.114701 
      1       0.113460 
      1       0.062299 
      1       0.045795 
      1       0.085624 
      1       0.082505 
      1       0.092807 
      1       0.072180 
      1       0.040370 
      1       0.050282 
      1       0.054628 
      1       0.078131 
      1       0.089500 
      1       0.077258 
      1       0.044233 
      1       0.005943 
      1       -0.031916 
      1       -0.016070 
      1       -0.058881 
      1       -0.118670 
      1       -0.112660 
      1       -0.130813 
      1       -0.168155 
      1       -0.103482 
      1       0.012434 
      1       0.090117 
      1       0.045148 
      1       -0.017811 
      1       -0.006806 
      1       -0.001298 
      1       -0.006749 
      1       0.027355 
      1       -0.013078 
      1       -0.081499 
      1       -0.038117 
      1       0.036254 
      1       0.000890 
      1       -0.043957 
      1       -0.012579 
      1       -0.025623 
      1       -0.111622 
      1       -0.167200 
      1       -0.132266 
      1       -0.111209 
      1       -0.119652 
      1       -0.051627 
      1       0.011215 
      1       0.023245 
      1       0.025131 
      1       0.013417 
      1       0.039027 
      1       0.026430 
      1       0.015272 
      1       0.039417 
      1       0.028268 
      2       0.018374 
      2       -0.010749 
      2       -0.000868 
      2       0.068136 
      2       0.040272 
      2       -0.012439 
      2       0.021851 
      2       0.050706 
      2       -0.005920 
      2       -0.078465 
      2       -0.101800 
      2       -0.053588 
      2       -0.032397 
      2       -0.034528 
      2       -0.020666 
      2       -0.000277 
      2       -0.013747 
      2       -0.074702 
      2       -0.145898 
      2       -0.069782 
      2       0.066930 
      2       0.097904 
      2       0.082184 
      2       0.054784 
      2       -0.050545 
      2       -0.165716 
      2       -0.209902 
      2       -0.219713 
      2       -0.235740 
      2       -0.173002 
      2       -0.077740 
      2       -0.030698 
      2       0.010806 
      2       0.032035 
      2       0.023765 
      2       0.031929 
      2       0.015657 
      2       -0.000477 
      2       0.007118 
      2       -0.009467 
      2       -0.011479 
      2       0.041779 
      2       0.093323 
      2       0.009800 
      2       -0.078403 
      2       -0.011702 
      2       0.070185 
      2       0.093798 
      2       0.124036 
      2       0.105323 
      2       0.087635 
      2       0.130501 
      2       0.162083 
      2       0.060616 
      2       -0.032246 
      3       -0.024003 
      3       -0.025082 
      3       -0.046512 
      3       -0.082577 
      3       -0.073997 
      3       0.041859 
      3       0.112124 
      3       0.031040 
      3       -0.061895 
      3       -0.143873 
      3       -0.146781 
      3       -0.094837 
      3       -0.055219 
      3       -0.001038 
      3       0.012319 
      3       0.020186 
      3       0.043527 
      3       0.010201 
      3       -0.020404 
      3       -0.008293 
      3       0.023309 
      3       0.022667 
      3       0.049451 
      3       0.111118 
      3       0.095327 
      3       0.041617 
      3       0.009656 
      3       0.049966 
      3       0.057786 
      3       -0.072706 
      3       -0.153176 
      3       -0.124675 
      3       -0.110042 
      3       -0.093002 
      3       -0.098334 
      3       -0.129664 
      3       -0.078664 
      3       -0.018512 
      3       -0.048392 
      3       -0.057691 
      3       -0.001244 
      3       0.005907 
      3       -0.023010 
      3       -0.030756 
      3       -0.038003 
      3       -0.058890 
      3       -0.084037 
      3       -0.043727 
      3       0.029504 
      3       0.051314 
      3       0.020750 
      3       -0.016816 
      4       -0.007208 
      4       -0.000171 
      4       0.034159 
      4       0.096664 
      4       0.102866 
      4       0.064617 
      4       0.081196 
      4       0.076876 
      4       0.036134 
      4       0.050049 
      4       0.012959 
      4       -0.077837 
      4       -0.089295 
      4       -0.025243 
      4       -0.008283 
      4       0.010574 
      4       -0.005250 
      4       -0.073363 
      4       -0.121924 
      4       -0.138069 
      4       -0.157022 
      4       -0.116027 
      4       -0.046539 
      4       -0.102864 
      4       -0.157236 
      4       -0.092230 
      4       -0.006646 
      4       -0.008673 
      4       -0.056167 
      4       -0.053728 
      4       -0.067897 
      4       -0.060488 
      4       -0.024882 
      4       0.001992 
      4       0.025107 
      4       0.031833 
      4       0.052548 
      4       0.054954 
      4       0.005757 
      4       -0.032507 
      4       0.049014 
      4       0.124363 
      4       0.120062 
      4       0.091320 
      4       0.043386 
      4       0.057177 
      4       0.090713 
      4       0.034809 
      4       -0.049362 
      4       -0.045773 
      4       0.056710 
      4       0.118677 
      4       0.096262 
      4       0.065973 
      4       0.036509 
      4       0.066346 
      4       0.155199 
      4       0.136869 
      5       0.029380 
      5       -0.030239 
      5       -0.007453 
      5       0.037492 
      5       0.000239 
      5       -0.015729 
      5       -0.051971 
      5       -0.130389 
      5       -0.121543 
      5       -0.077794 
      5       -0.017964 
      5       -0.001407 
      5       -0.047974 
      5       -0.071818 
      5       -0.074760 
      5       -0.052606 
      5       -0.035320 
      5       -0.038024 
      5       -0.071394 
      5       -0.087059 
      5       -0.064947 
      5       -0.080689 
      5       -0.114058 
      5       -0.120881 
      5       -0.121522 
      5       -0.114428 
      5       -0.101004 
      5       -0.101627 
      5       -0.132716 
      5       -0.128979 
      5       -0.106612 
      5       -0.121308 
      5       -0.167288 
      5       -0.146337 
      5       -0.089203 
      5       -0.029004 
      5       0.023312 
      5       0.037577 
      5       0.019221 
      5       0.013875 
      5       -0.076491 
      5       -0.136315 
      5       -0.142719 
      5       -0.159742 
      5       -0.122783 
      5       -0.066920 
      5       -0.054766 
      5       -0.049720 
      5       -0.048363 
      5       -0.039876 
      5       -0.068282 
      5       -0.074725 
      5       -0.006472 
      5       0.037366 
      5       0.049679 
      5       0.038676 
      6       0.018688 
      6       0.041241 
      6       0.130752 
      6       0.149084 
      6       0.111974 
      6       0.028456 
      6       -0.013208 
      6       -0.020062 
      6       -0.047560 
      6       -0.065938 
      6       -0.041176 
      6       -0.059978 
      6       -0.089881 
      6       -0.090819 
      6       -0.061079 
      6       -0.058619 
      6       -0.084766 
      6       -0.059760 
      6       -0.005728 
      6       0.042990 
      6       0.047114 
      6       0.052739 
      6       0.040398 
      6       0.013612 
      6       -0.049683 
      6       -0.027355 
      6       0.054045 
      6       0.069439 
      6       -0.003086 
      6       -0.091846 
      6       -0.087327 
      6       -0.122497 
      6       -0.214760 
      6       -0.218887 
      6       -0.139917 
      6       -0.041326 
      6       0.057156 
      6       0.144854 
      6       0.193152 
      6       0.194317 
      6       0.160869 
      6       0.079897 
      6       0.011592 
      6       -0.011081 
      6       0.007983 
      6       0.055482 
      6       0.036113 
      6       -0.014146 
      6       -0.044386 
      6       -0.035788 
      6       0.012411 
      6       0.093908 
      6       0.087628 
      6       0.043813 
      6       0.045460 
      6       -0.016982 
      6       -0.047931 
      6       0.007118 
      6       0.017637 
      6       0.013092 
      7       -0.032799 
      7       -0.090111 
      7       -0.105584 
      7       -0.061594 
      7       0.026110 
      7       0.031428 
      7       -0.008121 
      7       -0.014903 
      7       0.022283 
      7       0.048048 
      7       0.079250 
      7       0.109746 
      7       0.105740 
      7       0.038836 
      7       -0.039900 
      7       -0.082204 
      7       -0.048053 
      7       0.007410 
      7       0.088519 
      7       0.135131 
      7       0.072484 
      7       0.022286 
      7       0.039111 
      7       0.066510 
      7       0.079852 
      7       0.141327 
      7       0.202406 
      7       0.305217 
      7       0.383722 
      7       0.400879 
      7       0.474587 
      7       0.555717 
      7       0.613292 
      7       0.802927 
      7       1.164675 
      7       1.510339 
      8       1.740825 
      8       1.939540 
      8       2.178103 
      8       2.434192 
      8       2.654349 
      8       2.899659 
      8       3.216600 
      8       3.503918 
      8       3.648839 
      8       3.695007 
      8       3.719798 
      8       3.726953 
      8       3.750335 
      8       3.777606 
      8       3.816211 
      8       3.822400 
      8       3.752563 
      8       3.689332 
      8       3.675472 
      8       3.673161 
      8       3.679543 
      8       3.697815 
      8       3.726649 
      8       3.769148 
      8       3.885330 
      8       4.029973 
      8       4.113467 
      8       4.071210 
      8       3.950405 
      8       3.899161 
      8       3.936033 
      8       3.934498 
      8       3.899753 
      8       3.853421 
      8       3.844619 
      8       3.909113 
      8       4.081645 
      8       4.201275 
      8       4.172232 
      8       4.121128 
      8       4.066020 
      8       4.072332 
      8       4.143551 
      8       4.126065 
      8       4.052246 
      8       4.068335 
      8       4.235175 
      8       4.441668 
      9       4.560578 
      9       4.619217 
      9       4.653809 
      9       4.619685 
      9       4.566711 
      9       4.471312 
      9       4.247821 
      9       3.692376 
      9       2.508740 
      9       0.956575 
      9       0.080957 
      9       0.293076 
      9       0.664982 
      9       0.749311 
      9       0.677196 
      9       0.433430 
      9       0.055195 
      9       -0.333152 
      9       -0.736586 
      9       -1.147214 
      9       -1.374095 
      9       -1.421759 
      9       -1.427201 
      9       -1.425910 
      9       -1.428209 
      9       -1.436682 
      9       -1.475717 
      9       -1.505673 
      9       -1.475717 
      9       -1.436682 
      9       -1.428222 
      9       -1.412091 
      9       -1.404274 
      9       -1.407417 
      9       -1.410320 
      9       -1.393614 
      9       -1.381211 
      9       -1.393614 
      9       -1.410320 
      9       -1.393171 
      10       -1.375811 
      10       -1.369417 
      10       -1.370426 
      10       -1.369028 
      10       -1.372186 
      10       -1.390624 
      10       -1.468987 
      10       -1.550631 
      10       -1.570718 
      10       -1.590542 
      10       -1.581472 
      10       -1.534947 
      10       -1.455575 
      10       -1.409892 
      10       -1.412537 
      10       -1.404036 
      10       -1.425079 
      10       -1.459574 
      10       -1.462245 
      10       -1.440333 
      10       -1.399027 
      10       -1.376282 
      10       -1.369874 
      10       -1.375825 
      10       -1.393171 
      10       -1.410307 
      10       -1.393171 
      10       -1.375825 
      10       -1.369861 
      10       -1.375838 
      10       -1.393614 
      10       -1.415706 
      10       -1.417368 
      10       -1.415706 
      10       -1.393614 
      11       -1.375825 
      11       -1.369444 
      11       -1.371299 
      11       -1.379342 
      11       -1.413838 
      11       -1.429548 
      11       -1.398597 
      11       -1.382071 
      11       -1.398610 
      11       -1.429991 
      11       -1.419250 
      11       -1.403983 
      11       -1.416579 
      11       -1.417395 
      11       -1.415719 
      11       -1.394057 
      11       -1.381224 
      11       -1.393614 
      11       -1.410320 
      11       -1.393171 
      11       -1.375811 
      11       -1.369417 
      11       -1.370439 
      11       -1.369417 
      11       -1.375811 
      11       -1.393171 
      11       -1.410307 
      11       -1.393171 
      11       -1.375811 
      11       -1.369417 
      12       -1.370439 
      12       -1.369417 
      12       -1.362053 
      12       -1.365619 
      12       -1.368927 
      12       -1.338300 
      12       -1.308569 
      12       -1.298553 
      12       -1.319318 
      12       -1.322490 
      12       -1.287585 
      12       -1.285782 
      12       -1.283997 
      12       -1.249450 
      12       -1.252483 
      12       -1.264322 
      12       -1.222435 
      12       -1.181392 
      12       -1.199248 
      12       -1.225474 
      12       -1.216688 
      12       -1.187748 
      12       -1.153587 
      12       -1.135061 
      12       -1.101401 
      12       -1.072762 
      12       -1.055717 
      12       -1.046996 
      12       -1.044489 
      12       -1.068195 
      13       -1.073066 
      13       -1.031681 
      13       -1.004604 
      13       -1.006863 
      13       -1.018639 
      13       -1.014579 
      13       -1.016904 
      13       -0.986288 
      13       -0.941849 
      13       -0.924442 
      13       -0.912935 
      13       -0.905204 
      13       -0.894727 
      13       -0.887217 
      13       -0.877347 
      13       -0.874903 
      13       -0.883341 
      13       -0.891485 
      13       -0.866044 
      13       -0.845517 
      13       -0.853835 
      13       -0.875951 
      13       -0.851639 
      13       -0.808972 
      13       -0.792919 
      13       -0.783167 
      13       -0.782052 
      13       -0.795911 
      13       -0.819032 
      13       -0.795301 
      13       -0.753198 
      13       -0.737690 
      13       -0.728051 
      13       -0.722169 
      13       -0.713523 
      13       -0.707825 
      14       -0.699748 
      14       -0.699081 
      14       -0.709276 
      14       -0.719147 
      14       -0.694992 
      14       -0.670856 
      14       -0.657817 
      14       -0.652237 
      14       -0.644278 
      14       -0.639259 
      14       -0.631442 
      14       -0.626552 
      14       -0.618862 
      14       -0.614098 
      14       -0.606533 
      14       -0.601891 
      14       -0.594448 
      14       -0.589928 
      14       -0.582605 
      14       -0.578203 
      14       -0.570997 
      14       -0.566724 
      14       -0.560058 
      14       -0.560801 
      14       -0.572805 
      14       -0.588960 
      14       -0.585142 
      14       -0.582551 
      14       -0.573465 
      14       -0.565659 
      14       -0.538119 
      14       -0.515126 
      14       -0.503631 
      14       -0.499593 
      14       -0.493161 
      14       -0.489666 
      14       -0.483784 
      14       -0.485715 
      14       -0.503390 
      14       -0.539288 
      14       -0.556865 
      14       -0.563371 
      14       -0.579417 
      14       -0.599371 
      14       -0.553896 
      14       -0.475150 
      15       -0.443786 
      15       -0.454845 
      15       -0.480912 
      15       -0.460549 
      15       -0.421793 
      15       -0.409612 
      15       -0.403680 
      15       -0.405947 
      15       -0.419073 
      15       -0.431847 
      15       -0.410591 
      15       -0.390137 
      15       -0.389305 
      15       -0.419137 
      15       -0.430486 
      15       -0.395526 
      15       -0.374797 
      15       -0.382916 
      15       -0.395613 
      15       -0.374679 
      15       -0.353746 
      15       -0.343879 
      15       -0.341438 
      15       -0.336587 
      15       -0.334645 
      15       -0.329874 
      15       -0.328013 
      15       -0.323734 
      15       -0.326827 
      15       -0.340745 
      15       -0.354302 
      15       -0.333794 
      15       -0.313271 
      15       -0.303834 
      16       -0.302632 
      16       -0.307582 
      16       -0.339082 
      16       -0.356137 
      16       -0.340106 
      16       -0.330565 
      16       -0.304976 
      16       -0.284302 
      16       -0.275115 
      16       -0.273363 
      16       -0.269192 
      16       -0.267924 
      16       -0.263821 
      16       -0.262606 
      16       -0.258556 
      16       -0.257395 
      16       -0.253397 
      16       -0.252287 
      16       -0.248340 
      16       -0.247281 
      16       -0.243410 
      16       -0.243251 
      16       -0.249207 
      16       -0.285359 
      16       -0.312162 
      16       -0.279397 
      16       -0.238385 
      16       -0.232519 
      16       -0.246528 
      16       -0.261001 
      16       -0.241427 
      16       -0.221840 
      16       -0.213716 
      16       -0.217484 
      16       -0.232509 
      16       -0.247999 
      16       -0.238367 
      16       -0.256017 
      16       -0.278207 
      16       -0.245357 
      16       -0.204671 
      17       -0.199143 
      17       -0.213512 
      17       -0.229153 
      17       -0.219311 
      17       -0.233096 
      17       -0.246744 
      17       -0.236713 
      17       -0.251723 
      17       -0.261498 
      17       -0.246165 
      17       -0.221819 
      17       -0.212623 
      17       -0.188188 
      17       -0.168681 
      17       -0.160651 
      17       -0.160043 
      17       -0.157005 
      17       -0.156859 
      17       -0.153906 
      17       -0.155068 
      17       -0.166812 
      17       -0.222398 
      17       -0.265371 
      17       -0.217533 
      17       -0.158530 
      17       -0.148556 
      17       -0.162979 
      17       -0.178275 
      17       -0.159527 
      17       -0.140759 
      17       -0.133447 
      17       -0.138031 
      17       -0.154262 
      17       -0.175002 
      17       -0.179391 
      18       -0.190068 
      18       -0.167721 
      18       -0.131468 
      18       -0.122164 
      18       -0.118680 
      18       -0.118891 
      18       -0.116278 
      18       -0.116539 
      18       -0.113976 
      18       -0.115098 
      18       -0.121924 
      18       -0.154855 
      18       -0.168846 
      18       -0.136077 
      18       -0.113037 
      18       -0.105164 
      18       -0.105097 
      18       -0.102609 
      18       -0.103007 
      18       -0.100579 
      18       -0.101836 
      18       -0.108793 
      18       -0.141856 
      18       -0.155977 
      18       -0.123337 
      18       -0.100451 
      18       -0.093567 
      18       -0.103842 
      18       -0.143080 
      18       -0.188270 
      18       -0.155307 
      18       -0.100994 
      18       -0.087101 
      18       -0.083543 
      18       -0.084092 
      18       -0.081827 
      18       -0.082446 
      18       -0.080636 
      19       -0.086572 
      19       -0.107386 
      19       -0.137393 
      19       -0.120479 
      19       -0.085124 
      19       -0.076296 
      19       -0.073271 
      19       -0.073937 
      19       -0.071773 
      19       -0.072479 
      19       -0.070330 
      19       -0.071051 
      19       -0.068917 
      19       -0.069651 
      19       -0.067531 
      19       -0.068306 
      19       -0.067050 
      19       -0.077590 
      19       -0.111759 
      19       -0.133333 
      19       -0.062275 
      19       0.005224 
      19       -0.014672 
      19       -0.052318 
      19       -0.060158 
      19       -0.061831 
      19       -0.059815 
      19       -0.060641 
      19       -0.058610 
      19       -0.059448 
      19       -0.057430 
      19       -0.058280 
      19       -0.056273 
      20       -0.057134 
      20       -0.055139 
      20       -0.056011 
      20       -0.054027 
      20       -0.054911 
      20       -0.052938 
      20       -0.053832 
      20       -0.051870 
      20       -0.052776 
      20       -0.050850 
      20       -0.052617 
      20       -0.060506 
      20       -0.099383 
      20       -0.137445 
      20       -0.139141 
      20       -0.116069 
      20       -0.074016 
      20       -0.050745 
      20       -0.043468 
      20       -0.044019 
      20       -0.042168 
      20       -0.044008 
      20       -0.051557 
      20       -0.085630 
      20       -0.105633 
      20       -0.096613 
      20       -0.104049 
      20       -0.087056 
      20       -0.070207 
      20       -0.077056 
      20       -0.058483 
      20       -0.040699 
