

 time    ||    gripping force   ||   raspberry measurement 

      0       0.040000       -802.432692 
      0       0.270000       -802.432692 
      0       0.130000       -802.432692 
      0       1.220000       -802.432692 
      0       0.150000       -802.432692 
      0       0.210000       -802.432692 
      0       0.640000       -802.432692 
      0       0.150000       -802.432692 
      0       0.370000       -802.432692 
      0       0.500000       -802.432692 
      0       0.170000       -802.432692 
      0       0.190000       -802.432692 
      0       0.080000       -802.432692 
      0       0.030000       -802.432692 
      0       0.250000       -802.432692 
      0       0.350000       -802.432692 
      1       0.170000       -802.432692 
      1       1.160000       -802.432692 
      1       0.930000       -794.408365 
      1       32.720000       -786.464282 
      1       31.200000       -778.599634 
      1       58.440000       -770.812457 
      1       85.730000       -762.998074 
      1       114.800000       -759.443745 
      1       118.730000       -759.443745 
      1       116.600000       -759.443745 
      1       115.810000       -759.443745 
      1       115.790000       -759.443745 
      1       114.910000       -716.143420 
      1       114.360000       -522.087868 
      1       114.150000       -202.155387 
      1       113.800000       -202.155387 
      1       113.470000       -202.155387 
      1       113.460000       -202.155387 
      1       113.260000       -8.115532 
      1       112.950000       -8.115532 
      1       112.670000       -8.115532 
      1       112.880000       -8.115532 
      1       112.500000       -8.115532 
      1       112.260000       35.181692 
      1       112.330000       35.181692 
      1       112.140000       38.734166 
      1       111.830000       38.734166 
      2       112.000000       38.842937 
      2       111.860000       38.843202 
      2       111.550000       38.852315 
      2       111.600000       38.903963 
      2       111.640000       39.091879 
      2       111.400000       39.091879 
      2       111.350000       39.459932 
      2       111.360000       39.970478 
      2       111.320000       39.970478 
      2       111.100000       39.970478 
      2       111.140000       40.475652 
      2       111.130000       40.475652 
      2       110.900000       40.748645 
      2       110.910000       40.783380 
      2       110.890000       40.752928 
      2       110.650000       40.744992 
      2       110.720000       40.742708 
      2       110.560000       40.744067 
      2       110.530000       40.740922 
      2       110.500000       40.722941 
      2       110.330000       40.650433 
      2       110.250000       40.650433 
      2       110.230000       40.598828 
      3       110.020000       40.648165 
      3       109.800000       40.714414 
      3       108.940000       40.766045 
      3       107.630000       40.723800 
      3       105.090000       40.635222 
      3       100.150000       40.665205 
      3       93.090000       40.763760 
      3       86.680000       40.786619 
      3       79.190000       40.786619 
      3       74.320000       40.780403 
      3       71.830000       40.787877 
      3       71.540000       40.787877 
      3       72.140000       40.787877 
      3       73.120000       40.787877 
      3       74.160000       40.787877 
      4       75.300000       40.787877 
      4       76.110000       40.787877 
      4       76.410000       40.714081 
      4       76.390000       40.622139 
      4       76.400000       40.622139 
      4       76.360000       40.622139 
      4       76.440000       40.622139 
      4       76.440000       40.622139 
      4       76.400000       40.622139 
      4       76.410000       40.622139 
      4       76.770000       40.622139 
      4       77.470000       40.622139 
      4       78.290000       40.622139 
      4       79.060000       40.622139 
      4       79.930000       40.622139 
      4       79.980000       40.622139 
      5       80.000000       40.622139 
      5       79.970000       40.622139 
      5       79.970000       40.618999 
      5       79.920000       40.626165 
      5       79.940000       40.626165 
      5       79.940000       40.626165 
      5       79.920000       40.657533 
      5       79.960000       40.655667 
      5       79.870000       40.655667 
      5       79.880000       40.655667 
      5       79.920000       40.655667 
      5       79.880000       40.655667 
      5       79.850000       40.655667 
      5       79.790000       40.655667 
      5       79.850000       40.655667 
      5       79.800000       40.655667 
      6       79.810000       40.655667 
      6       79.810000       40.619828 
      6       79.780000       40.647125 
      6       79.840000       40.593647 
      6       79.730000       40.391158 
      6       79.790000       40.391158 
      6       79.850000       40.391158 
      6       79.740000       40.391158 
      6       79.780000       40.391158 
      6       79.720000       40.391158 
      6       79.780000       40.391158 
      6       79.700000       40.165179 
      6       79.770000       40.165179 
      6       79.690000       40.006966 
      6       79.740000       40.006966 
      7       79.710000       39.906967 
      7       79.640000       39.906967 
      7       79.670000       39.865273 
      7       79.690000       39.865273 
      7       79.740000       39.865273 
      7       79.700000       39.865273 
      7       79.640000       39.894315 
      7       79.650000       39.933296 
      7       79.700000       39.933296 
      7       79.700000       39.933296 
      7       79.700000       39.933296 
      7       79.700000       39.933296 
      7       79.680000       39.933296 
      7       79.680000       39.933296 
      7       79.620000       39.933296 
      8       79.610000       39.933296 
      8       79.660000       39.933296 
      8       79.650000       39.933296 
      8       79.640000       39.933296 
      8       79.620000       39.940909 
      8       79.520000       39.933268 
      8       79.630000       39.893401 
      8       79.610000       39.853507 
      8       79.580000       39.853507 
      8       79.570000       39.853507 
      8       79.600000       39.853507 
      8       79.540000       39.853507 
      8       79.550000       39.853507 
      8       79.580000       39.853507 
      8       79.480000       39.853507 
      9       79.510000       39.853507 
      9       79.520000       39.853507 
      9       79.490000       39.853507 
      9       79.490000       39.853507 
      9       79.540000       39.845007 
      9       79.520000       39.842709 
      9       79.510000       39.842709 
      9       79.540000       39.844120 
      9       79.520000       39.842682 
      9       79.490000       39.842682 
      9       79.440000       39.842682 
      9       79.530000       39.842682 
      9       79.420000       39.842682 
      9       79.430000       39.842682 
      9       79.510000       39.842682 
      10       79.820000       39.842682 
      10       79.880000       39.842682 
      10       79.910000       39.842682 
      10       79.890000       39.842682 
      10       79.890000       39.842682 
      10       79.850000       39.842682 
      10       79.890000       39.844120 
      10       79.890000       39.844120 
      10       79.840000       39.844120 
      10       79.880000       39.842682 
      10       79.830000       39.844120 
      10       79.840000       39.844120 
      10       79.940000       39.842709 
      10       79.870000       39.842709 
      10       79.930000       39.842709 
      11       79.890000       39.842709 
      11       79.910000       39.842709 
      11       79.870000       39.845007 
      11       79.880000       39.853507 
      11       79.890000       39.853507 
      11       79.810000       39.853507 
      11       79.930000       39.853507 
      11       79.760000       39.893401 
      11       79.840000       39.933268 
      11       79.860000       39.933268 
      11       79.830000       39.933268 
      11       79.840000       39.933268 
      11       79.880000       39.940909 
      11       79.840000       39.933295 
      11       79.880000       39.894287 
      12       79.750000       39.864305 
      12       79.860000       39.864305 
      12       79.760000       39.893401 
      12       79.860000       39.922497 
      12       79.840000       39.892515 
      12       79.810000       39.853507 
      12       79.800000       39.853507 
      12       79.830000       39.853507 
      12       79.790000       39.845893 
      12       79.810000       39.853507 
      12       79.740000       39.853507 
      12       79.830000       39.853507 
      12       79.750000       39.853507 
      12       79.750000       39.853507 
      12       79.740000       39.853507 
      12       79.730000       39.853507 
      13       79.740000       39.853507 
      13       79.810000       39.853507 
      13       79.690000       39.853507 
      13       79.710000       39.853507 
      13       79.700000       39.853507 
      13       79.660000       39.853507 
      13       79.790000       39.853507 
      13       79.670000       39.853507 
      13       79.710000       39.853507 
      13       79.760000       39.853507 
      13       79.820000       39.853507 
      13       79.780000       39.892515 
      13       79.660000       39.922470 
      13       79.740000       39.892515 
      13       79.640000       39.892515 
      14       79.750000       39.853507 
      14       79.680000       39.853507 
      14       79.680000       39.853507 
      14       79.720000       39.853507 
      14       79.670000       39.853507 
      14       79.660000       39.853507 
      14       79.670000       39.845893 
      14       79.670000       39.853507 
      14       79.640000       39.853507 
      14       79.660000       39.853507 
      14       79.670000       39.853507 
      14       79.680000       39.892515 
      14       79.650000       39.922470 
      14       79.660000       39.892514 
      14       79.710000       39.853480 
      15       79.710000       39.853480 
      15       79.650000       39.853480 
      15       79.660000       39.853480 
      15       79.610000       39.853480 
      15       79.690000       39.853480 
      15       79.630000       39.845007 
      15       79.640000       39.842709 
      15       79.670000       39.844120 
      15       79.600000       39.842682 
      15       79.630000       39.842682 
      15       79.690000       39.844120 
      15       79.640000       39.842682 
      15       79.680000       39.842682 
      15       79.660000       39.842682 
      15       79.630000       39.842682 
      16       79.540000       39.844120 
      16       79.620000       39.842682 
      16       79.580000       39.842682 
      16       79.650000       39.842682 
      16       79.640000       39.844120 
      16       79.630000       39.842682 
      16       79.560000       39.842682 
      16       79.660000       39.842682 
      16       79.600000       39.842682 
      16       79.580000       39.842682 
      16       79.590000       39.842682 
      16       79.590000       39.842682 
      16       79.610000       39.842682 
      16       79.560000       39.842682 
      16       79.560000       39.842682 
      17       79.570000       39.844120 
      17       79.580000       39.842682 
      17       79.590000       39.842682 
      17       79.580000       39.842682 
      17       79.550000       39.842682 
      17       79.560000       39.842682 
      17       79.520000       39.844120 
      17       79.580000       39.842682 
      17       79.600000       39.842682 
      17       79.580000       39.842682 
      17       79.530000       39.842682 
      17       79.470000       39.842682 
      17       79.590000       39.844120 
      17       79.550000       39.844120 
      17       79.590000       39.842682 
      18       79.600000       39.844120 
      18       79.550000       39.844120 
      18       79.550000       39.842682 
      18       79.540000       39.842682 
      18       79.550000       39.842682 
      18       79.490000       39.842682 
      18       79.540000       39.842682 
      18       79.520000       39.842682 
      18       79.510000       39.842682 
      18       79.540000       39.842682 
      18       79.470000       39.842682 
      18       79.490000       39.842682 
      18       79.540000       39.844120 
      18       79.440000       39.842682 
      18       79.490000       39.842682 
      18       79.520000       39.842682 
      19       79.490000       39.844120 
      19       79.500000       39.844120 
      19       79.450000       39.842682 
      19       79.520000       39.842682 
      19       79.530000       39.842682 
      19       79.490000       39.842682 
      19       79.510000       39.842682 
      19       79.480000       39.842682 
      19       79.520000       39.842682 
      19       79.460000       39.842682 
      19       79.480000       39.842682 
      19       79.500000       39.842682 
      19       79.490000       39.842682 
      19       79.490000       39.842682 
      19       79.540000       39.842682 
      20       79.460000       39.842682 
      20       79.540000       39.842682 
      20       79.450000       39.844120 
      20       79.480000       39.842682 
      20       79.490000       39.842682 
      20       79.580000       39.842682 
      20       81.110000       39.842682 
      20       82.770000       39.842682 
      20       83.640000       39.842682 
      20       84.570000       39.842682 
      20       84.530000       39.842682 
      20       84.550000       39.842682 
      20       84.500000       39.842682 
      20       84.480000       39.844120 
      20       84.480000       39.842682 
      21       84.490000       39.842682 
      21       84.460000       39.842682 
      21       84.470000       39.842682 
      21       84.460000       39.842682 
      21       84.400000       39.842682 
      21       84.420000       39.842682 
      21       84.370000       39.844120 
      21       84.370000       39.842682 
      21       84.430000       39.842682 
      21       84.370000       39.842682 
      21       84.400000       39.842682 
      21       84.350000       39.842682 
      21       84.390000       39.842682 
      21       84.350000       39.844120 
      21       84.310000       39.842682 
      22       84.370000       39.842682 
      22       84.360000       39.842682 
      22       84.340000       39.842682 
      22       84.320000       39.842682 
      22       84.290000       39.842682 
      22       84.300000       39.842682 
      22       84.300000       39.842682 
      22       84.340000       39.842682 
      22       84.280000       39.842682 
      22       84.270000       39.842682 
      22       84.340000       39.842682 
      22       84.270000       39.842682 
      22       84.290000       39.842682 
      22       84.150000       39.842682 
      23       84.020000       39.842682 
      23       84.030000       39.844120 
      23       83.870000       39.842682 
      23       83.890000       39.842682 
      23       83.850000       39.844120 
      23       83.840000       39.842682 
      23       83.890000       39.844120 
      23       83.550000       39.844120 
      23       83.430000       39.844120 
      23       83.200000       39.842682 
      23       82.920000       39.844120 
      23       82.070000       39.842709 
      23       81.230000       39.842709 
      23       80.040000       39.842709 
      23       79.490000       39.842709 
      24       78.570000       39.842709 
      24       78.480000       39.842709 
      24       78.540000       39.842709 
      24       78.480000       39.842709 
      24       78.540000       39.842709 
      24       78.550000       39.842709 
      24       78.560000       39.845007 
      24       78.640000       39.853480 
      24       78.590000       39.853480 
      24       78.620000       39.892515 
      24       78.610000       39.922497 
      24       78.650000       39.922497 
      24       78.650000       39.922497 
      24       78.640000       39.893401 
      24       78.640000       39.864278 
      25       78.580000       39.864278 
      25       78.660000       39.864278 
      25       78.700000       39.864278 
      25       78.630000       39.864278 
      25       78.680000       39.864278 
      25       78.680000       39.864278 
      25       78.710000       39.864278 
      25       78.640000       39.864278 
      25       78.650000       39.864278 
      25       78.670000       39.864278 
      25       78.720000       39.893414 
      25       78.660000       39.893414 
      25       78.750000       39.922954 
      25       78.680000       39.898370 
      25       78.680000       39.883519 
      25       78.710000       39.883519 
      26       78.680000       39.883519 
      26       78.650000       39.883519 
      26       78.680000       39.883519 
      26       78.670000       39.883519 
      26       78.690000       39.883519 
      26       78.650000       39.883519 
      26       78.700000       39.914497 
      26       78.670000       39.930997 
      26       78.660000       39.913611 
      26       78.670000       39.913611 
      26       78.630000       39.913611 
      26       78.650000       39.913611 
      26       78.650000       39.913611 
      26       78.730000       39.913611 
      26       78.680000       39.913611 
      26       78.720000       39.872721 
      27       78.660000       39.849976 
      27       78.730000       39.849976 
      27       78.640000       39.849976 
      27       78.730000       39.843139 
      27       78.640000       39.844134 
      27       78.670000       39.844134 
      27       78.670000       39.844134 
      27       78.630000       39.844134 
      27       78.680000       39.844134 
      27       78.710000       39.844134 
      27       78.650000       39.844134 
      27       78.740000       39.844134 
      27       78.680000       39.844134 
      27       78.660000       39.844134 
      27       78.670000       39.844134 
      28       78.690000       39.844134 
      28       78.750000       39.844134 
      28       78.750000       39.842682 
      28       78.710000       39.844120 
      28       78.720000       39.842682 
      28       78.750000       39.844120 
      28       78.760000       39.842682 
      28       78.760000       39.844134 
      28       78.750000       39.844134 
      28       78.770000       39.843138 
      28       78.750000       39.849949 
      28       78.750000       39.849949 
      28       78.770000       39.849949 
      28       78.720000       39.849949 
      28       78.760000       39.849949 
      29       78.750000       39.849949 
      29       78.780000       39.849949 
      29       78.890000       39.849949 
      29       79.090000       39.849949 
      29       79.000000       39.849949 
      29       79.040000       39.849949 
      29       79.010000       39.849949 
      29       79.040000       39.871848 
      29       79.120000       39.903242 
      29       79.090000       39.887545 
      29       79.070000       39.853050 
      29       79.090000       39.844993 
      29       79.010000       39.842708 
      29       79.060000       39.844120 
      29       79.060000       39.844120 
      30       79.060000       39.842682 
      30       79.060000       39.844120 
      30       79.060000       39.844120 
      30       79.070000       39.844120 
      30       79.080000       39.844120 
      30       79.130000       39.844120 
      30       79.460000       39.844120 
      30       79.720000       39.844120 
      30       79.760000       39.844120 
      30       79.740000       39.842709 
      30       79.730000       39.845007 
      30       79.770000       39.853480 
      30       79.890000       39.853480 
      30       79.910000       39.853480 
      30       79.950000       39.853480 
      31       79.970000       39.853480 
      31       79.920000       39.853480 
      31       79.970000       39.853480 
      31       79.950000       39.853480 
      31       79.970000       39.853480 
      31       79.940000       39.853480 
      31       79.960000       39.853480 
      31       80.010000       39.853480 
      31       79.980000       39.853480 
      31       80.010000       39.853480 
      31       79.920000       39.853480 
      31       80.000000       39.853480 
      31       79.920000       39.853480 
      31       79.960000       39.853480 
      31       79.970000       39.853480 
      32       79.920000       39.853480 
      32       79.930000       39.892514 
      32       79.970000       39.922470 
      32       79.990000       39.922470 
      32       79.940000       39.922470 
      32       80.010000       39.922470 
      32       79.990000       39.922470 
      32       79.970000       39.922470 
      32       79.980000       39.922470 
      32       79.980000       39.922470 
      32       79.990000       39.922470 
      32       79.980000       39.922470 
      32       79.990000       39.922470 
      32       79.980000       39.892514 
      32       79.970000       39.853466 
      32       79.950000       39.853466 
      33       79.970000       39.844550 
      33       79.980000       39.836880 
      33       79.920000       39.836880 
      33       79.940000       39.836880 
      33       80.000000       39.836880 
      33       79.990000       39.814954 
      33       79.990000       39.783560 
      33       80.000000       39.783560 
      33       79.980000       39.783560 
      33       79.880000       39.783560 
      33       79.940000       39.783560 
      33       79.910000       39.783560 
      33       79.990000       39.783560 
      33       79.990000       39.799257 
      33       79.960000       39.799257 
      34       79.980000       39.833725 
      34       79.990000       39.833725 
      34       79.920000       39.840936 
      34       79.990000       39.833725 
      34       79.960000       39.833725 
      34       79.980000       39.833725 
      34       79.950000       39.833725 
      34       79.960000       39.833725 
      34       80.010000       39.833725 
      34       79.900000       39.833725 
      34       79.930000       39.833725 
      34       79.960000       39.833725 
      34       79.950000       39.833725 
      34       79.950000       39.833725 
      34       79.880000       39.799256 
      34       79.980000       39.783546 
      35       79.940000       39.783546 
      35       79.930000       39.783546 
      35       79.960000       39.783546 
      35       79.920000       39.814511 
      35       79.920000       39.831454 
      35       79.930000       39.831454 
      35       79.970000       39.831454 
      35       79.980000       39.831454 
      35       79.900000       39.831454 
      35       79.880000       39.831454 
      35       79.870000       39.831454 
      35       79.890000       39.831454 
      35       79.930000       39.831454 
      35       79.930000       39.831454 
      35       79.900000       39.831454 
      36       79.970000       39.819467 
      36       79.910000       39.802774 
      36       79.910000       39.802774 
      36       79.880000       39.802774 
      36       79.920000       39.802774 
      36       79.920000       39.802774 
      36       79.960000       39.802774 
      36       79.910000       39.819923 
      36       79.910000       39.837283 
      36       79.890000       39.837283 
      36       79.920000       39.837283 
      36       79.890000       39.837283 
      36       79.920000       39.837283 
      36       79.890000       39.837283 
      36       79.940000       39.843677 
      37       79.920000       39.842668 
      37       79.870000       39.842668 
      37       79.900000       39.842668 
      37       79.850000       39.842668 
      37       79.970000       39.842668 
      37       79.970000       39.844120 
      37       79.980000       39.844120 
      37       79.920000       39.842682 
      37       79.910000       39.842682 
      37       79.910000       39.842682 
      37       79.920000       39.842682 
      37       79.910000       39.842682 
      37       79.860000       39.844120 
      37       79.870000       39.842682 
      37       79.940000       39.844120 
      37       79.970000       39.844120 
      38       79.920000       39.844120 
      38       79.880000       39.844120 
      38       79.870000       39.844120 
      38       79.880000       39.842682 
      38       79.880000       39.844120 
      38       79.910000       39.844120 
      38       79.950000       39.844120 
      38       79.880000       39.844120 
      38       79.910000       39.844120 
      38       79.910000       39.844120 
      38       79.900000       39.844120 
      38       79.850000       39.844120 
      38       79.870000       39.844120 
      38       79.870000       39.844120 
      38       79.940000       39.844120 
      38       79.940000       39.842682 
      39       79.850000       39.844120 
      39       79.930000       39.844120 
      39       79.910000       39.842682 
      39       79.920000       39.844120 
      39       79.860000       39.844120 
      39       79.890000       39.844120 
      39       79.930000       39.844120 
      39       79.870000       39.844120 
      39       79.850000       39.844120 
      39       79.870000       39.844120 
      39       79.870000       39.844120 
      39       79.920000       39.844120 
      39       79.870000       39.844120 
      39       79.840000       39.844120 
      39       79.870000       39.844120 
      40       79.840000       39.844120 
      40       79.860000       39.844120 
      40       79.880000       39.844120 
      40       79.900000       39.844120 
      40       79.860000       39.844120 
      40       79.950000       39.844120 
      40       79.890000       39.844120 
      40       79.860000       39.844120 
      40       79.870000       39.844120 
      40       79.910000       39.844120 
      40       79.890000       39.844120 
      40       79.890000       39.844120 
      40       79.900000       39.844120 
      40       79.850000       39.844120 
      40       79.900000       39.844120 
      40       79.880000       39.844120 
      41       79.880000       39.844120 
      41       79.880000       39.844120 
      41       79.850000       39.844120 
      41       79.890000       39.844120 
      41       79.900000       39.844120 
      41       79.860000       39.844120 
      41       79.890000       39.844120 
      41       79.810000       39.844120 
      41       79.930000       39.844120 
      41       79.900000       39.842682 
      41       79.900000       39.844120 
      41       79.890000       39.844120 
      41       79.840000       39.842682 
      41       79.880000       39.844134 
      41       79.890000       39.844134 
      41       79.840000       39.844134 
      42       79.910000       39.844134 
      42       79.850000       39.844134 
      42       79.840000       39.844134 
      42       79.860000       39.843138 
      42       79.800000       39.843138 
      42       79.870000       39.849949 
      42       79.880000       39.849949 
      42       79.920000       39.849949 
      42       79.860000       39.849949 
      42       79.820000       39.871848 
      42       79.790000       39.903242 
      42       79.890000       39.887545 
      42       79.920000       39.853050 
      42       79.850000       39.853050 
      42       79.890000       39.844994 
      43       79.840000       39.842735 
      43       79.910000       39.842735 
      43       79.950000       39.842735 
      43       80.160000       39.842735 
      43       80.230000       39.842735 
      43       80.200000       39.842735 
      43       80.140000       39.845007 
      43       80.180000       39.853480 
      43       80.220000       39.892514 
      43       80.210000       39.922470 
      43       80.200000       39.892514 
      43       80.160000       39.853480 
      43       80.150000       39.853480 
      43       80.400000       39.853480 
      43       80.150000       39.845007 
      44       80.260000       39.842709 
      44       80.220000       39.842709 
      44       80.110000       39.842709 
      44       80.280000       39.842709 
      44       80.250000       39.842709 
      44       80.140000       39.842709 
      44       80.170000       39.844121 
      44       80.090000       39.842709 
      44       80.190000       39.842709 
      44       80.200000       39.842709 
      44       80.160000       39.842709 
      44       80.160000       39.842709 
      44       80.180000       39.842709 
      44       80.180000       39.845007 
      44       80.190000       39.853480 
      45       80.130000       39.892515 
      45       80.160000       39.922497 
      45       80.170000       39.922497 
      45       80.100000       39.893401 
      45       80.190000       39.864278 
      45       80.150000       39.864278 
      45       80.180000       39.864278 
      45       80.210000       39.864278 
      45       80.100000       39.864278 
      45       80.190000       39.864278 
      45       80.200000       39.864278 
      45       80.180000       39.864278 
      45       80.180000       39.864278 
      45       80.150000       39.864278 
      45       80.140000       39.864278 
      46       80.140000       39.864278 
      46       80.170000       39.864278 
      46       80.150000       39.864278 
      46       80.230000       39.864278 
      46       80.170000       39.864278 
      46       80.170000       39.864278 
      46       80.200000       39.864278 
      46       80.210000       39.864278 
      46       80.140000       39.864278 
      46       80.150000       39.893401 
      46       80.170000       39.922524 
      46       80.160000       39.922524 
      46       80.160000       39.922524 
      46       80.130000       39.893401 
      46       80.130000       39.864278 
      46       80.200000       39.864278 
      46       80.140000       39.864278 
      47       80.140000       39.864278 
      47       80.170000       39.864278 
      47       80.160000       39.864278 
      47       80.180000       39.864278 
      47       80.190000       39.864278 
      47       80.210000       39.864278 
      47       80.200000       39.864278 
      47       80.180000       39.864278 
      47       80.150000       39.864278 
      47       80.140000       39.864278 
      47       80.110000       39.864278 
      47       80.150000       39.864278 
      47       80.120000       39.893401 
      47       80.180000       39.922497 
      47       80.160000       39.922497 
      48       80.160000       39.922497 
      48       80.130000       39.922497 
      48       80.230000       39.922497 
      48       80.140000       39.922497 
      48       80.180000       39.922497 
      48       80.040000       39.922497 
      48       80.180000       39.922497 
      48       80.160000       39.922497 
      48       80.120000       39.922497 
      48       80.230000       39.922497 
      48       80.120000       39.892515 
      48       80.220000       39.853480 
      48       80.210000       39.845007 
      48       80.140000       39.842709 
      48       80.140000       39.842709 
      49       80.190000       39.842709 
      49       80.090000       39.842709 
      49       80.180000       39.842709 
      49       80.080000       39.842709 
      49       80.130000       39.842709 
      49       80.170000       39.842709 
      49       80.140000       39.842709 
      49       80.190000       39.842709 
      49       80.170000       39.842709 
      49       80.160000       39.842709 
      49       80.170000       39.844120 
      49       80.220000       39.842682 
      49       80.060000       39.844120 
      49       80.150000       39.842682 
      49       80.110000       39.842682 
      50       80.110000       39.842682 
      50       80.160000       39.842682 
      50       80.200000       39.844120 
      50       80.160000       39.842709 
      50       80.200000       39.842709 
      50       80.090000       39.842709 
      50       80.200000       39.842709 
      50       80.200000       39.842709 
      50       80.140000       39.842709 
      50       80.170000       39.842709 
      50       80.140000       39.842709 
      50       80.230000       39.842709 
      50       80.160000       39.845007 
      50       80.150000       39.853480 
      50       80.190000       39.853480 
      50       80.100000       39.853480 
      51       80.230000       39.853480 
      51       80.160000       39.892514 
      51       80.200000       39.922470 
      51       80.160000       39.892514 
      51       80.180000       39.853480 
      51       80.160000       39.845007 
      51       80.150000       39.842735 
      51       80.220000       39.842735 
      51       80.180000       39.842735 
      51       80.200000       39.842735 
      51       80.190000       39.842735 
      51       80.140000       39.842735 
      51       80.200000       39.842735 
      51       80.140000       39.842735 
      51       80.140000       39.845007 
      52       80.090000       39.853507 
      52       80.100000       39.853507 
      52       80.140000       39.853507 
      52       80.160000       39.893401 
      52       80.180000       39.933255 
      52       80.170000       39.933255 
      52       80.200000       39.940465 
      52       80.250000       39.927869 
      52       80.120000       39.869204 
      52       80.150000       39.869204 
      52       80.200000       39.869204 
      52       80.160000       39.869204 
      52       80.210000       39.869204 
      52       80.150000       39.869204 
      52       80.110000       39.869204 
      53       80.160000       39.869204 
      53       80.130000       39.869204 
      53       80.140000       39.869204 
      53       80.090000       39.869204 
      53       80.220000       39.869204 
      53       80.190000       39.869204 
      53       80.130000       39.813613 
      53       80.180000       39.820810 
      53       80.160000       39.820810 
      53       80.160000       39.820810 
      53       80.130000       39.820810 
      53       80.180000       39.820810 
      53       80.200000       39.820810 
      53       80.190000       39.820810 
      53       80.180000       39.820810 
      54       80.170000       39.820810 
      54       80.120000       39.820810 
      54       80.200000       39.820810 
      54       80.140000       39.820810 
      54       80.100000       39.820810 
      54       80.120000       39.820810 
      54       80.170000       39.820810 
      54       80.150000       39.837309 
      54       80.170000       39.843677 
      54       80.150000       39.842668 
      54       80.150000       39.844120 
      54       80.170000       39.844120 
      54       80.160000       39.844120 
      54       80.130000       39.844120 
      54       80.170000       39.844120 
      54       80.150000       39.844120 
      55       80.150000       39.844120 
      55       80.130000       39.844120 
      55       80.140000       39.844120 
      55       80.160000       39.842682 
      55       80.100000       39.844120 
      55       80.160000       39.844120 
      55       80.140000       39.842669 
      55       80.170000       39.843691 
      55       80.150000       39.843691 
      55       80.110000       39.843691 
      55       80.170000       39.843691 
      55       80.140000       39.843691 
      55       80.160000       39.843691 
      55       80.130000       39.843691 
      55       80.120000       39.843691 
      56       80.200000       39.843691 
      56       80.150000       39.837739 
      56       80.140000       39.825752 
      56       80.170000       39.825752 
      56       80.140000       39.825752 
      56       80.150000       39.825752 
      56       80.140000       39.825752 
      56       80.140000       39.825752 
      56       80.100000       39.825752 
      56       80.080000       39.825752 
      56       80.130000       39.825752 
      56       80.160000       39.825752 
      56       80.080000       39.825752 
      56       80.100000       39.825752 
      56       80.190000       39.825752 
      57       80.180000       39.825752 
      57       80.150000       39.825752 
      57       80.170000       39.831954 
      57       80.110000       39.879045 
      57       80.200000       39.879045 
      57       80.090000       39.879045 
      57       80.180000       39.879045 
      57       80.130000       39.879045 
      57       80.060000       39.879045 
      57       80.180000       39.879045 
      57       80.090000       39.879045 
      57       80.150000       39.879045 
      57       80.120000       39.879045 
      57       80.110000       39.879045 
      57       80.120000       39.879045 
      57       80.190000       39.879045 
      58       80.060000       39.879045 
      58       80.080000       39.879045 
      58       80.180000       39.882146 
      58       80.070000       39.852634 
      58       80.190000       39.852634 
      58       80.080000       39.845866 
      58       80.130000       39.853506 
      58       80.130000       39.853506 
      58       80.170000       39.853506 
      58       80.140000       39.853506 
      58       80.030000       39.892515 
      58       80.190000       39.892515 
      58       80.160000       39.922470 
      58       80.090000       39.922470 
      58       80.110000       39.922470 
      59       80.110000       39.922470 
      59       80.110000       39.922470 
      59       80.150000       39.922470 
      59       80.130000       39.922470 
      59       80.110000       39.922470 
      59       80.130000       39.922470 
      59       80.140000       39.922470 
      59       80.140000       39.922470 
      59       80.100000       39.922470 
      59       80.130000       39.922470 
      59       80.060000       39.922470 
      59       80.100000       39.922470 
      59       80.060000       39.892514 
      59       80.080000       39.853480 
      59       80.140000       39.845007 
      60       80.130000       39.845007 
      60       80.100000       39.845007 
      60       80.150000       39.845007 
      60       80.100000       39.845007 
      60       80.070000       39.845007 
      60       80.120000       39.845007 
      60       80.060000       39.845007 
      60       80.120000       39.845007 
      60       80.050000       39.842709 
      60       80.160000       39.844120 
      60       80.120000       39.844120 
      60       80.080000       39.844120 
      60       80.050000       39.842668 
      60       80.100000       39.842668 
      60       80.130000       39.842668 
      60       80.050000       39.843677 
      61       80.080000       39.843677 
