

 time    ||    gripping force   ||   raspberry measurement 

      0       0.120000       -795.015385 
      0       0.070000       -795.015385 
      0       0.090000       -795.015385 
      1       0.080000       -787.065231 
      1       0.080000       -779.194578 
      1       0.100000       -771.402633 
      1       0.350000       -763.688606 
      1       0.310000       -756.051720 
      1       0.520000       -748.491203 
      1       5.660000       -741.006286 
      2       14.220000       -733.595055 
      2       47.790000       -726.153919 
      2       48.930000       -722.635461 
      2       71.370000       -679.771603 
      2       80.880000       -487.666076 
      2       86.010000       -170.926571 
      2       86.870000       21.194653 
      2       85.310000       64.061612 
      2       84.490000       67.581925 
      2       84.320000       67.686748 
      3       84.130000       67.689367 
      3       83.680000       67.687975 
      3       83.410000       67.690823 
      3       83.240000       67.708268 
      3       82.950000       67.815607 
      3       82.750000       68.090811 
      3       82.280000       68.466474 
      3       81.600000       68.791505 
      3       80.560000       69.113445 
      3       80.310000       69.405207 
      3       79.960000       69.513414 
      3       79.970000       69.526929 
      4       79.880000       69.565953 
      4       79.850000       69.610827 
      4       79.260000       69.642665 
      4       78.600000       69.609472 
      4       78.080000       69.569178 
      4       78.020000       69.613555 
      4       77.980000       69.651537 
      4       77.950000       69.588472 
      4       77.910000       69.513047 
      4       77.840000       69.510938 
      4       77.310000       69.496872 
      4       77.070000       69.451749 
      4       76.920000       69.436868 
      4       76.820000       69.489757 
      5       76.770000       69.478976 
      5       76.710000       69.440884 
      5       76.650000       69.469147 
      5       76.580000       69.431327 
      5       76.550000       69.315964 
      5       76.450000       69.263671 
      5       76.160000       69.301551 
      5       75.820000       69.293178 
      5       75.690000       69.235634 
      5       75.700000       69.146600 
      5       75.620000       69.097579 
      5       75.600000       69.068664 
      6       75.500000       69.076913 
      6       75.190000       69.123843 
      6       74.850000       69.208210 
      6       74.470000       69.274007 
      6       74.320000       69.302787 
      6       74.250000       69.361922 
      6       74.240000       69.407588 
      6       73.490000       69.361049 
      6       73.160000       69.292405 
      6       72.500000       69.230139 
      6       72.340000       69.142263 
      6       72.300000       69.072360 
      6       72.260000       69.035097 
      7       72.300000       69.067859 
      7       72.230000       69.108529 
      7       71.950000       69.067792 
      7       71.490000       69.032854 
      7       71.100000       69.044451 
      7       70.440000       69.009512 
      7       70.050000       68.968749 
      7       69.390000       69.008586 
      7       69.150000       69.032296 
      7       68.990000       68.967389 
      7       68.790000       68.905030 
      7       68.620000       68.896544 
      7       68.650000       68.917154 
      7       68.570000       68.948991 
      7       68.570000       68.939968 
      8       68.590000       68.944095 
      8       68.490000       69.026927 
      8       68.510000       69.071720 
      8       68.450000       68.991076 
      8       68.410000       68.903271 
      8       68.410000       68.851636 
      8       68.220000       68.785870 
      8       67.760000       68.788917 
      8       67.220000       68.870477 
      8       66.440000       68.899586 
      8       65.160000       68.883489 
      9       63.410000       68.844897 
      9       63.530000       68.827937 
      9       63.540000       68.849380 
      9       63.610000       68.832823 
      9       63.500000       68.798302 
      9       63.600000       68.790245 
      9       63.520000       68.787960 
      9       63.530000       68.789371 
      10       63.530000       68.787906 
      10       63.620000       68.788485 
      10       63.600000       68.777135 
      10       63.550000       68.740977 
      10       63.590000       68.708145 
      11       62.900000       68.740977 
      11       62.840000       68.777135 
      11       62.960000       68.788485 
      11       62.030000       68.787906 
      11       61.820000       68.789371 
      12       61.770000       68.787933 
      12       61.760000       68.789372 
      12       61.720000       68.787960 
      12       61.870000       68.790245 
      12       61.720000       68.798301 
      12       61.870000       68.832796 
      12       61.720000       68.848494 
      13       61.800000       68.817099 
      13       61.770000       68.795201 
      13       61.780000       68.788390 
      13       61.880000       68.789385 
      13       61.760000       68.787933 
      13       61.710000       68.789371 
      13       61.830000       68.787933 
      13       61.750000       68.789371 
      13       61.770000       68.787933 
      14       61.400000       68.789371 
      14       61.420000       68.787933 
      15       61.440000       68.789385 
      15       61.340000       68.788390 
      15       61.390000       68.795201 
      15       61.460000       68.817099 
      15       60.950000       68.848494 
      15       60.940000       68.832796 
      16       60.940000       68.798301 
      16       60.890000       68.790218 
      16       60.910000       68.787073 
      16       60.910000       68.778574 
      16       60.930000       68.739539 
      16       60.890000       68.709583 
      17       60.890000       68.739539 
      17       60.960000       68.778573 
      17       60.900000       68.787047 
      17       60.960000       68.789345 
      18       60.450000       68.787933 
      18       60.500000       68.789371 
      19       60.380000       68.787933 
      19       60.390000       68.789345 
      19       60.400000       68.787060 
      19       60.450000       68.778990 
      19       60.350000       68.744052 
      20       60.410000       68.722982 
      20       60.370000       68.731039 
      20       60.460000       68.722982 
      20       60.400000       68.744052 
      20       60.370000       68.778990 
      20       60.390000       68.787060 
      20       60.400000       68.789345 
      21       60.450000       68.787933 
      21       60.410000       68.789371 
      22       60.470000       68.787933 
      22       60.400000       68.789345 
      22       60.170000       68.787046 
      22       60.070000       68.778547 
      22       60.080000       68.738652 
      22       60.140000       68.698758 
      23       60.140000       68.690258 
      23       60.160000       68.687987 
      23       60.060000       68.690258 
      23       60.160000       68.698758 
      24       60.080000       68.738652 
      24       60.190000       68.778547 
      24       60.070000       68.787046 
      24       60.070000       68.789318 
      25       60.210000       68.787046 
      25       60.170000       68.778547 
      25       60.070000       68.738653 
      25       60.200000       68.698785 
      25       60.040000       68.691145 
      25       60.220000       68.698758 
      25       60.070000       68.737766 
      25       60.230000       68.767722 
      26       60.070000       68.737766 
      26       60.120000       68.698731 
      26       60.130000       68.690258 
      26       60.120000       68.687960 
      27       60.130000       68.689372 
      27       60.130000       68.687933 
      27       60.130000       68.689371 
      27       60.080000       68.687933 
      28       60.050000       68.689372 
      28       60.190000       68.687960 
      28       60.070000       68.690258 
      28       60.160000       68.698758 
      28       60.170000       68.738652 
      28       60.160000       68.778547 
      29       60.010000       68.787046 
      29       60.150000       68.789345 
      29       60.140000       68.787933 
      29       60.170000       68.789371 
      29       60.050000       68.787933 
      30       60.110000       68.789385 
      30       60.110000       68.788376 
      30       60.040000       68.794744 
      30       60.120000       68.811244 
      30       60.030000       68.818468 
      30       60.130000       68.763736 
      30       60.110000       68.714982 
      30       60.110000       68.739969 
      32       59.860000       68.778130 
      32       59.870000       68.781191 
      32       59.900000       68.759292 
      32       59.870000       68.718012 
      33       59.950000       68.696114 
      33       59.890000       68.699188 
      33       59.890000       68.737779 
      33       59.850000       68.767748 
      34       59.910000       68.738652 
      34       59.900000       68.709570 
      34       59.820000       68.739982 
      34       59.880000       68.783972 
      35       59.920000       68.811243 
      35       59.770000       68.829212 
      35       59.910000       68.811243 
      35       59.900000       68.783946 
      35       59.890000       68.739096 
      36       59.890000       68.698798 
      36       59.930000       68.691145 
      36       59.940000       68.698758 
      36       59.860000       68.737766 
      36       59.920000       68.767748 
      37       59.840000       68.738652 
      37       59.850000       68.709556 
      37       59.880000       68.739525 
      37       60.010000       68.778117 
      37       59.800000       68.781191 
      38       59.850000       68.759292 
      38       59.750000       68.717986 
      38       59.970000       68.695228 
      39       59.940000       68.688417 
      39       59.950000       68.690271 
      39       59.810000       68.698731 
      39       60.080000       68.737766 
      40       60.000000       68.767748 
      40       59.860000       68.738652 
      40       60.010000       68.709529 
      40       59.930000       68.738652 
      40       59.900000       68.767775 
      40       59.960000       68.738639 
      41       59.900000       68.709100 
      41       60.020000       68.733710 
      41       59.870000       68.749407 
      41       59.930000       68.727898 
      42       59.930000       68.743595 
      42       59.930000       68.768205 
      43       59.990000       68.738666 
      43       59.760000       68.709530 
      43       60.000000       68.738665 
      43       59.990000       68.768191 
      43       59.910000       68.743165 
      43       59.780000       68.722928 
      44       60.020000       68.730152 
      44       60.010000       68.712184 
      44       59.830000       68.695658 
      44       59.980000       68.699201 
      45       59.940000       68.738665 
      45       59.930000       68.778520 
      45       60.010000       68.786160 
      45       59.940000       68.778520 
      46       59.860000       68.738652 
      46       59.970000       68.698785 
      46       60.010000       68.691145 
      46       60.020000       68.698758 
      47       59.820000       68.737766 
      47       59.830000       68.767748 
      48       59.980000       68.738652 
      48       59.930000       68.709529 
      49       59.950000       68.738652 
      49       59.950000       68.767748 
      49       59.930000       68.737766 
      49       59.870000       68.698731 
      50       59.960000       68.690258 
      50       59.900000       68.687987 
      50       59.890000       68.690258 
      50       59.870000       68.698731 
      51       59.930000       68.737766 
      51       59.920000       68.767748 
      51       59.950000       68.738652 
      51       59.920000       68.709529 
      51       59.940000       68.738652 
      51       59.910000       68.767748 
      52       59.930000       68.737766 
      52       59.930000       68.698758 
      52       59.870000       68.691145 
      52       59.960000       68.698785 
      53       59.890000       68.738653 
      53       59.930000       68.778547 
      54       59.840000       68.787046 
      54       59.900000       68.789318 
      54       59.910000       68.787046 
      55       59.920000       68.778547 
      55       59.910000       68.738653 
      55       59.950000       68.698785 
      55       59.900000       68.691145 
      56       59.910000       68.698758 
      56       59.930000       68.737766 
      56       59.900000       68.767748 
      56       59.930000       68.738652 
      56       59.920000       68.709556 
      56       59.910000       68.739539 
      57       59.900000       68.778573 
      57       59.900000       68.787033 
      57       59.820000       68.788888 
      57       59.870000       68.782104 
      57       59.910000       68.760205 
      57       59.880000       68.728811 
      57       59.850000       68.744535 
      57       59.900000       68.779876 
      57       59.900000       68.797401 
      58       59.870000       68.831883 
      58       59.880000       68.837695 
      58       59.830000       68.768705 
      58       59.920000       68.715412 
      58       59.840000       68.739995 
      58       59.880000       68.778560 
      59       59.880000       68.786160 
      59       59.840000       68.778506 
      59       59.850000       68.738209 
      59       59.870000       68.693359 
      60       59.820000       68.666061 
      60       59.900000       68.648092 
      60       59.860000       68.666061 
      60       59.850000       68.693359 
