

 time    ||    gripping force   ||   raspberry measurement 

      0       40.070000       -794.944118 
      0       39.950000       -794.944118 
      0       33.420000       -794.944118 
      0       32.690000       -794.944118 
      0       32.830000       -794.944118 
      0       29.940000       -794.944118 
      0       23.040000       -794.944118 
      0       21.790000       -794.944118 
      0       21.260000       -794.944118 
      0       20.470000       -794.944113 
      0       19.190000       -794.942931 
      0       18.360000       -794.836536 
      1       16.860000       -791.313230 
      1       16.290000       -748.390841 
      1       15.970000       -556.029084 
      1       15.420000       -238.889200 
      1       14.760000       -46.543154 
      1       13.820000       -3.624336 
      1       13.440000       -0.109184 
      1       12.390000       -0.036802 
      1       12.110000       -0.130746 
      1       11.640000       -0.257512 
      2       11.320000       -0.353498 
      2       11.180000       -0.397410 
      2       11.080000       -0.442743 
      2       10.880000       -0.473156 
      2       10.960000       -0.442824 
      2       10.910000       -0.400123 
      2       11.070000       -0.387747 
      2       11.110000       -0.427058 
      2       11.220000       -0.502904 
      2       11.220000       -0.531087 
      2       11.340000       -0.594819 
      2       11.350000       -0.655231 
      3       11.360000       -0.680490 
      3       11.130000       -0.725218 
      3       10.990000       -0.720346 
      3       10.960000       -0.722644 
      3       12.200000       -0.800537 
      3       13.040000       -0.826116 
      3       13.930000       -0.791178 
      3       15.150000       -0.736486 
      3       16.750000       -0.665238 
      3       17.580000       -0.666651 
      3       18.340000       -0.734228 
      4       18.850000       -0.784008 
      4       19.220000       -0.802406 
      4       20.670000       -0.832831 
      4       21.340000       -0.829730 
      4       22.710000       -0.781713 
      4       23.600000       -0.763424 
      4       24.030000       -0.712189 
      4       24.710000       -0.583261 
      4       25.400000       -0.502063 
      4       25.600000       -0.601535 
      4       25.820000       -0.724757 
      5       26.040000       -0.709449 
      5       26.270000       -0.586739 
      5       27.210000       -0.502890 
      5       27.410000       -0.523070 
      5       27.500000       -0.493407 
      5       27.560000       -0.467011 
      5       27.490000       -0.488397 
      5       27.490000       -0.415828 
      5       27.460000       -0.261668 
      5       27.480000       -0.163524 
      6       27.450000       -0.205603 
      6       27.480000       -0.294346 
      6       27.430000       -0.310836 
      6       27.390000       -0.298862 
      6       27.460000       -0.282998 
      6       27.430000       -0.245539 
      6       27.350000       -0.201934 
      6       27.420000       -0.187662 
      6       27.400000       -0.158886 
      6       27.420000       -0.177806 
      6       27.410000       -0.208551 
      7       27.420000       -0.142811 
      7       27.360000       -0.064325 
      7       27.430000       -0.048641 
      7       27.370000       -0.058483 
      7       27.410000       -0.112744 
      7       28.150000       -0.138161 
      7       28.420000       -0.078249 
      7       28.580000       -0.034689 
      7       28.590000       -0.041926 
      7       28.600000       -0.047685 
      7       28.570000       -0.070193 
      7       28.500000       -0.088424 
      7       28.580000       -0.099762 
      8       28.480000       -0.116691 
      8       28.560000       -0.123902 
      8       28.530000       -0.068338 
      8       28.510000       -0.010531 
      8       28.570000       -0.007834 
      8       28.470000       -0.052211 
      8       28.490000       -0.118530 
      8       28.520000       -0.109065 
      8       28.500000       -0.073350 
      9       28.520000       -0.109978 
      9       28.560000       -0.130241 
      9       28.490000       -0.112303 
      9       28.500000       -0.147258 
      9       28.530000       -0.192507 
      9       28.460000       -0.231502 
      9       28.480000       -0.223419 
      9       28.540000       -0.146784 
      9       28.500000       -0.077351 
      9       28.500000       -0.035159 
      9       28.510000       -0.049136 
      9       28.500000       -0.074526 
      9       28.500000       -0.054052 
      10       29.110000       -0.053043 
      10       29.920000       -0.081363 
      10       30.000000       -0.071868 
      10       29.980000       -0.075578 
      10       30.050000       -0.088425 
      10       30.040000       -0.093459 
      10       30.010000       -0.091512 
      10       30.040000       -0.092008 
      10       29.990000       -0.088813 
      10       29.930000       -0.079550 
      10       30.000000       -0.040549 
      11       30.020000       -0.015805 
      11       29.930000       -0.068381 
      11       29.870000       -0.135160 
      11       29.940000       -0.118681 
      11       29.970000       -0.051468 
      11       29.890000       -0.026039 
      11       29.890000       -0.055995 
      11       29.950000       -0.076238 
      11       29.950000       -0.072379 
      11       29.870000       -0.032612 
      12       29.960000       0.006771 
      12       29.890000       0.010212 
      12       29.880000       -0.006225 
      12       29.900000       -0.023101 
      12       29.930000       -0.005905 
      12       29.910000       0.011340 
      12       29.860000       0.017556 
      12       29.920000       0.016369 
      12       29.870000       0.017204 
      12       29.910000       0.010289 
      12       29.870000       -0.011507 
      13       29.890000       -0.042897 
      13       29.930000       -0.031835 
      13       29.890000       -0.015976 
      13       29.960000       -0.023394 
      13       29.890000       -0.005783 
      13       29.870000       0.006580 
      13       29.900000       -0.005791 
      13       29.830000       -0.023110 
      13       29.940000       -0.015302 
      13       29.900000       -0.030715 
      14       29.820000       -0.041893 
      14       29.860000       -0.019781 
      14       29.880000       -0.035136 
      14       29.840000       -0.059974 
      14       29.960000       -0.039132 
      14       29.940000       -0.038606 
      14       29.940000       -0.076482 
      14       29.930000       -0.108030 
      14       29.870000       -0.155819 
      14       29.930000       -0.137297 
      14       29.910000       -0.086820 
      15       29.890000       -0.064081 
      15       29.910000       -0.028040 
      15       29.910000       -0.012180 
      15       29.880000       -0.043138 
      15       29.880000       -0.064386 
      15       29.950000       -0.070459 
      15       29.850000       -0.067918 
      15       29.900000       -0.058863 
      15       29.950000       -0.019618 
      15       29.930000       0.010673 
      15       29.980000       -0.013771 
      15       29.950000       -0.029173 
      15       29.970000       -0.007588 
      16       29.990000       -0.023078 
      16       29.980000       -0.048062 
      16       29.980000       -0.028177 
      16       30.020000       -0.037135 
      16       29.960000       -0.106940 
      16       30.020000       -0.146586 
      16       29.980000       -0.138159 
      16       30.030000       -0.115332 
      16       30.040000       -0.106776 
      16       30.010000       -0.078054 
      16       29.950000       -0.035694 
      17       29.980000       0.010502 
      17       29.990000       0.033354 
      17       29.960000       0.039802 
      17       29.930000       0.038393 
      17       30.010000       0.038595 
      17       30.020000       0.026959 
      17       30.010000       -0.009545 
      17       30.010000       -0.047272 
      17       29.960000       -0.037399 
      17       29.950000       -0.030912 
      17       30.060000       -0.006101 
      18       29.990000       0.019109 
      18       30.020000       -0.011577 
      18       29.920000       -0.054998 
      18       29.980000       -0.080622 
      18       29.970000       -0.088657 
      18       29.980000       -0.043025 
      18       29.950000       -0.027467 
      18       30.020000       -0.073374 
      18       29.960000       -0.091620 
      18       30.000000       -0.070422 
      18       30.040000       -0.009215 
      18       29.960000       0.027511 
      18       29.970000       0.019888 
      19       29.990000       -0.001317 
      19       30.000000       -0.002923 
      19       29.900000       -0.001274 
      19       29.990000       0.019732 
      19       29.980000       0.026482 
      19       29.990000       -0.014472 
      19       29.970000       -0.083626 
      19       29.970000       -0.081353 
      19       29.950000       -0.013662 
      20       29.970000       0.034931 
      20       29.990000       0.043821 
      20       30.000000       0.045644 
      20       30.010000       0.042514 
      20       29.990000       0.028768 
      20       30.020000       -0.029612 
      20       30.010000       -0.083926 
      20       29.970000       -0.071042 
      20       30.010000       -0.034961 
      20       30.020000       -0.007861 
      20       29.970000       -0.005725 
      20       29.910000       -0.007725 
      20       29.980000       -0.034399 
      21       29.980000       -0.069438 
      21       29.940000       -0.081227 
      21       29.980000       -0.031151 
      21       30.030000       0.003259 
      21       30.000000       -0.024225 
      21       30.020000       -0.059956 
      21       29.980000       -0.121929 
      21       29.990000       -0.166770 
      21       30.010000       -0.124825 
      22       30.020000       -0.084920 
      22       29.960000       -0.085891 
      22       29.970000       -0.061885 
      22       29.920000       -0.025431 
      22       29.990000       -0.003305 
      22       29.950000       -0.019811 
      22       30.010000       -0.036786 
      22       30.010000       -0.042748 
      22       29.970000       -0.041322 
      22       30.010000       -0.042319 
      22       30.000000       -0.039621 
      23       29.990000       -0.030837 
      23       30.000000       0.008090 
      23       29.980000       0.036827 
      23       29.990000       -0.002571 
      23       30.010000       -0.073038 
      23       30.030000       -0.086984 
      23       30.020000       -0.008440 
      24       29.990000       0.086093 
      24       30.070000       0.106117 
      24       29.970000       0.038032 
      24       30.000000       -0.015495 
      24       30.000000       0.004052 
      24       30.000000       0.022331 
      24       29.960000       0.000210 
      25       29.980000       -0.038232 
      25       29.940000       -0.072178 
      25       30.080000       -0.037593 
      25       30.000000       -0.004521 
      25       30.000000       -0.010603 
      25       30.020000       -0.077520 
      25       29.990000       -0.102880 
      25       29.980000       -0.020694 
      26       30.000000       0.042069 
      26       30.010000       0.044322 
      26       30.000000       -0.007605 
      26       30.000000       -0.039420 
      26       29.970000       -0.002218 
      26       30.020000       0.000847 
      26       30.030000       -0.019469 
      26       30.030000       0.000582 
      26       30.060000       -0.007813 
      26       30.040000       -0.068497 
      27       30.060000       -0.075350 
      27       29.970000       -0.044914 
      27       30.050000       -0.027088 
      27       29.940000       0.013490 
      27       29.990000       0.052437 
      27       29.990000       0.054983 
      27       30.030000       0.032727 
      27       29.940000       -0.009318 
      27       30.010000       -0.040717 
      27       30.000000       -0.074487 
      27       30.040000       -0.066604 
      27       30.000000       -0.004775 
      28       30.010000       0.008181 
      28       30.010000       0.003210 
      28       30.040000       0.034710 
      28       30.010000       0.051149 
      28       30.030000       0.038345 
      28       30.030000       0.016517 
      28       30.030000       0.014294 
      28       29.950000       0.010890 
      28       30.040000       0.014015 
      28       30.010000       0.015095 
      28       30.020000       0.026989 
      29       30.020000       0.006233 
      29       30.050000       -0.029243 
      29       29.980000       -0.046340 
      29       30.040000       -0.080852 
      29       29.970000       -0.095184 
      29       29.980000       -0.058232 
      29       30.010000       -0.016935 
      29       30.010000       0.010424 
      29       30.010000       0.012430 
      30       30.050000       0.011512 
      30       30.020000       -0.001060 
      30       30.040000       0.014504 
      30       30.000000       0.030324 
      30       30.000000       0.022444 
      30       30.020000       0.039171 
      30       30.070000       0.046178 
      30       30.020000       0.014827 
      30       30.030000       -0.017440 
      30       29.990000       0.013975 
      31       30.020000       0.034873 
      31       30.030000       -0.011372 
      31       30.070000       -0.074022 
      31       30.010000       -0.090880 
      31       30.030000       -0.120296 
      31       30.030000       -0.098526 
      31       30.010000       -0.063568 
      32       30.020000       -0.106253 
      32       30.030000       -0.148285 
      32       29.990000       -0.091727 
      32       30.020000       0.004516 
      32       29.980000       0.058685 
      32       30.030000       0.067763 
      32       30.030000       0.068549 
      32       30.030000       0.056653 
      32       29.970000       0.020291 
      32       30.030000       -0.012416 
      32       30.050000       0.020212 
      32       29.990000       0.055806 
      33       30.020000       0.066485 
      33       29.970000       0.065247 
      33       29.970000       0.066019 
      33       30.000000       0.063096 
      33       30.040000       0.054476 
      33       30.010000       0.019342 
      33       29.970000       -0.001736 
      33       30.030000       0.005407 
      33       30.000000       -0.012437 
      33       30.040000       -0.028673 
      33       29.990000       -0.024878 
      33       29.960000       0.014427 
      34       30.000000       0.053326 
      34       29.990000       0.055889 
      34       29.980000       0.034488 
      34       30.000000       0.002650 
      34       30.040000       0.012806 
      34       30.030000       0.022448 
      34       30.010000       -0.014176 
      34       30.040000       -0.053499 
      34       29.990000       -0.065834 
      34       30.030000       -0.015498 
      35       30.010000       0.023700 
      35       30.030000       0.015925 
      35       30.000000       0.010890 
      35       29.980000       -0.002076 
      35       29.970000       0.013486 
      35       30.000000       0.029317 
      35       30.020000       0.021472 
      35       30.070000       0.039060 
      35       30.060000       0.055842 
      36       29.990000       0.060324 
      36       30.020000       0.043591 
      36       30.040000       -0.015745 
      36       30.040000       -0.078173 
      36       30.050000       -0.035678 
      36       30.020000       0.017387 
      36       30.020000       0.017759 
      36       30.040000       0.016610 
      36       30.040000       -0.040759 
      36       30.020000       -0.096207 
      36       29.990000       -0.034934 
      36       30.020000       0.031440 
      37       30.020000       0.010844 
      37       30.020000       -0.031539 
      37       30.020000       -0.053289 
      37       30.000000       -0.051935 
      37       30.050000       -0.018099 
      37       30.020000       -0.006873 
      37       29.960000       0.013643 
      37       30.080000       0.024579 
      38       30.060000       -0.006721 
      38       30.020000       -0.023041 
      38       30.040000       -0.006875 
      38       30.070000       0.018955 
      38       30.020000       -0.014546 
      38       30.000000       -0.054253 
      38       30.110000       -0.008075 
      38       30.000000       0.049273 
      39       30.090000       0.062062 
      39       30.080000       0.063703 
      39       30.050000       0.056337 
      39       29.990000       0.033243 
      39       30.090000       -0.007983 
      39       30.060000       -0.029583 
      39       30.040000       -0.026217 
      39       30.080000       0.013102 
      40       30.030000       0.052453 
      40       30.030000       0.060343 
      40       30.040000       0.062015 
      40       30.030000       0.059997 
      40       30.060000       0.060795 
      40       30.050000       0.057925 
      40       30.070000       0.049369 
      41       30.040000       0.014725 
      41       30.050000       -0.000975 
      41       30.070000       0.029690 
      41       30.030000       0.046166 
      41       30.130000       0.033797 
      41       30.050000       0.015644 
      41       30.080000       0.017320 
      41       30.090000       -0.026416 
      41       30.090000       -0.085491 
      42       30.070000       -0.059873 
      42       30.060000       -0.009571 
      42       30.010000       -0.007252 
      42       30.080000       0.013705 
      42       30.070000       0.038769 
      42       30.060000       0.013207 
      42       30.070000       -0.006946 
      42       30.070000       0.001112 
      42       30.110000       -0.007340 
      42       30.060000       0.007396 
      43       30.010000       0.008143 
      43       30.110000       -0.060638 
      43       30.090000       -0.111953 
      43       30.080000       -0.076657 
      43       30.080000       0.000386 
      43       30.110000       0.049650 
      44       29.960000       0.057569 
      44       30.110000       0.049482 
      44       30.030000       0.010369 
      44       30.070000       -0.019390 
      44       30.060000       0.010460 
      45       30.000000       0.048999 
      45       30.090000       0.056898 
      45       30.090000       0.058604 
      45       30.090000       0.056607 
      45       30.070000       0.057040 
      45       30.100000       0.050139 
      45       30.010000       0.032452 
      45       30.040000       0.015163 
      45       30.030000       0.031975 
      45       30.040000       0.048842 
      45       29.980000       0.054683 
      45       30.080000       0.053112 
      46       30.060000       0.053167 
      46       30.060000       0.041385 
      46       30.130000       0.004737 
      46       30.090000       -0.033134 
      46       30.100000       -0.023402 
      46       30.100000       -0.017028 
      46       30.070000       0.008495 
      46       30.030000       0.043385 
      46       30.120000       0.050115 
      47       30.080000       0.042476 
      47       30.050000       0.007927 
      47       30.090000       -0.007705 
      47       30.050000       0.023013 
      47       30.040000       0.039105 
      47       30.060000       0.021089 
      47       30.070000       -0.024083 
      47       30.050000       -0.060051 
      47       30.080000       -0.062710 
      47       30.080000       -0.024673 
      47       30.110000       0.001162 
      47       30.090000       0.028366 
      48       30.060000       0.046132 
      48       30.070000       0.052027 
      48       30.090000       0.050496 
      48       30.080000       0.050989 
      48       30.040000       0.043737 
      48       30.080000       0.021619 
      48       30.010000       -0.009703 
      48       30.130000       0.005083 
      48       30.090000       0.029369 
      48       30.090000       -0.000181 
      48       30.050000       -0.029423 
      49       30.050000       -0.004353 
      49       30.080000       0.015725 
      49       30.100000       0.008416 
      49       30.040000       0.026121 
      49       30.040000       0.042234 
      49       30.050000       0.038729 
      49       30.090000       0.004191 
      49       30.120000       -0.016284 
      49       30.070000       -0.003651 
      50       30.020000       0.002525 
      50       30.100000       0.024783 
      50       30.120000       0.042160 
      50       30.060000       0.048082 
      50       30.090000       0.046589 
      50       30.070000       0.047135 
      50       30.070000       0.040307 
      50       29.870000       0.021854 
      50       30.040000       -0.005554 
      50       30.160000       -0.030248 
      50       29.930000       -0.057956 
      50       30.050000       -0.021403 
      50       30.020000       0.031571 
      51       30.040000       0.039244 
      51       30.080000       0.022930 
      51       30.050000       0.005775 
      51       30.020000       0.022682 
      51       30.070000       0.039641 
      51       30.090000       0.045575 
      52       30.080000       0.044121 
      52       30.010000       0.045117 
      52       30.060000       0.043242 
      52       30.070000       0.044233 
      52       30.070000       0.042354 
      52       30.030000       0.042929 
      52       30.040000       0.036156 
      52       30.060000       0.018183 
      52       30.010000       -0.003870 
      53       30.070000       -0.005503 
      53       30.110000       -0.004653 
      53       30.060000       0.007425 
      53       30.020000       -0.013109 
      53       30.110000       -0.047528 
      53       30.030000       -0.054191 
      53       30.070000       -0.046098 
      53       30.080000       -0.007019 
      53       29.990000       0.022707 
      53       30.060000       -0.007163 
      54       30.000000       -0.045297 
      54       30.060000       -0.047887 
      54       30.040000       -0.025728 
      54       30.030000       0.015422 
      54       30.080000       0.037799 
      54       30.090000       0.044190 
      54       30.060000       0.042763 
      54       30.060000       0.043772 
      54       30.050000       0.041911 
      55       30.090000       0.042915 
      55       30.080000       0.041049 
      55       30.120000       0.041637 
      55       30.040000       0.034890 
      55       30.040000       0.017356 
      55       30.080000       0.000218 
      55       30.100000       0.017180 
      55       30.070000       0.034194 
      55       30.090000       0.040182 
      55       30.120000       0.038742 
      56       30.100000       0.038516 
      56       30.030000       0.021987 
      56       30.090000       -0.032638 
      56       30.050000       -0.080357 
      56       30.070000       -0.031508 
      56       30.160000       0.023213 
      56       30.120000       0.039123 
      56       30.050000       0.038572 
      56       30.140000       0.039224 
      56       30.050000       0.032502 
      57       30.080000       0.014991 
      57       30.160000       -0.002124 
      57       30.020000       0.014862 
      57       30.070000       0.031886 
      57       30.010000       0.037472 
      57       30.190000       0.031192 
      57       30.080000       0.013708 
      57       29.970000       -0.003394 
      58       30.100000       0.013605 
      58       30.100000       0.030654 
      58       30.100000       0.036638 
      58       30.080000       0.033984 
      58       30.120000       0.019937 
      58       30.080000       -0.042423 
      58       30.080000       -0.105805 
      58       30.050000       -0.075104 
      58       30.030000       -0.001984 
      58       30.140000       0.025034 
      59       30.070000       0.013781 
      59       30.080000       -0.002856 
      59       30.050000       0.014150 
      59       30.100000       0.031194 
      59       30.060000       0.037213 
      59       30.050000       0.035842 
      59       30.020000       0.036921 
      59       30.070000       0.035115 
      59       30.070000       0.035762 
      59       30.110000       0.029061 
      59       30.040000       0.011159 
      59       30.070000       -0.010823 
      60       30.060000       -0.012361 
      60       30.130000       -0.010592 
      60       30.030000       0.011385 
      60       30.140000       0.028882 
      60       30.080000       0.034937 
      60       30.050000       0.033589 
      60       30.110000       0.034691 
      60       30.190000       0.032920 
      60       30.080000       0.034015 
      61       30.090000       0.032251 
