Human trial picking the raspberry twin 

 time    ||     output compensated 

      0       -798.950000 
      0       -798.950000 
      0       -798.950000 
      0       -798.950000 
      0       -798.950000 
      0       -798.950000 
      0       -798.950000 
      0       -798.950000 
      0       -798.950000 
      0       -798.949995 
      0       -798.948807 
      0       -798.841877 
      0       -795.300843 
      0       -752.162491 
      0       -558.832851 
      0       -240.097197 
      0       -46.783255 
      0       -3.648003 
      0       -0.108825 
      0       -0.000469 
      0       -0.000720 
      0       0.000723 
      0       -0.000715 
      0       0.000723 
      0       -0.000715 
      0       0.000723 
      0       -0.000715 
      0       0.000723 
      0       -0.000715 
      0       0.000723 
      0       -0.000715 
      0       0.000723 
      0       -0.000715 
      0       0.000723 
      0       -0.000715 
      1       0.000723 
      1       -0.000715 
      1       0.000723 
      1       -0.000715 
      1       0.000723 
      1       -0.000715 
      1       0.000723 
      1       -0.000715 
      1       0.000723 
      1       -0.000715 
      1       0.000723 
      1       -0.000715 
      1       0.000723 
      1       -0.000715 
      1       0.000697 
      1       -0.001601 
      1       -0.010061 
      1       -0.048666 
      1       -0.073666 
      1       -0.024912 
      1       0.029819 
      1       0.022596 
      1       0.006096 
      1       -0.000272 
      1       0.000737 
      1       -0.000715 
      1       0.000723 
      2       -0.000715 
      2       0.000723 
      2       -0.000715 
      2       0.000723 
      2       -0.000715 
      2       0.000723 
      2       -0.000715 
      2       0.000723 
      2       -0.000715 
      2       0.000723 
      2       -0.000715 
      2       0.000723 
      2       -0.000715 
      2       0.000723 
      2       -0.000715 
      2       0.000723 
      2       -0.000728 
      2       0.000280 
      2       -0.006114 
      2       -0.023474 
      2       -0.040609 
      2       -0.023474 
      3       -0.006114 
      3       0.000280 
      3       -0.000728 
      3       0.000723 
      3       -0.000715 
      3       0.000723 
      3       -0.000715 
      3       0.000723 
      3       -0.000715 
      3       0.000723 
      3       -0.000715 
      3       0.000723 
      3       -0.000715 
      3       0.000723 
      3       -0.000715 
      3       0.000723 
      3       -0.000715 
      3       0.000723 
      3       -0.000715 
      3       0.000723 
      3       -0.000715 
      3       0.000723 
      3       -0.000715 
      3       0.000723 
      3       -0.000728 
      3       0.000280 
      4       -0.006128 
      4       -0.023930 
      4       -0.046438 
      4       -0.052640 
      4       -0.065263 
      4       -0.045469 
      4       -0.020252 
      4       -0.049293 
      4       -0.078044 
      4       -0.052487 
      4       -0.031928 
      4       -0.038761 
      4       -0.020558 
      4       -0.003140 
      5       0.003222 
      5       0.002191 
      5       0.003607 
      5       0.002147 
      5       0.003549 
      5       0.002090 
      5       0.003493 
      5       0.002021 
      5       0.002999 
      5       -0.003361 
      5       -0.020514 
      5       -0.037273 
      5       -0.019936 
      5       -0.002551 
      5       0.003805 
      5       0.002769 
      5       0.004178 
      5       0.002713 
      5       0.004109 
      5       0.002644 
      5       0.004042 
      5       0.002577 
      6       0.003976 
      6       0.002512 
      6       0.003911 
      6       0.002448 
      6       0.003847 
      6       0.002385 
      6       0.003785 
      6       0.002323 
      6       0.003724 
      6       0.002263 
      6       0.003664 
      6       0.002203 
      6       0.003605 
      6       0.002145 
      6       0.003548 
      6       0.002088 
      6       0.003465 
      6       0.001168 
      6       -0.006833 
      7       -0.041340 
      7       -0.061373 
      7       -0.048289 
      7       -0.041680 
      7       -0.019405 
      7       -0.006493 
      7       -0.018695 
      7       -0.035046 
      7       -0.017719 
      7       -0.000355 
      7       0.005979 
      7       0.004947 
      7       0.007186 
      7       0.015530 
      7       0.054949 
      7       0.096541 
      7       0.136500 
      7       0.286513 
      7       0.544095 
      7       0.735404 
      7       0.849668 
      7       1.038846 
      7       1.361700 
      7       1.710777 
      7       1.904926 
      7       2.084026 
      7       2.373991 
      7       2.688823 
      7       2.908012 
      7       3.017565 
      7       3.118023 
      7       3.300594 
      7       3.510795 
      7       3.705935 
      7       3.856975 
      8       3.984467 
      8       4.163787 
      8       4.413066 
      8       4.648862 
      8       4.818326 
      8       4.899971 
      8       4.915240 
      8       4.918022 
      8       4.916623 
      8       4.917995 
      8       4.914340 
      8       4.888756 
      8       4.765433 
      8       4.556159 
      8       4.380009 
      8       4.252710 
      8       4.188675 
      8       4.287695 
      8       4.537774 
      8       4.777972 
      8       4.893243 
      8       4.914783 
      8       4.918894 
      8       4.927408 
      8       4.965973 
      8       4.989683 
      8       4.926008 
      8       4.813151 
      8       4.753029 
      8       4.736473 
      8       4.717621 
      8       4.777712 
      8       4.861430 
      8       4.861058 
      8       4.837777 
      8       4.868215 
      8       4.907224 
      8       4.914395 
      8       4.901395 
      9       4.838633 
      9       4.774180 
      9       4.803933 
      9       4.870609 
      9       4.814697 
      9       4.361972 
      9       3.206876 
      9       1.478510 
      9       0.190220 
      9       0.247019 
      9       0.459713 
      9       0.123067 
      9       -0.372840 
      9       -0.848650 
      9       -1.189771 
      9       -1.377299 
      9       -1.452315 
      9       -1.495822 
      9       -1.580705 
      9       -1.655428 
      9       -1.733169 
      9       -1.794839 
      9       -1.822370 
      9       -1.806108 
      9       -1.788801 
      9       -1.783240 
      9       -1.793288 
      9       -1.819077 
      9       -1.808888 
      9       -1.719617 
      9       -1.648757 
      9       -1.599883 
      9       -1.552761 
      9       -1.499206 
      9       -1.478443 
      9       -1.579494 
      9       -1.705212 
      9       -1.804021 
      9       -1.841538 
      9       -1.867657 
      9       -1.879285 
      9       -1.847918 
      9       -1.830975 
      9       -1.843405 
      9       -1.865470 
      9       -1.871659 
      9       -1.884255 
      9       -1.863602 
      10       -1.828704 
      10       -1.821493 
      10       -1.829147 
      10       -1.869015 
      10       -1.908908 
      10       -1.917368 
      10       -1.918350 
      10       -1.901211 
      10       -1.836304 
      10       -1.748902 
      10       -1.751586 
      10       -1.786055 
      10       -1.806264 
      10       -1.854619 
      10       -1.857759 
      10       -1.828220 
      10       -1.820607 
      10       -1.818751 
      10       -1.824689 
      10       -1.837053 
      10       -1.834088 
      10       -1.785971 
      10       -1.723362 
      10       -1.673972 
      10       -1.720177 
      10       -1.768071 
      10       -1.741632 
      10       -1.706738 
      10       -1.703094 
      10       -1.736787 
      10       -1.753747 
      10       -1.803136 
      10       -1.868461 
      10       -1.862298 
      10       -1.829080 
      10       -1.826005 
      10       -1.842479 
      10       -1.858312 
      10       -1.826725 
      10       -1.757484 
      10       -1.717424 
      10       -1.757884 
      10       -1.767173 
      10       -1.778940 
      10       -1.809782 
      10       -1.817878 
      10       -1.825052 
      10       -1.840706 
      11       -1.837588 
      11       -1.740278 
      11       -1.640459 
      11       -1.670801 
      11       -1.719677 
      11       -1.700396 
      11       -1.690097 
      11       -1.664945 
      11       -1.639515 
      11       -1.669888 
      11       -1.708935 
      11       -1.717395 
      11       -1.719264 
      11       -1.695767 
      11       -1.661623 
      11       -1.628043 
      11       -1.628687 
      11       -1.628310 
      11       -1.603651 
      11       -1.531212 
      11       -1.475649 
      11       -1.525563 
      11       -1.593353 
      11       -1.617713 
      11       -1.639784 
      11       -1.614820 
      11       -1.538496 
      11       -1.438203 
      11       -1.376510 
      11       -1.346150 
      11       -1.319944 
      11       -1.312897 
      11       -1.347691 
      11       -1.352841 
      11       -1.375325 
      11       -1.434232 
      11       -1.398196 
      11       -1.338554 
      11       -1.328646 
      11       -1.254567 
      11       -1.158689 
      11       -1.154562 
      11       -1.164860 
      11       -1.147460 
      11       -1.178262 
      11       -1.214196 
      11       -1.204311 
      11       -1.196727 
      11       -1.173819 
      11       -1.216951 
      11       -1.287643 
      11       -1.247819 
      11       -1.194530 
      12       -1.253634 
      12       -1.316810 
      12       -1.276113 
      12       -1.220039 
      12       -1.222754 
      12       -1.290455 
      12       -1.386260 
      12       -1.356291 
      12       -1.250977 
      12       -1.208869 
      12       -1.193167 
      12       -1.222063 
      12       -1.267469 
      12       -1.275649 
      12       -1.234022 
      12       -1.134315 
      12       -1.080790 
      12       -1.032719 
      12       -0.959354 
      12       -0.964041 
      12       -1.003926 
      12       -1.025570 
      12       -1.033518 
      12       -1.057368 
      12       -1.090039 
      12       -1.152814 
      12       -1.198064 
      12       -1.143332 
      12       -1.056526 
      12       -1.034430 
      12       -1.038071 
      12       -0.997693 
      12       -1.004864 
      12       -1.005276 
      12       -0.938957 
      12       -0.903647 
      12       -0.935330 
      12       -1.002219 
      12       -1.055915 
      12       -1.103476 
      12       -1.065328 
      12       -0.990136 
      12       -1.011579 
      12       -1.053240 
      12       -1.017806 
      12       -0.939846 
      12       -0.879294 
      12       -0.822831 
      12       -0.755638 
      12       -0.766756 
      12       -0.821097 
      12       -0.847803 
      13       -0.868666 
      13       -0.909666 
      13       -0.973521 
      13       -0.936578 
      13       -0.925627 
      13       -0.955846 
      13       -0.934526 
      13       -0.919206 
      13       -0.940741 
      13       -0.925447 
      13       -0.904934 
      13       -0.943359 
      13       -0.950570 
      13       -0.873496 
      13       -0.847030 
      13       -0.870311 
      13       -0.866750 
      13       -0.822334 
      13       -0.760983 
      13       -0.790066 
      13       -0.850113 
      13       -0.820973 
      13       -0.762755 
      13       -0.726887 
      13       -0.766325 
      13       -0.844785 
      13       -0.885951 
      13       -0.872582 
      13       -0.833990 
      13       -0.880196 
      13       -0.917305 
      13       -0.842069 
      13       -0.723277 
      13       -0.661910 
      13       -0.701305 
      13       -0.740313 
      13       -0.738514 
      13       -0.763198 
      13       -0.814706 
      13       -0.898564 
      13       -0.952247 
      13       -0.916516 
      13       -0.825904 
      13       -0.734988 
      13       -0.739001 
      13       -0.838885 
      13       -0.817789 
      13       -0.690163 
      13       -0.660072 
      13       -0.730940 
      13       -0.813360 
      13       -0.850586 
      14       -0.867573 
      14       -0.914261 
      14       -0.902481 
      14       -0.815259 
      14       -0.745672 
      14       -0.734085 
      14       -0.744357 
      14       -0.799531 
      14       -0.836175 
      14       -0.829574 
      14       -0.883297 
      14       -0.939274 
      14       -0.877012 
      14       -0.794149 
      14       -0.742958 
      14       -0.677647 
      14       -0.686067 
      14       -0.790964 
      14       -0.850043 
      14       -0.820130 
      14       -0.750991 
      14       -0.751140 
      14       -0.802495 
      14       -0.778850 
      14       -0.668500 
      14       -0.598247 
      14       -0.581067 
      14       -0.586133 
      14       -0.603492 
      14       -0.621903 
      14       -0.619219 
      14       -0.653714 
      14       -0.680153 
      14       -0.632658 
      14       -0.592795 
      14       -0.590563 
      14       -0.625501 
      14       -0.656939 
      14       -0.693153 
      14       -0.771253 
      14       -0.810564 
      14       -0.795920 
      14       -0.744719 
      14       -0.740355 
      14       -0.759930 
      14       -0.728684 
      14       -0.685110 
      14       -0.663211 
      14       -0.668553 
      14       -0.715618 
      14       -0.718746 
      14       -0.690092 
      14       -0.693224 
      14       -0.738016 
      14       -0.803020 
      14       -0.777411 
      15       -0.670825 
      15       -0.607633 
      15       -0.631786 
      15       -0.675281 
      15       -0.701679 
      15       -0.709735 
      15       -0.654144 
      15       -0.594606 
      15       -0.571681 
      15       -0.536742 
      15       -0.530474 
      15       -0.594079 
      15       -0.623644 
      15       -0.565426 
      15       -0.536746 
      15       -0.600404 
      15       -0.654127 
      15       -0.639859 
      15       -0.643429 
      15       -0.681495 
      15       -0.659556 
      15       -0.647942 
      15       -0.675627 
      15       -0.624171 
      15       -0.555585 
      15       -0.563668 
      15       -0.603948 
      15       -0.650197 
      15       -0.673358 
      15       -0.679336 
      15       -0.667986 
      15       -0.626443 
      15       -0.569413 
      15       -0.562351 
      15       -0.574299 
      15       -0.579820 
      15       -0.573842 
      15       -0.556496 
      15       -0.539414 
      15       -0.558268 
      15       -0.595452 
      15       -0.677064 
      15       -0.739691 
      15       -0.687836 
      15       -0.643846 
      15       -0.638070 
      15       -0.588251 
      15       -0.572694 
      15       -0.598939 
      15       -0.620184 
      15       -0.603895 
      15       -0.591947 
      16       -0.609724 
      16       -0.649767 
      16       -0.662600 
      16       -0.631815 
      16       -0.598566 
      16       -0.621460 
      16       -0.612545 
      16       -0.571830 
      16       -0.539938 
      16       -0.516750 
      16       -0.528534 
      16       -0.540873 
      16       -0.547140 
      16       -0.564651 
      16       -0.600775 
      16       -0.626712 
      16       -0.660353 
      16       -0.674222 
      16       -0.650515 
      16       -0.623316 
      16       -0.588043 
      16       -0.557960 
      16       -0.512708 
      16       -0.502839 
      16       -0.499017 
      16       -0.513622 
      16       -0.519519 
      16       -0.482818 
      16       -0.455871 
      16       -0.439663 
      16       -0.417615 
      16       -0.395611 
      16       -0.398780 
      16       -0.373907 
      16       -0.335605 
      16       -0.325097 
      16       -0.328984 
      16       -0.359819 
      16       -0.371760 
      16       -0.336962 
      16       -0.311913 
      16       -0.302051 
      16       -0.300016 
      16       -0.295579 
      16       -0.294047 
      16       -0.289682 
      16       -0.288223 
      17       -0.284355 
      17       -0.288281 
      17       -0.307955 
      17       -0.346620 
      17       -0.374660 
      17       -0.405502 
      17       -0.398816 
      17       -0.348207 
      17       -0.338160 
      17       -0.341726 
      17       -0.325152 
      17       -0.300030 
      17       -0.290903 
      17       -0.275524 
      17       -0.293241 
      17       -0.325723 
      17       -0.339868 
      17       -0.371883 
      17       -0.388637 
      17       -0.372280 
      17       -0.362418 
      17       -0.336497 
      17       -0.315069 
      17       -0.300256 
      17       -0.275148 
      17       -0.241277 
      17       -0.253553 
      17       -0.275355 
      17       -0.243344 
      17       -0.211654 
      17       -0.233901 
      17       -0.247102 
      17       -0.223364 
      17       -0.237508 
      18       -0.268884 
      18       -0.269265 
      18       -0.250198 
      18       -0.229907 
      18       -0.234733 
      18       -0.211527 
      18       -0.175687 
      18       -0.176192 
      18       -0.214733 
      18       -0.268993 
      18       -0.272442 
      18       -0.248038 
      18       -0.201608 
      18       -0.160110 
      18       -0.155001 
      18       -0.170224 
      18       -0.190778 
      18       -0.195010 
      18       -0.205557 
      18       -0.183906 
      18       -0.157330 
      18       -0.185839 
      18       -0.222611 
      18       -0.227949 
      18       -0.218970 
      18       -0.187562 
      18       -0.188744 
      18       -0.233051 
      18       -0.231954 
      18       -0.199157 
      18       -0.175721 
      18       -0.190077 
      18       -0.200030 
      18       -0.181243 
      18       -0.148350 
      18       -0.157513 
      18       -0.171453 
      18       -0.161336 
      18       -0.168111 
      18       -0.150477 
      18       -0.132994 
      18       -0.139215 
      19       -0.120020 
      19       -0.101608 
      19       -0.094261 
      19       -0.094317 
      19       -0.091937 
      19       -0.092441 
      19       -0.090093 
      19       -0.090629 
      19       -0.088724 
      19       -0.094167 
      19       -0.110412 
      19       -0.126272 
      19       -0.108045 
      19       -0.089819 
      19       -0.083893 
      19       -0.099609 
      19       -0.162419 
      19       -0.241991 
      19       -0.213397 
      19       -0.142963 
      19       -0.120675 
      19       -0.095908 
      19       -0.077286 
      19       -0.070169 
      19       -0.070479 
      19       -0.068776 
      19       -0.074857 
      19       -0.096626 
      19       -0.136167 
      19       -0.152842 
      19       -0.143940 
      19       -0.139240 
      19       -0.146411 
      19       -0.107097 
      19       -0.069792 
      19       -0.057870 
      19       -0.058715 
      19       -0.066517 
      19       -0.105347 
      19       -0.143788 
      19       -0.150753 
      19       -0.151108 
      19       -0.143718 
      19       -0.129975 
      19       -0.129496 
      19       -0.151718 
      19       -0.123588 
      20       -0.106400 
      20       -0.124358 
      20       -0.098747 
      20       -0.094703 
      20       -0.101185 
      20       -0.087867 
      20       -0.139723 
      20       -0.193743 
      20       -0.130630 
      20       -0.053447 
      20       -0.034711 
      20       -0.031238 
      20       -0.032297 
      20       -0.030549 
      20       -0.031668 
      20       -0.029927 
      20       -0.031065 
      20       -0.029756 
      20       -0.035789 
      20       -0.052643 
      20       -0.069933 
      20       -0.062108 
      20       -0.082372 
      20       -0.116150 
      20       -0.123391 
      20       -0.128886 
      20       -0.139465 
      20       -0.131079 
      20       -0.073309 
      20       -0.031435 
      20       -0.019445 
      20       -0.019810 
      20       -0.018162 
      20       -0.019404 
      20       -0.017786 
      20       -0.019032 
      20       -0.017418 
      20       -0.018681 
      21       -0.017496 
