

 time    ||    gripping force   ||   raspberry measurement 

      0       90.030000       -793.921951 
      0       90.030000       -793.921951 
      0       85.180000       -793.921951 
      0       65.830000       -793.921951 
      0       59.410000       -793.921951 
      0       24.210000       -793.921951 
      0       21.090000       -793.921951 
      0       19.500000       -793.921951 
      0       17.590000       -793.921951 
      0       15.300000       -793.921946 
      0       12.580000       -793.920766 
      1       11.660000       -785.876400 
      1       10.660000       -782.358815 
      1       33.470000       -739.505313 
      1       41.760000       -547.442874 
      1       63.120000       -230.762077 
      1       67.560000       -38.687616 
      1       70.440000       4.017103 
      2       71.990000       7.228534 
      2       73.080000       7.086044 
      2       74.230000       6.985352 
      2       75.380000       6.968356 
      2       76.180000       6.965521 
      2       76.060000       6.966918 
      2       75.880000       6.965479 
      2       75.750000       6.966918 
      2       75.640000       6.965506 
      2       75.550000       6.967832 
      2       76.210000       6.977231 
      2       76.790000       7.028353 
      2       76.750000       7.121611 
      2       76.630000       7.229127 
      3       76.580000       7.300486 
      3       76.550000       7.313443 
      3       76.510000       7.318953 
      3       77.060000       7.331870 
      3       78.650000       7.401940 
      3       79.680000       7.494549 
      3       80.620000       7.530122 
      3       81.090000       7.519259 
      3       82.700000       7.518497 
      3       83.140000       7.520213 
      3       83.090000       7.543191 
      3       82.970000       7.571751 
      4       83.090000       7.625640 
      4       83.190000       7.692762 
      4       83.380000       7.684302 
      4       83.320000       7.576278 
      4       83.320000       7.498840 
      4       83.300000       7.518872 
      4       83.320000       7.566529 
      4       83.270000       7.608502 
      4       83.260000       7.634207 
      4       83.170000       7.634528 
      5       83.160000       7.698812 
      5       83.170000       7.773479 
      5       83.070000       7.806355 
      5       83.140000       7.800018 
      5       83.140000       7.816197 
      5       83.060000       7.832285 
      5       86.650000       7.822952 
      5       88.030000       7.821500 
      5       90.060000       7.767348 
      5       89.920000       7.714454 
      5       89.810000       7.730568 
      5       89.730000       7.725195 
      6       89.700000       7.751208 
      6       89.660000       7.802259 
      6       89.460000       7.813040 
      6       89.490000       7.813098 
      6       89.460000       7.801817 
      6       89.390000       7.831979 
      6       89.280000       7.899988 
      6       89.290000       7.926053 
      6       89.230000       7.905444 
      7       89.170000       7.922014 
      7       89.440000       7.956106 
      8       89.450000       7.959207 
      8       89.380000       7.942694 
      8       89.860000       7.925585 
      8       89.950000       7.942721 
      8       89.820000       7.960080 
      9       89.890000       7.966448 
      9       89.850000       7.964593 
      9       89.820000       7.956549 
      9       89.840000       7.922054 
      9       89.860000       7.906357 
      9       89.850000       7.937725 
      9       89.810000       7.958764 
      9       89.770000       7.955663 
      10       89.790000       7.917072 
      10       89.740000       7.887129 
      10       89.740000       7.917085 
      10       89.760000       7.956119 
      10       89.780000       7.964553 
      10       89.740000       7.965561 
      10       89.770000       7.949268 
      10       89.720000       7.893870 
      10       89.670000       7.839968 
      11       89.680000       7.865160 
      11       89.700000       7.890160 
      11       89.650000       7.920725 
      11       89.660000       7.956509 
      11       89.720000       7.964605 
      11       89.690000       7.966864 
      11       89.670000       7.964593 
      11       89.720000       7.956119 
      11       89.620000       7.917085 
      12       89.640000       7.887129 
      12       89.600000       7.917085 
      12       89.640000       7.956119 
      12       89.610000       7.964593 
      12       89.610000       7.966891 
      13       89.590000       7.965479 
      13       89.610000       7.966918 
      13       89.630000       7.965479 
      13       89.600000       7.966918 
      13       89.580000       7.965479 
      13       89.560000       7.966918 
      13       89.580000       7.965479 
      13       89.600000       7.966891 
      13       89.550000       7.964606 
      13       89.540000       7.956549 
      13       89.500000       7.922028 
      14       89.550000       7.905470 
      14       89.560000       7.926926 
      14       89.490000       7.910370 
      14       89.510000       7.875875 
      14       89.570000       7.868677 
      14       89.490000       7.876331 
      14       89.520000       7.916199 
      14       89.500000       7.956093 
      14       89.520000       7.964593 
      14       89.520000       7.966891 
      15       89.540000       7.965479 
      15       89.470000       7.966918 
      15       89.510000       7.965479 
      15       89.510000       7.966877 
      15       89.440000       7.964136 
      15       89.470000       7.950277 
      15       89.470000       7.887489 
      15       89.570000       7.823038 
      15       89.550000       7.852980 
      15       89.690000       7.926080 
      16       90.370000       7.953352 
      16       90.330000       7.942237 
      16       90.350000       7.925571 
      16       90.340000       7.942720 
      16       90.330000       7.960080 
      16       90.340000       7.966474 
      16       90.330000       7.965466 
      16       90.320000       7.966891 
      16       90.380000       7.964606 
      16       90.420000       7.956549 
      16       90.360000       7.922054 
      17       90.390000       7.906357 
      17       90.390000       7.937725 
      17       90.350000       7.958764 
      17       90.430000       7.955663 
      17       90.390000       7.917072 
      17       90.370000       7.887129 
      17       90.330000       7.917085 
      17       90.380000       7.956119 
      17       90.370000       7.964593 
      17       90.360000       7.966864 
      17       90.330000       7.964606 
      18       90.320000       7.956549 
      18       90.400000       7.922054 
      18       90.410000       7.906330 
      18       90.370000       7.936852 
      18       90.340000       7.948422 
      18       90.390000       7.913098 
      18       90.420000       7.866449 
      18       90.340000       7.897857 
      18       90.360000       7.951150 
      18       90.420000       7.964163 
      18       90.360000       7.966878 
      19       90.330000       7.965479 
      19       90.320000       7.966918 
      19       90.340000       7.965479 
      19       90.360000       7.966918 
      19       90.330000       7.965479 
      19       90.390000       7.966918 
      19       90.340000       7.965479 
      19       90.350000       7.966878 
      19       90.300000       7.964163 
      19       90.300000       7.951150 
      20       90.340000       7.897857 
      20       90.350000       7.866463 
      20       90.360000       7.913554 
      20       90.310000       7.954251 
      20       90.270000       7.966018 
      20       90.280000       7.965452 
      20       90.280000       7.966917 
      21       90.320000       7.965479 
      21       90.290000       7.966891 
      21       90.270000       7.964606 
      21       90.280000       7.956549 
      21       90.310000       7.922014 
      21       90.350000       7.905028 
      21       90.300000       7.921554 
      21       90.260000       7.887059 
      21       90.320000       7.846778 
      21       90.310000       7.892861 
      21       90.310000       7.950264 
      22       90.220000       7.958321 
      22       90.290000       7.937698 
      22       90.350000       7.905914 
      22       90.290000       7.916655 
      22       90.310000       7.932352 
      22       90.280000       7.924712 
      23       90.210000       7.942694 
      23       90.290000       7.960067 
      23       90.310000       7.966031 
      23       90.300000       7.960067 
      23       90.230000       7.942720 
      23       90.270000       7.925585 
      24       90.230000       7.942721 
      24       90.270000       7.960080 
      24       90.210000       7.966474 
      24       90.290000       7.965466 
      24       90.280000       7.966918 
      24       90.230000       7.965479 
      24       90.230000       7.966918 
      24       90.260000       7.965479 
      25       90.210000       7.966918 
      25       90.220000       7.965479 
      25       90.280000       7.966918 
      25       90.230000       7.965479 
      25       90.280000       7.966918 
      25       90.280000       7.965479 
      25       90.220000       7.966918 
      25       90.270000       7.965466 
      25       90.270000       7.966474 
      25       90.240000       7.960080 
      25       90.210000       7.942721 
      25       90.200000       7.925585 
      25       90.220000       7.942694 
      25       90.150000       7.959194 
      25       90.260000       7.955690 
      26       90.180000       7.917515 
      26       90.210000       7.892502 
      26       90.230000       7.940409 
      26       90.210000       7.985632 
      26       90.250000       7.944909 
      27       90.200000       7.905900 
      27       90.200000       7.909015 
      27       90.240000       7.900085 
      27       90.210000       7.915769 
      27       90.190000       7.927370 
      27       90.210000       7.905484 
      27       90.200000       7.922027 
      27       90.220000       7.956522 
      27       90.230000       7.963720 
      27       90.220000       7.956093 
      27       90.230000       7.917085 
      28       90.180000       7.887129 
      28       90.180000       7.917085 
      28       90.210000       7.956119 
      28       90.180000       7.964593 
      28       90.160000       7.966891 
      28       90.140000       7.965479 
      28       90.170000       7.966918 
      28       90.140000       7.965479 
      28       90.170000       7.966918 
      28       90.190000       7.965479 
      29       90.140000       7.966918 
      29       90.190000       7.965479 
      29       90.170000       7.966918 
      29       90.190000       7.965466 
      29       90.150000       7.966474 
      29       90.190000       7.960080 
      29       90.160000       7.942721 
      30       90.190000       7.925585 
      30       90.210000       7.942721 
      30       90.220000       7.960080 
      30       90.160000       7.966474 
      30       90.080000       7.965466 
      30       90.140000       7.966917 
      31       90.190000       7.965466 
      31       90.180000       7.966474 
      31       90.190000       7.960080 
      32       90.120000       7.942721 
      32       90.160000       7.925585 
      32       90.110000       7.942721 
      32       90.190000       7.960080 
      32       90.140000       7.966474 
      32       90.150000       7.965466 
      32       90.130000       7.966918 
      32       90.180000       7.965479 
      33       90.120000       7.966918 
      33       90.140000       7.965479 
      33       90.190000       7.966918 
      33       90.160000       7.965479 
      33       90.150000       7.966918 
      33       90.140000       7.965479 
      33       90.150000       7.966918 
      33       90.160000       7.965479 
      33       90.140000       7.966918 
      33       90.200000       7.965466 
      34       90.180000       7.966474 
      34       90.180000       7.960080 
      34       90.170000       7.942720 
      34       90.110000       7.925572 
      34       90.110000       7.942277 
      34       90.140000       7.954668 
      34       90.120000       7.941821 
      34       90.180000       7.919743 
      34       90.150000       7.913554 
      34       90.110000       7.900958 
      35       90.120000       7.921611 
      35       90.160000       7.956509 
      35       90.080000       7.963720 
      35       90.170000       7.956093 
      35       90.150000       7.917071 
      36       90.140000       7.886686 
      36       90.090000       7.911686 
      36       90.110000       7.931922 
      36       90.130000       7.924699 
      36       90.160000       7.942694 
      36       90.160000       7.960066 
      36       90.130000       7.966018 
      36       90.110000       7.959637 
      36       90.150000       7.937751 
      36       90.120000       7.906357 
      37       90.100000       7.922054 
      37       90.130000       7.956549 
      37       90.100000       7.964606 
      37       90.100000       7.966891 
      37       90.090000       7.965479 
      37       90.090000       7.966918 
      37       90.090000       7.965479 
      38       90.130000       7.966891 
      38       90.180000       7.964606 
      38       90.130000       7.956549 
      38       90.100000       7.922054 
      38       90.120000       7.906344 
      39       90.070000       7.937295 
      39       90.120000       7.953795 
      39       90.070000       7.936422 
      39       90.110000       7.895975 
      39       90.160000       7.878629 
      39       90.150000       7.895989 
      39       90.060000       7.936878 
      39       90.100000       7.959624 
      40       90.130000       7.966461 
      40       90.130000       7.965466 
      40       90.070000       7.966918 
      40       90.160000       7.965506 
      40       90.070000       7.967804 
      40       90.110000       7.976264 
      40       90.050000       8.014855 
      41       90.100000       8.039439 
      41       90.100000       7.986132 
      41       90.110000       7.916699 
      41       90.070000       7.917112 
      41       90.130000       7.927410 
      41       90.070000       7.905484 
      42       90.100000       7.922028 
      42       90.140000       7.956549 
      42       90.100000       7.964593 
      42       90.070000       7.966448 
      42       90.080000       7.960080 
      42       90.040000       7.942721 
      42       90.070000       7.925585 
      42       90.070000       7.942720 
      42       90.080000       7.960067 
      43       90.040000       7.966018 
      43       90.070000       7.959637 
      43       90.090000       7.937751 
      43       90.010000       7.906357 
      43       90.090000       7.922054 
      43       90.010000       7.956523 
      43       90.130000       7.963720 
      43       90.040000       7.956093 
      43       90.070000       7.917071 
      44       90.080000       7.886673 
      44       90.050000       7.911256 
      44       90.100000       7.926940 
      44       90.100000       7.905028 
      44       90.040000       7.916628 
      45       90.060000       7.932352 
      45       90.060000       7.924712 
      45       90.110000       7.942694 
      45       90.070000       7.960080 
      45       90.050000       7.966474 
      45       90.020000       7.965466 
      45       90.010000       7.966918 
      45       90.050000       7.965479 
      45       90.070000       7.966918 
      46       90.070000       7.965479 
      46       90.070000       7.966917 
      46       90.060000       7.965452 
      46       90.070000       7.966018 
      46       90.030000       7.954251 
      46       90.070000       7.913554 
      47       90.060000       7.866463 
      47       89.960000       7.897857 
      47       89.990000       7.951150 
      47       90.050000       7.964163 
      48       90.050000       7.966878 
      48       89.970000       7.965479 
      48       90.010000       7.966918 
      48       90.060000       7.965466 
      48       90.030000       7.966474 
      48       90.060000       7.960080 
      49       90.050000       7.942720 
      49       90.020000       7.925572 
      49       90.050000       7.942264 
      49       89.990000       7.954251 
      49       90.020000       7.937295 
      49       89.990000       7.905887 
      49       90.060000       7.916225 
      50       90.010000       7.927383 
      50       89.980000       7.905484 
      50       90.040000       7.922028 
      50       90.000000       7.956549 
      50       90.030000       7.964606 
      51       90.000000       7.966891 
      51       90.030000       7.965479 
      51       90.070000       7.966918 
      51       90.010000       7.965479 
      51       90.050000       7.966891 
      51       90.000000       7.964593 
      51       90.000000       7.956119 
      51       90.010000       7.917085 
      52       90.000000       7.887129 
      52       90.020000       7.917085 
      52       90.050000       7.956119 
      52       90.050000       7.964593 
      52       89.990000       7.966891 
      52       90.040000       7.965479 
      53       90.000000       7.966918 
      53       90.010000       7.965479 
      53       90.050000       7.966918 
      53       90.000000       7.965479 
      53       90.030000       7.966918 
      53       89.990000       7.965466 
      53       89.960000       7.966474 
      53       89.980000       7.960080 
      53       90.050000       7.942721 
      53       89.990000       7.925585 
      54       89.990000       7.942720 
      54       89.950000       7.960067 
      54       89.980000       7.966031 
      54       89.990000       7.960067 
      54       89.960000       7.942720 
      54       89.980000       7.925585 
      54       89.990000       7.942694 
      54       89.990000       7.959194 
      54       90.040000       7.955676 
      55       89.990000       7.917072 
      55       90.000000       7.887129 
      55       90.020000       7.917085 
      55       89.980000       7.956119 
      55       90.000000       7.964593 
      55       90.000000       7.966864 
      55       90.010000       7.964593 
      55       89.990000       7.956119 
      55       89.970000       7.917085 
      55       89.990000       7.887129 
      55       89.970000       7.917085 
      56       90.000000       7.956119 
      56       89.990000       7.964593 
      56       89.990000       7.966891 
      56       90.020000       7.965465 
      56       89.990000       7.966461 
      56       90.030000       7.959650 
      56       89.990000       7.937738 
      57       89.980000       7.905874 
      57       89.960000       7.915326 
      57       90.050000       7.916155 
      57       89.980000       7.852121 
      57       90.000000       7.823011 
      57       90.060000       7.887489 
      57       89.990000       7.950277 
      57       90.000000       7.964136 
      57       89.980000       7.966877 
      57       89.990000       7.965479 
      58       90.000000       7.966891 
      58       89.990000       7.964593 
      58       90.010000       7.956119 
      58       89.930000       7.917085 
      58       89.980000       7.887129 
      58       89.950000       7.917085 
      58       89.980000       7.956119 
      59       89.950000       7.964593 
      59       89.940000       7.966891 
      59       89.950000       7.965466 
      59       89.960000       7.966474 
      59       89.930000       7.960067 
      59       89.950000       7.942264 
      59       89.970000       7.919756 
      59       90.010000       7.913554 
      60       90.040000       7.900958 
      60       89.980000       7.921611 
      60       89.950000       7.956536 
      60       90.000000       7.964606 
      60       89.930000       7.966891 
      60       89.950000       7.965479 
      60       89.880000       7.966918 
      60       89.990000       7.965479 
      60       89.970000       7.966918 
      60       90.000000       7.965479 
      60       89.940000       7.966918 
