Human trial picking the raspberry twin 

 time    ||     output compensated 

      0       -800.051429 
      0       -800.051429 
      0       -800.051429 
      0       -800.051429 
      0       -800.051429 
      0       -800.051429 
      0       -800.051429 
      0       -800.051429 
      0       -800.051429 
      0       -800.051424 
      0       -800.050234 
      0       -799.943170 
      0       -796.397678 
      0       -753.204488 
      0       -559.623383 
      0       -240.455703 
      0       -46.881794 
      0       -3.715446 
      0       -0.153840 
      0       -0.012268 
      0       -0.003021 
      0       -0.000718 
      0       -0.001701 
      0       0.004694 
      0       0.022054 
      0       0.039203 
      0       0.022497 
      0       0.010093 
      0       0.022497 
      0       0.039229 
      0       0.022953 
      0       0.015922 
      0       0.051663 
      0       0.098325 
      0       0.066918 
      0       0.013664 
      1       0.001941 
      1       0.014094 
      1       0.071900 
      1       0.117982 
      1       0.077285 
      1       0.038251 
      1       0.040532 
      1       0.022550 
      1       0.010523 
      1       0.027466 
      1       0.058471 
      1       0.044050 
      1       0.024422 
      1       0.072759 
      1       0.117566 
      1       0.071886 
      1       0.014054 
      1       0.000624 
      1       -0.002103 
      1       -0.000705 
      1       -0.002143 
      1       -0.000705 
      1       -0.002143 
      1       -0.000705 
      1       -0.002143 
      1       -0.000692 
      1       -0.001700 
      2       0.004694 
      2       0.022054 
      2       0.039189 
      2       0.022054 
      2       0.004694 
      2       -0.001674 
      2       0.000181 
      2       0.008225 
      2       0.042720 
      2       0.058417 
      2       0.027022 
      2       0.005097 
      2       -0.002573 
      2       -0.011490 
      2       -0.050537 
      2       -0.080494 
      2       -0.050538 
      2       -0.011503 
      2       -0.003030 
      2       -0.000732 
      2       -0.002144 
      2       -0.000705 
      2       -0.002143 
      2       -0.000692 
      2       -0.001700 
      2       0.004694 
      2       0.022053 
      2       0.039163 
      2       0.021194 
      2       -0.005231 
      2       -0.039726 
      2       -0.037055 
      2       0.010023 
      2       0.016225 
      2       0.004238 
      2       -0.001714 
      2       -0.000692 
      3       -0.002144 
      3       -0.000732 
      3       -0.003017 
      3       -0.011073 
      3       -0.045568 
      3       -0.061265 
      3       -0.029858 
      3       -0.007529 
      3       0.004238 
      3       0.022040 
      3       0.039189 
      3       0.022054 
      3       0.004694 
      3       -0.001700 
      3       -0.000692 
      3       -0.002143 
      3       -0.000705 
      3       -0.002143 
      3       -0.000692 
      3       -0.001700 
      3       0.004694 
      3       0.022054 
      3       0.038797 
      3       0.021445 
      3       0.004045 
      3       -0.002326 
      3       -0.001305 
      3       -0.002742 
      3       -0.001716 
      3       -0.008029 
      3       -0.025135 
      3       -0.041848 
      3       -0.024465 
      3       -0.007035 
      3       -0.000660 
      4       -0.002490 
      4       -0.010428 
      4       -0.044474 
      4       -0.059583 
      4       -0.028345 
      4       -0.011701 
      4       -0.027945 
      4       -0.058307 
      4       -0.042170 
      4       -0.007598 
      4       0.000454 
      4       0.002711 
      4       0.001286 
      4       0.002698 
      4       0.001247 
      4       0.002658 
      4       0.001208 
      4       0.002619 
      4       0.001169 
      4       0.002582 
      4       0.001132 
      4       0.002544 
      4       0.001095 
      4       0.002508 
      4       0.001059 
      4       0.002472 
      4       0.001024 
      4       0.002437 
      4       0.000989 
      4       0.002377 
      4       0.000078 
      4       -0.008312 
      4       -0.046872 
      4       -0.076060 
      5       -0.045643 
      5       -0.006543 
      5       0.001911 
      5       0.004141 
      5       0.001864 
      5       -0.006131 
      5       -0.040220 
      5       -0.055358 
      5       -0.023710 
      5       -0.001355 
      5       0.010720 
      5       0.032731 
      5       0.063498 
      5       0.047336 
      5       0.013151 
      5       0.010362 
      5       0.031074 
      5       0.060993 
      5       0.035868 
      5       -0.026448 
      5       -0.032088 
      5       0.018922 
      5       0.043456 
      5       0.046694 
      5       0.024795 
      6       0.006949 
      6       0.000536 
      6       0.001543 
      6       0.000529 
      6       0.007266 
      6       0.028873 
      6       0.059665 
      6       0.043528 
      6       0.008943 
      6       0.000877 
      6       -0.001394 
      6       0.000018 
      6       -0.001407 
      6       0.000005 
      6       -0.002257 
      6       -0.010210 
      6       -0.044259 
      6       -0.059356 
      6       -0.027708 
      6       -0.006576 
      6       -0.008742 
      6       -0.037447 
      6       -0.033564 
      6       0.018339 
      6       0.044221 
      6       0.063448 
      6       0.111957 
      6       0.196594 
      6       0.199905 
      6       0.156770 
      6       0.230247 
      6       0.422227 
      6       0.585855 
      6       0.680246 
      6       0.782695 
      6       0.850734 
      6       0.897373 
      6       0.939550 
      6       0.961574 
      6       1.045521 
      6       1.279019 
      6       1.606673 
      7       1.802548 
      7       1.844356 
      7       1.850254 
      7       1.860674 
      7       1.923535 
      7       2.077705 
      7       2.333281 
      7       2.609747 
      7       2.764951 
      7       2.799921 
      7       2.824699 
      7       2.842596 
      7       2.849864 
      7       2.858794 
      7       2.898702 
      7       2.938609 
      7       2.947553 
      7       2.955263 
      7       2.978465 
      7       3.024378 
      7       3.062792 
      7       3.089452 
      7       3.169804 
      7       3.392062 
      7       3.514195 
      7       3.057239 
      7       1.753374 
      7       0.121181 
      7       -0.798044 
      7       -0.621237 
      7       -0.260640 
      7       -0.197908 
      7       -0.357382 
      7       -0.728876 
      7       -1.198960 
      7       -1.665305 
      7       -1.987967 
      7       -2.103026 
      7       -2.128171 
      7       -2.241361 
      8       -2.475716 
      8       -2.720538 
      8       -2.866650 
      8       -2.969378 
      8       -3.035282 
      8       -3.049262 
      8       -3.022335 
      8       -3.000566 
      8       -3.010056 
      8       -3.019425 
      8       -2.996794 
      8       -2.959262 
      8       -2.890201 
      8       -2.821804 
      8       -2.813304 
      8       -2.811006 
      8       -2.812417 
      8       -2.810979 
      8       -2.812417 
      8       -2.811006 
      9       -2.813303 
      9       -2.821777 
      9       -2.860811 
      9       -2.890767 
      9       -2.860811 
      9       -2.821777 
      9       -2.813303 
      9       -2.811006 
      9       -2.812418 
      9       -2.811006 
      9       -2.813303 
      9       -2.821777 
      9       -2.860811 
      9       -2.890767 
      9       -2.860811 
      9       -2.821777 
      9       -2.813303 
      9       -2.811006 
      9       -2.812431 
      9       -2.811435 
      9       -2.818273 
      10       -2.841031 
      10       -2.882338 
      10       -2.904250 
      10       -2.901579 
      10       -2.867084 
      10       -2.846027 
      10       -2.854084 
      10       -2.846001 
      10       -2.866211 
      10       -2.891210 
      10       -2.860825 
      10       -2.821777 
      10       -2.813304 
      10       -2.811032 
      11       -2.813304 
      11       -2.821777 
      11       -2.860812 
      11       -2.890794 
      11       -2.861698 
      11       -2.832602 
      11       -2.862584 
      11       -2.901619 
      11       -2.910092 
      11       -2.912364 
      11       -2.910092 
      11       -2.901592 
      11       -2.861698 
      11       -2.821804 
      11       -2.813304 
      11       -2.811006 
      11       -2.812418 
      11       -2.811006 
      11       -2.813303 
      11       -2.821777 
      12       -2.832203 
      12       -2.833537 
      12       -2.775546 
      12       -2.709146 
      12       -2.673666 
      12       -2.644654 
      12       -2.619606 
      12       -2.592012 
      12       -2.568367 
      12       -2.551072 
      12       -2.564205 
      12       -2.568206 
      13       -2.512442 
      13       -2.443754 
      13       -2.391892 
      13       -2.345252 
      13       -2.320127 
      13       -2.298572 
      13       -2.297456 
      13       -2.292093 
      13       -2.275516 
      13       -2.251749 
      13       -2.230244 
      13       -2.201637 
      13       -2.163286 
      13       -2.134528 
      13       -2.168218 
      13       -2.204615 
      13       -2.195039 
      13       -2.165950 
      13       -2.104835 
      13       -2.044291 
      14       -2.015434 
      14       -1.993004 
      14       -1.974472 
      14       -1.953329 
      14       -1.936071 
      14       -1.925099 
      14       -1.944492 
      14       -1.954730 
      14       -1.906377 
      14       -1.858509 
      14       -1.869606 
      14       -1.889554 
      14       -1.879047 
      14       -1.862506 
      14       -1.841632 
      14       -1.814827 
      14       -1.758035 
      14       -1.710798 
      14       -1.723346 
      14       -1.744717 
      14       -1.734382 
      14       -1.704555 
      14       -1.629004 
      14       -1.552773 
      15       -1.525761 
      15       -1.511324 
      15       -1.518906 
      15       -1.531141 
      15       -1.559393 
      15       -1.573881 
      15       -1.528499 
      15       -1.474570 
      15       -1.451436 
      15       -1.434646 
      15       -1.421698 
      15       -1.406083 
      15       -1.394297 
      15       -1.388769 
      15       -1.414376 
      15       -1.439702 
      15       -1.432868 
      15       -1.410976 
      15       -1.357398 
      15       -1.304355 
      15       -1.283747 
      16       -1.278447 
      16       -1.304281 
      16       -1.320920 
      16       -1.278906 
      16       -1.237312 
      16       -1.254608 
      16       -1.280267 
      16       -1.270508 
      16       -1.236123 
      16       -1.182869 
      16       -1.148509 
      16       -1.130255 
      16       -1.119938 
      16       -1.107301 
      16       -1.097652 
      16       -1.085252 
      16       -1.075823 
      16       -1.063641 
      16       -1.054429 
      16       -1.042487 
      17       -1.034337 
      17       -1.032409 
      17       -1.061580 
      17       -1.090433 
      17       -1.087105 
      17       -1.069109 
      17       -1.024268 
      17       -0.997634 
      17       -1.008886 
      17       -0.981967 
      17       -0.932652 
      17       -0.892245 
      17       -0.851404 
      17       -0.858405 
      17       -0.883970 
      17       -0.883107 
      17       -0.876538 
      17       -0.866401 
      17       -0.860012 
      17       -0.859801 
      18       -0.889847 
      18       -0.910605 
      18       -0.871842 
      18       -0.824480 
      18       -0.807846 
      18       -0.797493 
      18       -0.790916 
      18       -0.781609 
      18       -0.776068 
      18       -0.776696 
      18       -0.807573 
      18       -0.829154 
      18       -0.791219 
      18       -0.745101 
      18       -0.734580 
      18       -0.748063 
      18       -0.771637 
      18       -0.748380 
      18       -0.706746 
      18       -0.691703 
      18       -0.682550 
      18       -0.677960 
      18       -0.679157 
      18       -0.706515 
      18       -0.714990 
      18       -0.676786 
      19       -0.649190 
      19       -0.645768 
      19       -0.677515 
      19       -0.700383 
      19       -0.663723 
      19       -0.618442 
      19       -0.603869 
      19       -0.595555 
      19       -0.590997 
      19       -0.583663 
      19       -0.579250 
      19       -0.572034 
      19       -0.567738 
      19       -0.560636 
      19       -0.556454 
      19       -0.549465 
      19       -0.545395 
      19       -0.538517 
      19       -0.534556 
      19       -0.527786 
      19       -0.523932 
      19       -0.517269 
      19       -0.513520 
      19       -0.506961 
      19       -0.503315 
      19       -0.496858 
      19       -0.493314 
      20       -0.486956 
      20       -0.483511 
      20       -0.477252 
      20       -0.473903 
      20       -0.467740 
      20       -0.464487 
      20       -0.458418 
      20       -0.455258 
      20       -0.449281 
      20       -0.446212 
      20       -0.440326 
      20       -0.437347 
      20       -0.431550 
      20       -0.428658 
      20       -0.422947 
      20       -0.420142 
      20       -0.414543 
      20       -0.412673 
      20       -0.416935 
      20       -0.451409 
      20       -0.476552 
      20       -0.442130 
      20       -0.399064 
      20       -0.386698 
      20       -0.380995 
      20       -0.383902 
      20       -0.401742 
      20       -0.428805 
      20       -0.408977 
      20       -0.370724 
      20       -0.358615 
      20       -0.347860 
      20       -0.327169 
      21       -0.306933 
