

 time    ||    gripping force   ||   raspberry measurement 

      0       0.120000       0.007101 
      0       0.110000       0.007101 
      0       0.080000       0.007101 
      0       0.140000       0.007101 
      0       0.120000       -802.940000 
      0       0.090000       -802.940000 
      0       0.050000       -802.940000 
      0       0.100000       -802.940000 
      0       0.060000       -802.940000 
      0       0.070000       -802.940000 
      0       0.060000       -802.940000 
      0       0.110000       -802.940000 
      0       0.140000       -802.940000 
      0       0.110000       -802.940000 
      0       0.090000       -802.940000 
      0       0.130000       -802.940000 
      0       0.150000       -802.940000 
      0       0.060000       -802.940000 
      0       0.370000       -802.940000 
      0       0.100000       -802.940000 
      0       0.360000       -802.940000 
      0       0.540000       -802.939995 
      0       0.110000       -802.938802 
      1       0.200000       -794.803049 
      1       0.410000       -791.245134 
      1       0.220000       -791.245134 
      1       0.000000       -791.245134 
      1       0.160000       -747.900313 
      1       0.030000       -553.635874 
      1       0.160000       -233.322433 
      1       0.030000       -39.017283 
      1       0.030000       4.320893 
      1       0.120000       7.863513 
      1       0.100000       7.978579 
      1       0.410000       7.978579 
      1       0.380000       7.960904 
      1       0.320000       7.932738 
      1       0.250000       7.932738 
      2       0.470000       7.878380 
      2       0.490000       7.804596 
      2       0.500000       7.774851 
      2       0.410000       7.796512 
      2       0.580000       7.796512 
      2       2.780000       7.840713 
      2       17.190000       7.899598 
      2       34.290000       7.905690 
      2       52.980000       7.900958 
      2       79.200000       7.921431 
      2       92.720000       7.921431 
      2       103.670000       7.921431 
      2       109.900000       7.921431 
      2       114.540000       7.921431 
      2       113.700000       7.921431 
      3       111.360000       7.921431 
      3       99.170000       7.921431 
      3       85.430000       7.967663 
      3       59.520000       7.946554 
      3       41.060000       7.946554 
      3       29.400000       7.872178 
      3       19.740000       7.821569 
      3       17.620000       7.798644 
      3       17.900000       7.820710 
      3       18.280000       7.862279 
      3       18.310000       7.862279 
      3       18.330000       7.862279 
      3       18.570000       7.909428 
      3       18.430000       7.942556 
      3       18.580000       7.987983 
      3       18.890000       7.987983 
      4       19.150000       7.987983 
      4       19.290000       7.987983 
      4       19.510000       8.032322 
      4       19.520000       8.089856 
      4       19.450000       8.089856 
      4       19.400000       8.089856 
      4       19.350000       8.089856 
      4       19.500000       8.089856 
      4       19.760000       8.089856 
      4       20.130000       8.089856 
      4       20.700000       8.089856 
      4       21.240000       8.314764 
      4       21.790000       8.314764 
      4       22.030000       8.314764 
      4       22.110000       8.687209 
      5       22.020000       8.687209 
      5       22.090000       8.687209 
      5       22.090000       8.873527 
      5       22.010000       8.687209 
      5       22.010000       8.687209 
      5       22.030000       8.687209 
      5       22.060000       8.687209 
      5       21.910000       8.687209 
      5       22.100000       8.314790 
      5       22.570000       8.314790 
      5       22.690000       8.314790 
      5       22.910000       8.314790 
      5       23.200000       8.314790 
      5       22.840000       8.314790 
      5       22.490000       8.090743 
      6       22.060000       8.043161 
      6       21.420000       8.043161 
      6       21.350000       8.043161 
      6       20.670000       8.043161 
      6       20.560000       8.037707 
      6       20.470000       8.037707 
      6       20.220000       8.037707 
      6       20.240000       8.037707 
      6       20.070000       8.037707 
      6       19.950000       8.038595 
      6       19.830000       8.032200 
      6       19.790000       8.032200 
      6       19.850000       8.032200 
      6       19.810000       8.032200 
      6       19.740000       8.014840 
      7       19.830000       8.014840 
      7       19.860000       8.014840 
      7       19.790000       7.997705 
      7       19.800000       8.014840 
      7       19.790000       8.032200 
      7       19.860000       8.038594 
      7       19.820000       8.037585 
      7       19.760000       8.037585 
      7       19.860000       8.039037 
      7       19.870000       8.037599 
      7       19.820000       8.037599 
      7       19.840000       8.037599 
      7       19.820000       8.037599 
      7       19.880000       8.039037 
      7       19.790000       8.037599 
      7       19.840000       8.037599 
      8       19.900000       8.039037 
      8       19.810000       8.039037 
      8       19.910000       8.037599 
      8       19.780000       8.037599 
      8       19.900000       8.039037 
      8       19.860000       8.037599 
      8       19.770000       8.039037 
      8       19.870000       8.037599 
      8       19.790000       8.037599 
      8       19.800000       8.039037 
      8       19.850000       8.039037 
      8       19.840000       8.037599 
      8       19.860000       8.039037 
      8       19.810000       8.037625 
      8       19.810000       8.039923 
      9       19.820000       8.048397 
      9       19.750000       8.087431 
      9       19.770000       8.117387 
      9       19.790000       8.087431 
      9       19.840000       8.087431 
      9       19.690000       8.087431 
      9       19.830000       8.087431 
      9       19.840000       8.087431 
      9       19.840000       8.087431 
      9       19.740000       8.087431 
      9       19.880000       8.087431 
      9       19.790000       8.087431 
      9       19.870000       8.048397 
      9       19.830000       8.048397 
      9       19.890000       8.039923 
      9       19.770000       8.039923 
      10       19.840000       8.037625 
      10       19.810000       8.037625 
      10       19.840000       8.037625 
      10       19.860000       8.039037 
      10       19.830000       8.039037 
      10       19.770000       8.037585 
      10       19.840000       8.038581 
      10       19.790000       8.031770 
      10       19.860000       8.009871 
      10       19.790000       7.978477 
      10       19.820000       7.978477 
      10       19.820000       7.978477 
      10       19.850000       7.978477 
      10       19.810000       7.978477 
      10       19.810000       7.978477 
      11       19.840000       7.978477 
      11       19.780000       7.994174 
      11       19.820000       8.028669 
      11       19.760000       8.036726 
      11       19.860000       8.039010 
      11       19.750000       8.039010 
      11       19.850000       8.039010 
      11       19.800000       8.037598 
      11       19.870000       8.039037 
      11       19.780000       8.039037 
      11       19.900000       8.037598 
      11       19.790000       8.039010 
      11       19.910000       8.039010 
      11       19.930000       8.039010 
      11       20.060000       8.036726 
      12       20.120000       8.028669 
      12       20.240000       7.994174 
      12       20.260000       7.994174 
      12       20.300000       7.978477 
      12       20.330000       7.978477 
      12       20.390000       7.978477 
      12       20.370000       7.978477 
      12       20.610000       7.978477 
      12       20.690000       7.978477 
      12       20.770000       7.978477 
      12       20.760000       7.978477 
      12       20.740000       8.009871 
      12       20.780000       8.009871 
      12       20.710000       8.031770 
      12       20.690000       8.038581 
      13       20.600000       8.037585 
      13       20.590000       8.037585 
      13       20.250000       8.037585 
      13       20.520000       8.037585 
      13       20.270000       8.039037 
      13       20.360000       8.037599 
      13       20.390000       8.039037 
      13       20.080000       8.039037 
      13       20.050000       8.039037 
      13       19.920000       8.039037 
      13       19.890000       8.037599 
      13       19.870000       8.039037 
      13       19.700000       8.037599 
      13       19.790000       8.037599 
      13       19.660000       8.039037 
      14       19.870000       8.037598 
      14       19.540000       8.037598 
      14       19.940000       8.037598 
      14       19.800000       8.037598 
      14       19.570000       8.039010 
      14       19.800000       8.036726 
      14       19.610000       8.028669 
      14       19.820000       8.028669 
      14       19.830000       8.028669 
      14       19.650000       8.028669 
      14       19.770000       7.994174 
      14       19.800000       7.994174 
      14       19.700000       7.978463 
      14       19.780000       8.009428 
      14       19.790000       8.009428 
      15       19.740000       8.009428 
      15       19.810000       8.009428 
      15       19.720000       8.009428 
      15       19.790000       8.009428 
      15       19.730000       8.009428 
      15       19.830000       8.009428 
      15       19.800000       8.026371 
      15       19.770000       8.014384 
      15       19.890000       8.014384 
      15       19.950000       7.997691 
      15       19.950000       7.997691 
      15       20.060000       8.014840 
      15       20.180000       8.014840 
      15       20.150000       8.014840 
      15       20.240000       8.014840 
      15       20.240000       8.014840 
      16       20.150000       8.014840 
      16       20.190000       8.014840 
      16       20.240000       8.032199 
      16       20.220000       8.038567 
      16       20.180000       8.036699 
      16       20.160000       8.028239 
      16       20.200000       8.028239 
      16       20.220000       7.989204 
      16       20.280000       7.959222 
      16       20.220000       7.988331 
      16       20.260000       7.988331 
      16       20.160000       7.988331 
      16       20.140000       7.988331 
      16       20.170000       7.988331 
      16       20.240000       7.988331 
      17       20.180000       7.988331 
      17       20.170000       7.988331 
      17       20.250000       7.988331 
      17       20.170000       7.988331 
      17       20.200000       7.988331 
      17       20.130000       7.988331 
      17       20.120000       7.988331 
      17       20.010000       7.988331 
      17       20.010000       7.988331 
      17       19.930000       8.017871 
      17       19.920000       7.993287 
      17       19.900000       7.978450 
      17       19.950000       7.978450 
      17       19.940000       8.009871 
      17       19.910000       8.009871 
      18       19.960000       8.009871 
      18       19.990000       8.009871 
      18       19.980000       8.009871 
      18       19.890000       8.009871 
      18       19.870000       8.009871 
      18       19.980000       8.009871 
      18       19.960000       8.031770 
      18       19.930000       8.038581 
      18       19.940000       8.038581 
      18       19.930000       8.038581 
      18       19.950000       8.038581 
      18       19.960000       8.037572 
      18       19.980000       8.038580 
      18       19.960000       8.038580 
      18       19.950000       8.038580 
      19       19.940000       8.038580 
      19       19.910000       8.038580 
      19       19.930000       8.031730 
      19       20.000000       8.008541 
      19       19.940000       8.008541 
      19       19.970000       8.008541 
      19       19.930000       8.008541 
      19       19.920000       7.962279 
      19       19.910000       7.962279 
      19       19.930000       7.921583 
      19       19.970000       7.921583 
      19       19.900000       7.908986 
      19       19.970000       7.908986 
      19       19.950000       7.964134 
      19       19.930000       7.964134 
      20       19.950000       7.964134 
      20       19.960000       8.022813 
      20       19.970000       8.036269 
      20       19.930000       8.036269 
      20       20.010000       8.036269 
      20       19.950000       8.036269 
      20       19.910000       8.036269 
      20       19.930000       8.038997 
      20       19.920000       8.037598 
      20       19.970000       8.037598 
      20       19.950000       8.037598 
      20       19.960000       8.037598 
      20       20.020000       8.037598 
      20       19.980000       8.037598 
      20       19.940000       8.039037 
      20       19.950000       8.037599 
      21       19.980000       8.037599 
      21       19.970000       8.039037 
      21       20.010000       8.037599 
      21       19.960000       8.039037 
      21       19.950000       8.037599 
      21       20.010000       8.037599 
      21       19.980000       8.037599 
      21       19.960000       8.037599 
      21       19.960000       8.039037 
      21       19.970000       8.037599 
      21       19.980000       8.039037 
      21       19.960000       8.039037 
      21       19.980000       8.037599 
      21       19.950000       8.037599 
      21       19.920000       8.039037 
      22       20.020000       8.037599 
      22       19.990000       8.037599 
      22       20.010000       8.039037 
      22       19.980000       8.039037 
      22       20.000000       8.037599 
      22       20.020000       8.039037 
      22       19.970000       8.037585 
      22       19.940000       8.038594 
      22       19.950000       8.032200 
      22       19.960000       8.014840 
      22       19.950000       7.997705 
      22       20.050000       7.997705 
      22       19.980000       7.997705 
      22       19.970000       8.014840 
      23       19.990000       8.014840 
      23       19.970000       8.032200 
      23       19.940000       8.038594 
      23       19.950000       8.037585 
      23       20.010000       8.037585 
      23       19.930000       8.039037 
      23       19.980000       8.037598 
      23       19.980000       8.039010 
      23       20.010000       8.036726 
      23       19.930000       8.028669 
      23       19.950000       7.994174 
      23       19.970000       7.978477 
      23       19.980000       7.978477 
      23       19.960000       8.009871 
      23       19.890000       8.031756 
      24       19.960000       8.038124 
      24       19.950000       8.038124 
      24       20.030000       8.031756 
      24       20.000000       8.031756 
      24       20.000000       8.031756 
      24       20.060000       8.031756 
      24       20.050000       8.031756 
      24       19.960000       8.009857 
      24       20.010000       8.009857 
      24       20.020000       8.009857 
      24       20.000000       8.009857 
      24       19.720000       8.009857 
      24       20.210000       8.009857 
      24       19.940000       7.978033 
      24       20.050000       7.978033 
      24       20.230000       7.988774 
      25       19.800000       7.988774 
      25       20.370000       7.988774 
      25       19.760000       7.988774 
      25       20.220000       7.988774 
      25       19.880000       7.988774 
      25       20.220000       7.988774 
      25       20.040000       8.004445 
      25       20.060000       8.004445 
      25       20.290000       8.004445 
      25       20.100000       8.004445 
      25       20.230000       8.004445 
      25       20.220000       7.995945 
      25       20.210000       8.003989 
      25       20.200000       7.982932 
      25       20.100000       7.982932 
      26       19.940000       7.982932 
      26       20.440000       7.982932 
      26       20.030000       7.982932 
      26       20.310000       7.948424 
      26       20.000000       7.948424 
      26       20.150000       7.948424 
      26       20.020000       7.945310 
      26       20.010000       7.961849 
      26       20.150000       7.961849 
      26       19.920000       7.979818 
      26       20.220000       7.979818 
      26       19.960000       7.979818 
      26       20.070000       7.979818 
      26       20.030000       7.979818 
      26       20.000000       7.979818 
      26       20.110000       7.972621 
      27       20.080000       7.993717 
      27       20.050000       8.028655 
      27       19.970000       8.028655 
      27       20.040000       8.028655 
      27       20.090000       8.036725 
      27       20.060000       8.039010 
      27       19.960000       8.039010 
      27       20.060000       8.039010 
      27       20.070000       8.039010 
      27       20.030000       8.037598 
      27       19.990000       8.039037 
      27       19.970000       8.037599 
      27       19.940000       8.039037 
      27       19.890000       8.039037 
      27       19.940000       8.039037 
      28       19.950000       8.037599 
      28       19.920000       8.037599 
      28       19.940000       8.039037 
      28       19.970000       8.039037 
      28       19.920000       8.039037 
      28       19.940000       8.039037 
      28       19.950000       8.037585 
      28       19.960000       8.038594 
      28       19.940000       8.032199 
      28       19.960000       8.032199 
      28       19.910000       8.032199 
      28       19.940000       8.014813 
      28       19.870000       7.996818 
      28       19.950000       7.996818 
      28       19.940000       8.004042 
      29       19.900000       7.983805 
      29       19.920000       7.958805 
      29       19.930000       7.958805 
      29       19.980000       7.989191 
      29       19.930000       8.028239 
      29       19.950000       8.036712 
      29       19.940000       8.038957 
      29       19.940000       8.035812 
      29       19.980000       8.016984 
      29       19.970000       8.016984 
      29       19.990000       7.934955 
      29       19.990000       7.849421 
      29       19.970000       7.871307 
      29       19.970000       7.928709 
      29       19.970000       7.960936 
      29       19.920000       7.984721 
      30       19.970000       7.990975 
      30       20.010000       7.990975 
      30       19.990000       8.004015 
      30       19.930000       8.004015 
      30       20.040000       7.988761 
      30       19.950000       7.978033 
      30       19.980000       8.009857 
      30       19.970000       8.031742 
      30       19.930000       8.037668 
      30       19.950000       8.025900 
      30       19.930000       7.979818 
      30       19.990000       7.979818 
      30       19.960000       7.908543 
      30       19.950000       7.908543 
      30       19.930000       7.908543 
      31       19.970000       7.908543 
      31       19.920000       7.900473 
      31       19.960000       7.934525 
      31       20.000000       7.960963 
      31       19.950000       7.979778 
      31       19.910000       7.972164 
      31       19.950000       7.987888 
      31       19.970000       7.999489 
      31       19.970000       7.977577 
      31       20.010000       7.977577 
      31       19.940000       7.993274 
      31       19.890000       8.018300 
      31       19.960000       7.993301 
      31       19.940000       7.978450 
      31       19.950000       8.009870 
      32       19.960000       8.009870 
      32       19.940000       8.031743 
      32       19.900000       8.031743 
      32       19.970000       8.031743 
      32       19.960000       8.037668 
      32       19.940000       8.037668 
      32       19.940000       8.037668 
      32       19.930000       8.025900 
      32       19.920000       7.979818 
      32       20.000000       7.908543 
      32       19.950000       7.900486 
      32       19.940000       7.934981 
      32       19.930000       7.966792 
      32       19.970000       8.008958 
      32       20.000000       8.008958 
      33       19.970000       8.031743 
      33       19.910000       8.031743 
      33       19.900000       8.038580 
      33       19.970000       8.037585 
      33       20.040000       8.039010 
      33       20.020000       8.039010 
      33       20.100000       8.036726 
      33       20.150000       8.036726 
      33       20.070000       8.028669 
      33       20.090000       7.994174 
      33       20.060000       7.978463 
      33       20.010000       8.009441 
      33       20.130000       8.026813 
      33       20.080000       8.019756 
      33       20.090000       8.019756 
      33       20.030000       8.021015 
      34       20.120000       8.044366 
      34       20.120000       8.012972 
      34       20.040000       7.983432 
      34       20.030000       8.010301 
      34       20.120000       8.031783 
      34       19.990000       8.038581 
      34       20.060000       8.037572 
      34       20.000000       8.037572 
      34       20.060000       8.038580 
      34       20.040000       8.031743 
      34       20.060000       8.008984 
      34       20.030000       7.967625 
      34       20.060000       7.943980 
      34       20.090000       7.926371 
      34       20.020000       7.879872 
      35       20.040000       7.809873 
      35       20.020000       7.816710 
      35       20.010000       7.908419 
      35       20.100000       7.995970 
      35       20.010000       7.995970 
      35       20.020000       8.014632 
      35       20.050000       7.965935 
      35       20.020000       7.917029 
      35       20.030000       7.956064 
      35       20.030000       7.956064 
      35       20.090000       7.977520 
      35       20.050000       7.971318 
      35       20.070000       7.971318 
      35       19.960000       7.980651 
      35       20.020000       7.972204 
      36       20.050000       7.988318 
      36       20.030000       8.004458 
      36       20.060000       7.996817 
      36       20.000000       8.014330 
      36       20.080000       8.025471 
      36       20.050000       7.998200 
      36       20.040000       7.998200 
      36       20.000000       7.998200 
      36       20.030000       7.925100 
      36       19.990000       7.895157 
      36       20.010000       7.959608 
      36       20.040000       7.959608 
      36       19.950000       7.959608 
      36       20.010000       8.022370 
      36       20.060000       8.022370 
      37       20.060000       8.022370 
      37       20.020000       8.035383 
      37       20.100000       8.035383 
      37       19.970000       8.028628 
      37       20.000000       7.994133 
      37       20.100000       7.977147 
      37       20.080000       7.993674 
      37       20.000000       7.959178 
      37       19.980000       7.918871 
      37       20.030000       7.964107 
      37       20.090000       8.012001 
      37       20.040000       8.012001 
      37       20.030000       7.986545 
      37       20.060000       7.943011 
      37       20.050000       7.916612 
      38       20.010000       7.908516 
      38       20.040000       7.962778 
      38       20.030000       8.006159 
      38       20.030000       7.957822 
      38       20.050000       7.889275 
      38       20.000000       7.895516 
      38       20.010000       7.895516 
      38       20.030000       7.934525 
      38       20.040000       7.965892 
      38       20.050000       7.965892 
      38       19.980000       7.998119 
      38       20.060000       7.982019 
      38       20.040000       7.942568 
      38       20.070000       7.915727 
      38       20.040000       7.915727 
      38       20.040000       7.915727 
      39       20.030000       7.915727 
      39       20.070000       7.915727 
      39       20.000000       7.915727 
      39       20.030000       7.898187 
      39       20.100000       7.920656 
      39       20.090000       7.960923 
      39       20.070000       7.992317 
      39       20.060000       7.958252 
      39       20.000000       7.908073 
      39       20.030000       7.915713 
      39       19.930000       7.932253 
      39       19.960000       7.939481 
      39       19.910000       7.948410 
      39       19.940000       7.988318 
      39       19.900000       8.028212 
      40       19.860000       8.036699 
      40       19.930000       8.038553 
      40       19.930000       8.038553 
      40       19.850000       8.031729 
      40       19.900000       8.008528 
      40       19.930000       7.961796 
      40       19.890000       7.914853 
      40       19.920000       7.914853 
      40       19.890000       7.914853 
      40       19.950000       7.914853 
      40       19.920000       7.868552 
      40       19.940000       7.850306 
      40       19.920000       7.862253 
      40       19.930000       7.862253 
      40       19.920000       7.878959 
      41       19.930000       7.878959 
      41       19.910000       7.862279 
      41       19.860000       7.851165 
      41       19.940000       7.851165 
      41       19.950000       7.878436 
      41       19.910000       7.951536 
      41       19.840000       7.981479 
      41       19.940000       7.917054 
      41       19.890000       7.855139 
      41       19.870000       7.855139 
      41       19.930000       7.851635 
      41       19.960000       7.851635 
      41       19.890000       7.891915 
      41       19.960000       7.949739 
      41       19.920000       7.965865 
      42       19.960000       7.981992 
      42       19.930000       7.981992 
      42       19.890000       7.973962 
      42       19.860000       7.921928 
      42       19.870000       7.901871 
      42       19.910000       7.916958 
      42       19.950000       7.954264 
      42       19.880000       7.955041 
      42       19.860000       7.927352 
      42       19.940000       7.860025 
      42       19.920000       7.794728 
      42       19.930000       7.819741 
      42       19.950000       7.819741 
      42       19.950000       7.875332 
      42       19.910000       7.875332 
      43       20.000000       7.901761 
      43       19.890000       7.962294 
      43       19.970000       8.006119 
      43       19.940000       7.956962 
      43       20.080000       7.879336 
      43       19.980000       7.857034 
      43       20.110000       7.892359 
      43       20.080000       7.949765 
      43       20.070000       7.966282 
      43       20.150000       7.986518 
      43       20.160000       7.987791 
      43       20.190000       7.918371 
      43       20.140000       7.864635 
      43       20.130000       7.884289 
      43       20.080000       7.904929 
      43       20.120000       7.904929 
      44       20.130000       7.907186 
      44       20.080000       7.958225 
      44       20.090000       7.992330 
      44       20.160000       7.961352 
      44       20.060000       7.925612 
      44       20.130000       7.916986 
      44       20.140000       7.931437 
      44       20.090000       7.927328 
      44       20.160000       7.969076 
      44       20.160000       8.023203 
      44       20.000000       8.034953 
      44       20.110000       8.022800 
      44       20.180000       8.022800 
      44       20.060000       7.965007 
      44       20.110000       7.965007 
      45       20.140000       7.965007 
      45       20.060000       7.919328 
      45       20.120000       7.964134 
      45       20.090000       8.012471 
      45       20.100000       7.992817 
      45       20.120000       7.977523 
      45       20.060000       7.998159 
      45       20.030000       7.971664 
      45       20.080000       7.898700 
      45       20.190000       7.849753 
      45       20.140000       7.845780 
      45       20.100000       7.866819 
      45       20.140000       7.866819 
      45       19.990000       7.899046 
      45       20.100000       7.893260 
      46       19.960000       7.893260 
      46       20.020000       7.893260 
      46       19.960000       7.893260 
      46       19.970000       7.896361 
      46       19.930000       7.919672 
      46       19.950000       7.885173 
      46       19.980000       7.840380 
      46       19.990000       7.840380 
      46       20.030000       7.806705 
      46       19.980000       7.836366 
      46       19.960000       7.836366 
      46       19.950000       7.921856 
      46       19.980000       7.887361 
      46       19.980000       7.778091 
      46       19.940000       7.778091 
      47       19.960000       7.776706 
      47       19.940000       7.776706 
      47       20.040000       7.776706 
      47       19.950000       7.824666 
      47       20.000000       7.848007 
      47       20.020000       7.848007 
      47       19.970000       7.899063 
      47       19.960000       7.976163 
      47       20.020000       8.011101 
      47       20.000000       7.963168 
      47       20.010000       7.907200 
      47       20.020000       7.900415 
      47       19.960000       7.870433 
      47       20.000000       7.867306 
      47       20.030000       7.944809 
      47       19.960000       7.972120 
      48       20.030000       7.957866 
      48       19.960000       7.988278 
      48       20.000000       7.988278 
      48       19.950000       8.017440 
      48       19.970000       8.017440 
      48       19.930000       8.017440 
      48       19.960000       7.988291 
      48       20.020000       7.958308 
      48       20.020000       7.977492 
      48       19.970000       7.968107 
      48       19.990000       7.895945 
      48       20.010000       7.840354 
      48       20.050000       7.795087 
      48       19.970000       7.778531 
      48       19.970000       7.810784 
      49       19.990000       7.843467 
      49       20.000000       7.898203 
      49       20.070000       7.970737 
      49       19.970000       7.986474 
      49       20.020000       7.986474 
      49       19.940000       7.918331 
      49       20.000000       7.864634 
      49       19.980000       7.884235 
      49       19.940000       7.903142 
      49       19.970000       7.903142 
      49       19.970000       7.885133 
      49       19.990000       7.855594 
      49       20.010000       7.803104 
      49       19.940000       7.798727 
      49       19.930000       7.798727 
      49       20.020000       7.819187 
      50       20.010000       7.798726 
      50       19.990000       7.798726 
      50       19.910000       7.803077 
      50       20.020000       7.803077 
      50       19.970000       7.854734 
      50       19.960000       7.854734 
      50       19.860000       7.875208 
      50       20.030000       7.865076 
      50       20.000000       7.846568 
      50       20.010000       7.861476 
      50       19.930000       7.873037 
      50       19.940000       7.916598 
      50       20.020000       7.957738 
      50       19.960000       7.912515 
      50       19.990000       7.912515 
      51       19.980000       7.864191 
      51       20.040000       7.884705 
      51       19.920000       7.884705 
      51       19.930000       7.884705 
      51       19.960000       7.909871 
      51       20.040000       7.925528 
      51       20.020000       7.925528 
      51       19.980000       7.925528 
      51       19.990000       7.968106 
      51       19.990000       7.947896 
      51       19.980000       7.888361 
      51       19.950000       7.893691 
      51       19.970000       7.912055 
      51       20.020000       7.858709 
      51       19.990000       7.794231 
      52       20.010000       7.794231 
      52       19.970000       7.813858 
      52       19.980000       7.844420 
      52       19.970000       7.821942 
      52       19.930000       7.821942 
      52       19.950000       7.831898 
      52       19.940000       7.831898 
      52       19.930000       7.831898 
      52       19.920000       7.891875 
      52       20.050000       7.891875 
      52       19.980000       7.968119 
      52       19.910000       7.981952 
      52       19.980000       7.970391 
      52       19.940000       7.964024 
      52       19.970000       7.964024 
      53       19.950000       7.964024 
      53       19.970000       7.964024 
      53       20.020000       7.894200 
      53       19.910000       7.843968 
      53       19.990000       7.885674 
      53       19.920000       7.920971 
      53       19.970000       7.913497 
      53       19.930000       7.913497 
      53       19.930000       7.892278 
      53       19.970000       7.892278 
      53       19.920000       7.890643 
      53       20.010000       7.892305 
      53       19.880000       7.892305 
      53       19.970000       7.914397 
      53       19.960000       7.932213 
      54       19.950000       7.932213 
      54       19.950000       7.932213 
      54       19.990000       7.939467 
      54       19.950000       7.947953 
      54       19.940000       7.982449 
      54       20.020000       7.982449 
      54       19.980000       7.997716 
      54       19.980000       7.997716 
      54       19.970000       7.961352 
      54       19.920000       7.920226 
      54       19.920000       7.892761 
      54       20.010000       7.890616 
      54       20.000000       7.890990 
      54       19.970000       7.898656 
      54       19.880000       7.865450 
      54       19.990000       7.848897 
      55       19.950000       7.848897 
      55       19.990000       7.932711 
      55       19.980000       7.989505 
      55       20.060000       7.908098 
      55       20.020000       7.799078 
      55       19.970000       7.802811 
      55       20.010000       7.852368 
      55       20.070000       7.888870 
      55       19.950000       7.910607 
      55       20.070000       7.929637 
      55       19.980000       7.911076 
      55       20.070000       7.895142 
      55       19.970000       7.886906 
      55       20.090000       7.885204 
      55       19.980000       7.871735 
      56       19.950000       7.871735 
      56       20.020000       7.877520 
      56       19.960000       7.877520 
      56       19.990000       7.855621 
      56       19.970000       7.811644 
      56       20.010000       7.842236 
      56       19.990000       7.881950 
      56       19.990000       7.881950 
      56       20.030000       7.881950 
      56       20.010000       7.881950 
      56       20.060000       7.881950 
      56       19.910000       7.918910 
      56       20.030000       7.956383 
      56       20.040000       7.979361 
      56       19.960000       7.972151 
      57       19.980000       7.987861 
      57       20.000000       7.998576 
      57       19.970000       7.998576 
      57       20.010000       7.998576 
      57       20.080000       7.998576 
      57       19.950000       7.965892 
      57       19.960000       7.934081 
      57       19.990000       7.934081 
      57       20.050000       7.934081 
      57       19.940000       7.890090 
      57       19.950000       7.890090 
      57       19.990000       7.864178 
      57       20.000000       7.906673 
      57       20.000000       7.906673 
      57       19.990000       7.927712 
      58       20.060000       7.847564 
      58       19.980000       7.790618 
      58       20.030000       7.822482 
      58       20.010000       7.891902 
      58       19.980000       7.978449 
      58       19.980000       8.025000 
      58       19.990000       8.027755 
      58       19.910000       8.027755 
      58       19.980000       7.994106 
      58       19.980000       7.994106 
      58       20.030000       7.994106 
      58       19.950000       7.977106 
      58       19.960000       7.992317 
      58       19.980000       7.942108 
      58       19.940000       7.942108 
      59       19.980000       7.942108 
      59       20.020000       7.835925 
      59       20.030000       7.835925 
      59       20.020000       7.801389 
      59       19.980000       7.801389 
      59       19.950000       7.882489 
      59       20.050000       7.945637 
      59       19.990000       7.945637 
      59       20.050000       7.881992 
      59       20.100000       7.794204 
      59       20.070000       7.789675 
      59       20.110000       7.799583 
      59       20.010000       7.778947 
      59       20.060000       7.810788 
      59       20.080000       7.906659 
      60       20.010000       7.906659 
      60       20.030000       7.980632 
      60       20.070000       7.980632 
      60       20.030000       7.952409 
      60       20.080000       7.889691 
      60       20.030000       7.905415 
      60       20.100000       7.905415 
      60       20.050000       7.972147 
      60       20.050000       7.972147 
      60       20.110000       7.998173 
      60       20.100000       7.977537 
      60       20.040000       7.993260 
      60       20.060000       7.993260 
      60       20.060000       8.017844 
      60       20.110000       7.987445 
      60       20.070000       7.948424 
      61       20.060000       7.940810 
