Human trial picking the raspberry twin 

 time    ||     output compensated 

      0       -801.048387 
      0       -801.048387 
      0       -801.048387 
      0       -801.048387 
      0       -801.048387 
      0       -801.048387 
      0       -801.048387 
      0       -801.048387 
      0       -801.048387 
      0       -801.048382 
      0       -801.047191 
      0       -800.939980 
      0       -797.389639 
      0       -754.137906 
      0       -560.300128 
      0       -240.726695 
      0       -46.904614 
      0       -3.655981 
      0       -0.107496 
      0       0.001141 
      0       0.000893 
      0       0.002336 
      0       0.000898 
      0       0.002310 
      0       0.000012 
      0       -0.008462 
      0       -0.047496 
      0       -0.077452 
      0       -0.047496 
      0       -0.008462 
      0       0.000012 
      1       0.002310 
      1       0.000898 
      1       0.002336 
      1       0.000898 
      1       0.002336 
      1       0.000898 
      1       0.002336 
      1       0.000898 
      1       0.002336 
      1       0.000898 
      1       0.002336 
      1       0.000884 
      1       0.001880 
      1       -0.004931 
      1       -0.026830 
      1       -0.058224 
      1       -0.042527 
      1       -0.008018 
      1       0.000481 
      1       0.008139 
      1       0.030064 
      1       0.061459 
      1       0.045761 
      1       0.011266 
      1       0.003210 
      1       0.000925 
      1       0.002337 
      1       0.000898 
      2       0.002336 
      2       0.000884 
      2       0.001880 
      2       -0.004931 
      2       -0.026830 
      2       -0.058224 
      2       -0.042527 
      2       -0.008032 
      2       0.000025 
      2       0.002310 
      2       0.000898 
      2       0.002336 
      2       0.000898 
      2       0.002336 
      2       0.000898 
      2       0.002336 
      2       0.000898 
      2       0.002336 
      2       0.000898 
      2       0.002336 
      2       0.000898 
      3       0.002336 
      3       0.000898 
      3       0.002310 
      3       0.000012 
      3       -0.008462 
      3       -0.047496 
      3       -0.077452 
      3       -0.047470 
      3       -0.007589 
      3       0.010380 
      3       0.045734 
      3       0.061431 
      3       0.029178 
      3       -0.002633 
      3       -0.047040 
      3       -0.077439 
      3       -0.047496 
      3       -0.008489 
      3       -0.000875 
      3       -0.008489 
      3       -0.047496 
      3       -0.077452 
      3       -0.047496 
      3       -0.008448 
      3       0.000468 
      3       0.008139 
      4       0.030064 
      4       0.061459 
      4       0.045761 
      4       0.011266 
      4       0.003183 
      4       0.000038 
      4       -0.008462 
      4       -0.047496 
      4       -0.077479 
      4       -0.048383 
      4       -0.019260 
      4       -0.048383 
      4       -0.077519 
      4       -0.048826 
      4       -0.024413 
      4       -0.071610 
      4       -0.115239 
      4       -0.068864 
      4       -0.010921 
      4       0.002483 
      4       0.005159 
      4       0.003723 
      4       0.005110 
      4       0.003635 
      5       0.005022 
      5       0.003548 
      5       0.004937 
      5       0.003490 
      5       0.005717 
      5       0.013636 
      5       0.047676 
      5       0.063577 
      5       0.041235 
      5       0.051044 
      5       0.051794 
      5       -0.007650 
      5       -0.023127 
      5       0.032561 
      5       0.040624 
      5       0.025654 
      5       0.068344 
      5       0.088104 
      5       0.003356 
      5       -0.068048 
      5       -0.047936 
      5       -0.009677 
      5       -0.001218 
      5       0.001069 
      5       -0.000339 
      5       0.001088 
      5       -0.000346 
      5       0.001081 
      5       -0.000354 
      5       0.001087 
      5       0.000091 
      5       0.006886 
      6       0.030213 
      6       0.081135 
      6       0.147174 
      6       0.228848 
      6       0.328546 
      6       0.457134 
      6       0.492033 
      6       0.487691 
      6       0.579100 
      6       0.693081 
      6       0.751056 
      6       0.777657 
      6       0.812608 
      6       0.847079 
      6       0.913176 
      6       1.042606 
      6       1.200096 
      6       1.388774 
      6       1.639824 
      6       1.801616 
      6       1.837139 
      6       1.841654 
      6       1.840349 
      6       1.843078 
      6       1.856547 
      6       1.915683 
      6       1.976687 
      6       1.994170 
      6       2.024267 
      6       2.081644 
      6       2.191042 
      6       2.300830 
      6       2.362277 
      6       2.400414 
      6       2.386542 
      7       2.368648 
      7       2.436836 
      7       2.557774 
      7       2.587428 
      7       2.535937 
      7       2.613954 
      7       2.760892 
      7       2.825979 
      7       2.830413 
      7       2.796857 
      7       2.781187 
      7       2.812582 
      7       2.834507 
      7       2.842178 
      7       2.851121 
      7       2.891055 
      7       2.931809 
      7       2.950221 
      7       2.990115 
      7       3.020083 
      7       2.989563 
      7       2.941100 
      7       2.858398 
      7       2.578447 
      7       2.072691 
      7       1.432321 
      7       0.492871 
      7       -0.723244 
      7       -1.588136 
      7       -1.561235 
      7       -0.938939 
      7       -0.606308 
      7       -0.740625 
      7       -0.976060 
      8       -1.214928 
      8       -1.539468 
      8       -1.884260 
      8       -2.161864 
      8       -2.437573 
      8       -2.711546 
      8       -2.903432 
      8       -2.993191 
      8       -2.992149 
      8       -3.023526 
      8       -3.051861 
      8       -3.034678 
      8       -3.007032 
      8       -2.975563 
      8       -2.946794 
      8       -2.910583 
      9       -2.859797 
      9       -2.800119 
      9       -2.815816 
      9       -2.850311 
      9       -2.858368 
      9       -2.860653 
      9       -2.859241 
      9       -2.860679 
      9       -2.859241 
      9       -2.860679 
      9       -2.859241 
      9       -2.860679 
      9       -2.859241 
      9       -2.860679 
      9       -2.859241 
      9       -2.860679 
      9       -2.859241 
      9       -2.860679 
      9       -2.859241 
      9       -2.860679 
      9       -2.859241 
      9       -2.860679 
      10       -2.859241 
      10       -2.860679 
      10       -2.859241 
      10       -2.860679 
      10       -2.859241 
      10       -2.860679 
      10       -2.859241 
      10       -2.860679 
      10       -2.859241 
      10       -2.860679 
      10       -2.859241 
      10       -2.860679 
      10       -2.859241 
      10       -2.860653 
      10       -2.858368 
      10       -2.850311 
      10       -2.815816 
      10       -2.800119 
      10       -2.831513 
      10       -2.853412 
      10       -2.860223 
      10       -2.859228 
      10       -2.860679 
      11       -2.859241 
      11       -2.860679 
      11       -2.859241 
      11       -2.860679 
      11       -2.859241 
      11       -2.860679 
      11       -2.859241 
      11       -2.860653 
      11       -2.858355 
      11       -2.849881 
      11       -2.810847 
      11       -2.780904 
      11       -2.811290 
      11       -2.855280 
      11       -2.882552 
      11       -2.900547 
      11       -2.883438 
      11       -2.866079 
      11       -2.859684 
      11       -2.860693 
      11       -2.830649 
      11       -2.803766 
      11       -2.774305 
      11       -2.747999 
      11       -2.719520 
      11       -2.698655 
      11       -2.688855 
      11       -2.678930 
      11       -2.635177 
      11       -2.591639 
      11       -2.559392 
      11       -2.534797 
      12       -2.508012 
      12       -2.484356 
      12       -2.458088 
      12       -2.434931 
      12       -2.409158 
      12       -2.386490 
      12       -2.361201 
      12       -2.339013 
      12       -2.314199 
      12       -2.292455 
      12       -2.267255 
      12       -2.236194 
      12       -2.175188 
      12       -2.123780 
      13       -2.132198 
      13       -2.149520 
      13       -2.136414 
      13       -2.117325 
      13       -2.094754 
      13       -2.075230 
      13       -2.053054 
      13       -2.033948 
      13       -2.012184 
      13       -1.993486 
      13       -1.972127 
      13       -1.953830 
      13       -1.932868 
      13       -1.914963 
      13       -1.894390 
      13       -1.876870 
      14       -1.856677 
      14       -1.839534 
      14       -1.819715 
      14       -1.802942 
      14       -1.783488 
      14       -1.767077 
      14       -1.747983 
      14       -1.731927 
      14       -1.713184 
      14       -1.697476 
      14       -1.679077 
      14       -1.663710 
      14       -1.645649 
      14       -1.630617 
      14       -1.612886 
      15       -1.598182 
      15       -1.580776 
      15       -1.566392 
      15       -1.549304 
      15       -1.535235 
      15       -1.518445 
      15       -1.504246 
      15       -1.482461 
      16       -1.445957 
      16       -1.400417 
      16       -1.401953 
      16       -1.422083 
      16       -1.415839 
      16       -1.403942 
      16       -1.388505 
      16       -1.376044 
      16       -1.360860 
      16       -1.348675 
      16       -1.333764 
      16       -1.321851 
      17       -1.307208 
      17       -1.295560 
      17       -1.281181 
      17       -1.269793 
      17       -1.255671 
      17       -1.244538 
      17       -1.230669 
      17       -1.219786 
      17       -1.206164 
      17       -1.195527 
      17       -1.182147 
      17       -1.171750 
      17       -1.158608 
      17       -1.148446 
      17       -1.135538 
      17       -1.125606 
      18       -1.112926 
      18       -1.103221 
      18       -1.090765 
      18       -1.081281 
      18       -1.069044 
      18       -1.059752 
      18       -1.046892 
      18       -1.028447 
      18       -0.983986 
      18       -0.957755 
      18       -0.969445 
      18       -0.944210 
      18       -0.910431 
      19       -0.931421 
      19       -0.960764 
      19       -0.959545 
      19       -0.952225 
      19       -0.941305 
      19       -0.933290 
      19       -0.921682 
      19       -0.904076 
      19       -0.856391 
      19       -0.818145 
      19       -0.838769 
      19       -0.859212 
      19       -0.821789 
      19       -0.784766 
      19       -0.806601 
      19       -0.837179 
      19       -0.837195 
      19       -0.831072 
      19       -0.820513 
      20       -0.803919 
      20       -0.757223 
      20       -0.719556 
      20       -0.736697 
      20       -0.744871 
      20       -0.716154 
      20       -0.725384 
      20       -0.752307 
      20       -0.752760 
      20       -0.747494 
      20       -0.738621 
      20       -0.732659 
      20       -0.723896 
      20       -0.717642 
      20       -0.703696 
      20       -0.674128 
      20       -0.626468 
      20       -0.597672 
      20       -0.584953 
      21       -0.580940 
