Human trial picking the raspberry twin 

 time    ||     output compensated 

      0       -800.955000 
      0       -800.955000 
      0       -800.955000 
      0       -800.955000 
      0       -800.955000 
      0       -800.955000 
      0       -800.955000 
      0       -800.955000 
      0       -800.955000 
      0       -800.954995 
      0       -800.953804 
      0       -800.846620 
      0       -797.297139 
      0       -754.055344 
      0       -560.256022 
      0       -240.723921 
      0       -46.908902 
      0       -3.664006 
      0       -0.112670 
      0       -0.006911 
      0       -0.004281 
      0       -0.005715 
      0       -0.004277 
      0       -0.005715 
      1       -0.004277 
      1       -0.005715 
      1       -0.004277 
      1       -0.005715 
      1       -0.004277 
      1       -0.005728 
      1       -0.004720 
      1       -0.011114 
      1       -0.028474 
      1       -0.045609 
      1       -0.028473 
      1       -0.011087 
      1       -0.003833 
      1       0.005070 
      1       0.044117 
      1       0.074074 
      1       0.044118 
      2       0.005083 
      2       -0.003390 
      2       -0.005688 
      2       -0.004276 
      2       -0.005715 
      2       -0.004263 
      2       -0.005258 
      2       0.001553 
      2       0.023451 
      2       0.054846 
      2       0.039148 
      2       0.004653 
      2       -0.003403 
      2       -0.005688 
      3       -0.004276 
      3       -0.005715 
      3       -0.004277 
      3       -0.005715 
      3       -0.004277 
      3       -0.005715 
      3       -0.004277 
      3       -0.005715 
      3       -0.004277 
      3       -0.005715 
      3       -0.004277 
      3       -0.005715 
      3       -0.004263 
      3       -0.005258 
      3       0.001553 
      3       0.023452 
      3       0.054872 
      4       0.040035 
      4       0.015452 
      4       0.044991 
      4       0.074100 
      4       0.044118 
      4       0.005083 
      4       -0.003390 
      4       -0.005688 
      4       -0.004276 
      4       -0.005715 
      4       -0.004277 
      4       -0.005715 
      4       -0.004277 
      4       -0.005715 
      4       -0.004277 
      4       -0.005715 
      4       -0.004277 
      4       -0.005715 
      4       -0.004277 
      4       -0.005715 
      4       -0.004277 
      4       -0.005715 
      4       -0.004277 
      4       -0.005715 
      5       -0.004277 
      5       -0.005715 
      5       -0.004277 
      5       -0.005728 
      5       -0.004720 
      5       -0.011114 
      5       -0.028474 
      5       -0.045609 
      5       -0.028473 
      5       -0.011087 
      6       -0.003833 
      6       0.005097 
      6       0.045004 
      6       0.084872 
      6       0.092512 
      6       0.084872 
      6       0.045004 
      6       0.005110 
      6       -0.003390 
      6       -0.005702 
      6       -0.004672 
      6       -0.010956 
      6       -0.028033 
      6       -0.044716 
      6       -0.027305 
      6       -0.009846 
      6       -0.003417 
      6       -0.004382 
      6       -0.002901 
      6       -0.004295 
      6       -0.002829 
      6       -0.004224 
      6       -0.002758 
      6       -0.004154 
      6       -0.002689 
      6       -0.004086 
      6       -0.002621 
      6       -0.004019 
      6       -0.002555 
      6       -0.003953 
      6       -0.002490 
      6       -0.003889 
      7       -0.002412 
      7       -0.003374 
      7       0.003430 
      7       0.025953 
      7       0.067504 
      7       0.100542 
      7       0.161263 
      7       0.281316 
      7       0.444378 
      7       0.566098 
      7       0.634509 
      7       0.729027 
      7       0.782927 
      7       0.845866 
      7       0.962461 
      7       1.096636 
      7       1.256205 
      7       1.465159 
      7       1.667303 
      7       1.799171 
      7       1.873176 
      7       1.959747 
      7       2.025235 
      7       2.050873 
      7       2.114137 
      7       2.257145 
      7       2.460244 
      7       2.648479 
      7       2.782587 
      7       2.878048 
      8       2.929237 
      8       2.938637 
      8       2.940962 
      8       2.939551 
      8       2.941003 
      8       2.940007 
      8       2.946818 
      8       2.968717 
      8       3.000152 
      8       2.985798 
      8       2.967997 
      8       3.039663 
      8       3.201566 
      8       3.397410 
      8       3.540422 
      8       3.608654 
      8       3.719825 
      8       3.840435 
      8       3.886641 
      8       3.916712 
      8       3.944492 
      8       3.983971 
      8       4.000098 
      8       3.968717 
      8       3.946818 
      8       3.940007 
      8       3.941003 
      8       3.939578 
      8       3.941876 
      8       3.950349 
      8       3.989384 
      8       4.019366 
      8       3.990270 
      9       3.961174 
      9       3.991183 
      9       4.031077 
      9       4.049463 
      9       4.089357 
      9       4.119393 
      9       4.091238 
      9       4.074726 
      9       4.175169 
      9       4.397039 
      9       4.647618 
      9       4.835729 
      9       4.918098 
      9       4.877008 
      9       4.557332 
      9       3.661227 
      9       2.181953 
      9       0.467746 
      9       -0.468597 
      9       0.029163 
      9       0.641638 
      9       0.636347 
      9       0.322759 
      9       -0.154682 
      9       -0.699790 
      9       -1.139159 
      9       -1.500194 
      9       -1.801936 
      10       -1.998030 
      10       -2.156826 
      10       -2.380593 
      10       -2.662109 
      10       -2.871467 
      10       -2.955827 
      10       -3.008749 
      10       -3.049596 
      10       -3.058124 
      10       -3.029818 
      10       -2.998122 
      10       -2.969565 
      10       -2.938446 
      10       -2.939884 
      10       -2.938445 
      10       -2.939857 
      10       -2.937559 
      10       -2.929086 
      10       -2.890052 
      10       -2.860096 
      10       -2.890052 
      10       -2.929086 
      10       -2.937559 
      10       -2.939857 
      10       -2.938445 
      10       -2.939884 
      10       -2.938446 
      10       -2.939884 
      10       -2.938446 
      10       -2.939897 
      11       -2.938889 
      11       -2.945283 
      11       -2.962643 
      11       -2.979779 
      11       -2.962669 
      11       -2.946156 
      11       -2.949257 
      11       -2.983349 
      11       -2.999880 
      11       -2.977980 
      11       -2.989138 
      11       -2.999463 
      11       -2.967625 
      11       -2.945713 
      11       -2.938902 
      11       -2.939898 
      11       -2.938446 
      11       -2.939884 
      11       -2.938446 
      11       -2.939884 
      11       -2.938446 
      11       -2.939884 
      11       -2.938446 
      11       -2.939884 
      11       -2.938446 
      11       -2.939897 
      12       -2.938889 
      12       -2.945283 
      12       -2.962643 
      12       -2.979778 
      12       -2.962643 
      12       -2.945283 
      12       -2.938889 
      12       -2.939897 
      12       -2.938446 
      12       -2.939884 
      12       -2.938446 
      12       -2.939884 
      12       -2.938446 
      12       -2.939884 
      12       -2.938446 
      12       -2.939884 
      12       -2.938446 
      12       -2.939884 
      13       -2.938446 
      13       -2.939884 
      13       -2.938446 
      13       -2.939884 
      13       -2.938445 
      13       -2.939857 
      13       -2.937559 
      13       -2.929086 
      13       -2.890052 
      13       -2.860096 
      13       -2.890052 
      13       -2.899795 
      13       -2.879185 
      13       -2.852643 
      13       -2.821880 
      13       -2.785686 
      13       -2.723679 
      13       -2.680901 
      13       -2.685146 
      14       -2.679124 
      14       -2.649263 
      14       -2.584565 
      14       -2.529076 
      14       -2.533442 
      14       -2.546751 
      14       -2.529672 
      14       -2.506651 
      14       -2.480186 
      14       -2.456809 
      14       -2.430817 
      14       -2.407933 
      14       -2.382429 
      14       -2.360029 
      14       -2.335005 
      14       -2.313079 
      14       -2.288524 
      14       -2.267063 
      14       -2.242968 
      14       -2.221936 
      15       -2.197441 
      15       -2.167078 
      15       -2.106763 
      15       -2.056013 
      15       -2.064258 
      15       -2.072420 
      15       -2.022014 
      15       -1.963176 
      15       -1.936007 
      15       -1.924210 
      15       -1.944437 
      15       -1.964488 
      15       -1.953258 
      15       -1.935974 
      15       -1.914366 
      15       -1.886834 
      15       -1.829321 
      15       -1.781372 
      15       -1.793214 
      15       -1.813926 
      16       -1.804175 
      16       -1.788382 
      16       -1.768250 
      16       -1.742179 
      16       -1.686113 
      16       -1.639596 
      16       -1.652856 
      16       -1.674971 
      16       -1.666610 
      16       -1.652219 
      16       -1.634299 
      16       -1.619381 
      16       -1.601763 
      16       -1.587143 
      16       -1.568996 
      16       -1.544918 
      16       -1.490824 
      16       -1.446260 
      16       -1.461454 
      16       -1.485483 
      16       -1.479017 
      16       -1.466502 
      17       -1.450439 
      17       -1.437359 
      17       -1.421561 
      17       -1.408770 
      17       -1.393258 
      17       -1.380749 
      17       -1.365518 
      17       -1.353287 
      17       -1.338330 
      17       -1.326344 
      18       -1.310806 
      18       -1.289309 
      18       -1.237771 
      18       -1.195711 
      18       -1.212559 
      18       -1.229265 
      18       -1.188141 
      18       -1.147454 
      18       -1.165662 
      18       -1.192624 
      18       -1.188235 
      18       -1.168815 
      18       -1.118509 
      18       -1.077668 
      18       -1.096548 
      18       -1.124226 
      19       -1.121373 
      19       -1.112434 
      19       -1.099911 
      19       -1.090310 
      19       -1.077132 
      19       -1.057972 
      19       -1.008748 
      19       -0.968965 
      19       -0.987655 
      19       -1.001677 
      19       -0.943368 
      19       -0.879776 
      19       -0.878981 
      19       -0.896365 
      20       -0.931777 
      20       -0.962380 
      20       -0.961184 
      20       -0.953847 
      20       -0.942911 
      20       -0.934880 
      20       -0.923256 
      20       -0.905635 
      20       -0.857935 
      20       -0.819699 
      20       -0.841158 
      20       -0.871391 
      20       -0.871065 
      20       -0.864630 
      20       -0.854586 
      20       -0.847464 
