Human trial picking the raspberry twin 

 time    ||     output compensated 

      0       -800.081818 
      0       -800.081818 
      0       -800.081818 
      0       -800.081818 
      0       -800.081818 
      0       -800.081818 
      0       -800.081818 
      0       -800.081818 
      0       -800.081818 
      0       -800.081813 
      0       -800.080624 
      0       -799.973546 
      0       -796.427638 
      0       -753.229895 
      0       -559.634088 
      0       -240.459597 
      0       -46.879487 
      0       -3.684845 
      0       -0.140792 
      0       -0.032289 
      0       -0.032538 
      0       -0.031095 
      0       -0.032533 
      0       -0.031095 
      0       -0.032533 
      0       -0.031095 
      0       -0.032533 
      0       -0.031081 
      0       -0.032090 
      0       -0.025696 
      0       -0.008350 
      0       0.008343 
      0       -0.014165 
      0       -0.054862 
      1       -0.091212 
      1       -0.075945 
      1       -0.041463 
      1       -0.033406 
      1       -0.031121 
      1       -0.032533 
      1       -0.031095 
      1       -0.032533 
      1       -0.031081 
      1       -0.032050 
      1       -0.024379 
      1       0.007431 
      1       0.076422 
      1       0.092132 
      1       0.026672 
      1       -0.014024 
      1       -0.007423 
      1       0.008800 
      1       -0.009222 
      1       -0.036494 
      1       -0.080484 
      1       -0.110856 
      1       -0.080484 
      1       -0.036494 
      1       -0.009222 
      1       0.008773 
      1       -0.008336 
      1       -0.025696 
      1       -0.032090 
      1       -0.031081 
      1       -0.032533 
      1       -0.031095 
      1       -0.032533 
      1       -0.031081 
      1       -0.032077 
      2       -0.025266 
      2       -0.003354 
      2       0.028457 
      2       0.017273 
      2       -0.003797 
      2       -0.019494 
      2       -0.067432 
      2       -0.070559 
      2       -0.041006 
      2       -0.032950 
      2       -0.025722 
      2       -0.008337 
      2       0.008773 
      2       -0.009209 
      2       -0.036064 
      2       -0.075542 
      2       -0.092528 
      2       -0.071059 
      2       -0.086756 
      2       -0.111340 
      2       -0.080941 
      2       -0.041893 
      2       -0.033419 
      2       -0.031121 
      2       -0.032533 
      2       -0.031095 
      3       -0.032533 
      3       -0.031095 
      3       -0.032533 
      3       -0.031081 
      3       -0.032090 
      3       -0.025696 
      3       -0.008336 
      3       0.008800 
      3       -0.008336 
      3       -0.025696 
      3       -0.032090 
      3       -0.031081 
      3       -0.032533 
      3       -0.031095 
      3       -0.032533 
      3       -0.031081 
      3       -0.032090 
      3       -0.025696 
      3       -0.008350 
      3       0.008343 
      3       -0.014165 
      3       -0.054862 
      3       -0.091212 
      3       -0.075945 
      3       -0.041463 
      3       -0.033072 
      3       -0.030479 
      4       -0.031573 
      4       -0.029833 
      4       -0.030958 
      4       -0.029225 
      4       -0.030356 
      4       -0.028629 
      4       -0.029767 
      4       -0.028045 
      4       -0.029189 
      4       -0.027499 
      4       -0.029499 
      4       -0.037592 
      4       -0.075834 
      4       -0.103894 
      4       -0.063799 
      4       0.008236 
      4       0.034344 
      4       0.013171 
      4       0.024112 
      4       0.034066 
      4       0.001356 
      4       -0.030164 
      4       -0.073825 
      4       -0.103208 
      4       -0.073384 
      4       -0.043845 
      4       -0.073076 
      4       -0.110551 
      4       -0.112489 
      5       -0.089684 
      5       -0.047894 
      5       -0.024884 
      5       -0.017866 
      5       -0.018673 
      5       -0.017049 
      5       -0.018302 
      5       -0.016695 
      5       -0.017952 
      5       -0.016349 
      5       -0.017609 
      5       -0.016009 
      5       -0.017273 
      5       -0.015676 
      5       -0.016944 
      5       -0.015350 
      5       -0.016621 
      5       -0.015030 
      5       -0.016304 
      5       -0.014744 
      5       -0.016871 
      5       -0.025118 
      6       -0.064348 
      6       -0.102761 
      6       -0.104804 
      6       -0.082076 
      6       -0.040349 
      6       -0.016976 
      6       -0.004718 
      6       0.017448 
      6       0.048367 
      6       0.032356 
      6       -0.001692 
      6       -0.004745 
      6       0.011651 
      6       0.028472 
      6       0.011223 
      6       -0.006102 
      6       -0.013222 
      6       -0.021904 
      6       -0.060342 
      6       -0.089381 
      6       -0.058366 
      6       -0.012902 
      6       0.030753 
      6       0.127226 
      6       0.272864 
      6       0.460982 
      6       0.657852 
      6       0.792852 
      6       0.847143 
      7       0.859598 
      7       0.903049 
      7       0.994747 
      7       1.151336 
      7       1.417115 
      7       1.677605 
      7       1.817114 
      7       1.951282 
      7       2.181278 
      7       2.457546 
      7       2.704558 
      7       2.921229 
      7       3.218044 
      7       3.583406 
      7       3.844813 
      7       4.026058 
      7       4.208962 
      7       4.362836 
      7       4.497846 
      7       4.639043 
      7       4.767833 
      7       4.888418 
      7       5.002400 
      7       5.148983 
      7       5.388889 
      7       5.604835 
      7       5.705874 
      7       5.746630 
      7       5.790286 
      7       5.825710 
      7       5.904311 
      7       6.101475 
      7       6.407189 
      7       6.665729 
      8       6.740161 
      8       6.618708 
      8       6.397818 
      8       6.182191 
      8       6.022680 
      8       5.960747 
      8       5.967944 
      8       5.990772 
      8       6.097553 
      8       6.294375 
      8       6.496828 
      8       6.532957 
      8       5.943283 
      8       4.332979 
      8       2.392618 
      8       1.593066 
      8       2.372645 
      8       3.353017 
      8       3.700417 
      8       3.561632 
      8       3.162393 
      8       2.625863 
      8       1.934997 
      8       1.211787 
      8       0.555448 
      8       0.018648 
      8       -0.417162 
      8       -0.851710 
      8       -1.089237 
      8       -1.116468 
      8       -1.137014 
      8       -1.171656 
      8       -1.179715 
      8       -1.182000 
      8       -1.180588 
      8       -1.182027 
      8       -1.180615 
      8       -1.182900 
      8       -1.190957 
      8       -1.225519 
      8       -1.243405 
      8       -1.238106 
      8       -1.325925 
      8       -1.463932 
      8       -1.471989 
      8       -1.370789 
      8       -1.298155 
      9       -1.284726 
      9       -1.283858 
      9       -1.328233 
      9       -1.360147 
      9       -1.301362 
      9       -1.243973 
      9       -1.235916 
      9       -1.256526 
      9       -1.287880 
      9       -1.272183 
      9       -1.237714 
      9       -1.230504 
      9       -1.237728 
      9       -1.272626 
      9       -1.293293 
      9       -1.281180 
      9       -1.281706 
      9       -1.299552 
      9       -1.392879 
      9       -1.513294 
      9       -1.509790 
      9       -1.367687 
      9       -1.266053 
      9       -1.274895 
      9       -1.293777 
      9       -1.285679 
      9       -1.294595 
      9       -1.283437 
      9       -1.286082 
      9       -1.308990 
      9       -1.270784 
      9       -1.220772 
      9       -1.212952 
      9       -1.249921 
      9       -1.271671 
      9       -1.290692 
      9       -1.335376 
      9       -1.403590 
      9       -1.396783 
      9       -1.371379 
      9       -1.384200 
      9       -1.352525 
      9       -1.310763 
      9       -1.291964 
      9       -1.247101 
      9       -1.263780 
      9       -1.303038 
      9       -1.282135 
      9       -1.262302 
      9       -1.269565 
      9       -1.252430 
      9       -1.244982 
      9       -1.277056 
      10       -1.319774 
      10       -1.328620 
      10       -1.332744 
      10       -1.268140 
      10       -1.185321 
      10       -1.201395 
      10       -1.290564 
      10       -1.340314 
      10       -1.272599 
      10       -1.189766 
      10       -1.208535 
      10       -1.247526 
      10       -1.202276 
      10       -1.155201 
      10       -1.189280 
      10       -1.255542 
      10       -1.256954 
      10       -1.186968 
      10       -1.146298 
      10       -1.158285 
      10       -1.198745 
      10       -1.221920 
      10       -1.234117 
      10       -1.256029 
      10       -1.269656 
      10       -1.222822 
      10       -1.161329 
      10       -1.162186 
      10       -1.185523 
      10       -1.195512 
      10       -1.167018 
      10       -1.138175 
      10       -1.120463 
      10       -1.110270 
      10       -1.098156 
      10       -1.093517 
      10       -1.100181 
      10       -1.110637 
      10       -1.096696 
      10       -1.070379 
      10       -1.040901 
      10       -1.044799 
      10       -1.040477 
      10       -1.050080 
      10       -1.050187 
      10       -1.002873 
      11       -0.948048 
      11       -0.902142 
      11       -0.907384 
      11       -0.923047 
      11       -0.889066 
      11       -0.865460 
      11       -0.887487 
      11       -0.895372 
      11       -0.874126 
      11       -0.843939 
      11       -0.833429 
      11       -0.821422 
      11       -0.811974 
      11       -0.791783 
      11       -0.803487 
      11       -0.820614 
      11       -0.787246 
      11       -0.759752 
      11       -0.764212 
      11       -0.757365 
      11       -0.748132 
      11       -0.719205 
      11       -0.699308 
      11       -0.704582 
      11       -0.714075 
      11       -0.689983 
      11       -0.666735 
      11       -0.663138 
      11       -0.690257 
      11       -0.699733 
      11       -0.671494 
      11       -0.681157 
      11       -0.708097 
      11       -0.704086 
      11       -0.680697 
      11       -0.656938 
      11       -0.666895 
      11       -0.672067 
      11       -0.647748 
      12       -0.601628 
      12       -0.582906 
      12       -0.607568 
      12       -0.634834 
      12       -0.610687 
      12       -0.624628 
      12       -0.654230 
      12       -0.607824 
      12       -0.577820 
      12       -0.630955 
      12       -0.662426 
      12       -0.624721 
      12       -0.574567 
      12       -0.537755 
      12       -0.570596 
      12       -0.629122 
      12       -0.621996 
      12       -0.605129 
      12       -0.615465 
      12       -0.569816 
      12       -0.499846 
      12       -0.495669 
      12       -0.500907 
      12       -0.473753 
      12       -0.480074 
      12       -0.486333 
      12       -0.459351 
      12       -0.465791 
      12       -0.471354 
      12       -0.435148 
      12       -0.409981 
      12       -0.409802 
      12       -0.453722 
      12       -0.516074 
      12       -0.513188 
      12       -0.448145 
      12       -0.435275 
      12       -0.449915 
      12       -0.414882 
      12       -0.372063 
      13       -0.359953 
      13       -0.354079 
      13       -0.351949 
      13       -0.347444 
      13       -0.350712 
      13       -0.368911 
      13       -0.397167 
      13       -0.387906 
      13       -0.392429 
      13       -0.435125 
      13       -0.431582 
      13       -0.391470 
      13       -0.343019 
      13       -0.326459 
      13       -0.353632 
      13       -0.382174 
      13       -0.346274 
      13       -0.312334 
      13       -0.321091 
      13       -0.348535 
      13       -0.334389 
      13       -0.315505 
      13       -0.319914 
      13       -0.298912 
      13       -0.278712 
      13       -0.269620 
      13       -0.268774 
      13       -0.274488 
      13       -0.311225 
      13       -0.347169 
      13       -0.346767 
      13       -0.321619 
      13       -0.277510 
      13       -0.252205 
      13       -0.242953 
      13       -0.242798 
      13       -0.254078 
      13       -0.313710 
      13       -0.374819 
      13       -0.346759 
      14       -0.294453 
      14       -0.299098 
      14       -0.312442 
      14       -0.315183 
      14       -0.305688 
      14       -0.280113 
      14       -0.236392 
      14       -0.211498 
      14       -0.202640 
      14       -0.202450 
      14       -0.208801 
      14       -0.245356 
      14       -0.272559 
      14       -0.240177 
      14       -0.199132 
      14       -0.188751 
      14       -0.184589 
      14       -0.184141 
      14       -0.180875 
      14       -0.180490 
      14       -0.177262 
      14       -0.176913 
      14       -0.173720 
      14       -0.173407 
      14       -0.170275 
      14       -0.170834 
      14       -0.177102 
      14       -0.209481 
      14       -0.222927 
      14       -0.189617 
      14       -0.166041 
      14       -0.157638 
      14       -0.157060 
      14       -0.154478 
      14       -0.159276 
      14       -0.175308 
      15       -0.195838 
      15       -0.200019 
      15       -0.210490 
      15       -0.187938 
      15       -0.151483 
      15       -0.141979 
      15       -0.138297 
      15       -0.138312 
      15       -0.135505 
      15       -0.135574 
      15       -0.132794 
      15       -0.132890 
      15       -0.130137 
      15       -0.130260 
      15       -0.127533 
      15       -0.127682 
      15       -0.124981 
      15       -0.125168 
      15       -0.122918 
      15       -0.128033 
      15       -0.144364 
      15       -0.164791 
      15       -0.164789 
      15       -0.161508 
      15       -0.138448 
      15       -0.124372 
      15       -0.135833 
      15       -0.156359 
      15       -0.161773 
      15       -0.182438 
      15       -0.197387 
      15       -0.191944 
      15       -0.151806 
      15       -0.120619 
      15       -0.148218 
      15       -0.175567 
      15       -0.144980 
      15       -0.114725 
      15       -0.143247 
      15       -0.180020 
      15       -0.181263 
      15       -0.157771 
      15       -0.115326 
      15       -0.092493 
      15       -0.094612 
      15       -0.131871 
      15       -0.160222 
      15       -0.129814 
      15       -0.099685 
      15       -0.127519 
      16       -0.155049 
      16       -0.123816 
      16       -0.083934 
      16       -0.074706 
      16       -0.071684 
      16       -0.072365 
      16       -0.070217 
      16       -0.070939 
      16       -0.068805 
      16       -0.069554 
      16       -0.067873 
      16       -0.073938 
      16       -0.094878 
      16       -0.125010 
      16       -0.108219 
      16       -0.072987 
      16       -0.064281 
      16       -0.061402 
      16       -0.063024 
      16       -0.070370 
      16       -0.103843 
      16       -0.119196 
      16       -0.096736 
      16       -0.111309 
      16       -0.134534 
      16       -0.103120 
      16       -0.064295 
      16       -0.065489 
      16       -0.104273 
      16       -0.149824 
      16       -0.117259 
      16       -0.063764 
      16       -0.055563 
      16       -0.075424 
      16       -0.105711 
      16       -0.089113 
      16       -0.054072 
      16       -0.045555 
      16       -0.042837 
      16       -0.043807 
      16       -0.041971 
      17       -0.043813 
      17       -0.051351 
      17       -0.084988 
      17       -0.099678 
      17       -0.067601 
      17       -0.045245 
      17       -0.038050 
      17       -0.038655 
      17       -0.036831 
      17       -0.037887 
      17       -0.036084 
      17       -0.037147 
      17       -0.035351 
      17       -0.036422 
      17       -0.034634 
      17       -0.035711 
      17       -0.033930 
      17       -0.035015 
      17       -0.033241 
      17       -0.034332 
      17       -0.032565 
      17       -0.033663 
      17       -0.031903 
      17       -0.033021 
      17       -0.031692 
      17       -0.037719 
      17       -0.054953 
      17       -0.076274 
      17       -0.077157 
      17       -0.074740 
      17       -0.052122 
      17       -0.033989 
      17       -0.027306 
      17       -0.028045 
      17       -0.026752 
      17       -0.032815 
      17       -0.049673 
      17       -0.066140 
      17       -0.048515 
      17       -0.030844 
      17       -0.024205 
      17       -0.024962 
      17       -0.023301 
      18       -0.025330 
      18       -0.033053 
      18       -0.066873 
      18       -0.081757 
      18       -0.050298 
      18       -0.033460 
      18       -0.050325 
      18       -0.089863 
      18       -0.106138 
      18       -0.087890 
      18       -0.046531 
      18       -0.023561 
      18       -0.016982 
      18       -0.022717 
      18       -0.040101 
      18       -0.061983 
      18       -0.067503 
      18       -0.079298 
      18       -0.058058 
      18       -0.022902 
      18       -0.014684 
      18       -0.012275 
      18       -0.013563 
      18       -0.012442 
      18       -0.019061 
      18       -0.040563 
      18       -0.071676 
      19       -0.060738 
      19       -0.049084 
      19       -0.070274 
      19       -0.053193 
      19       -0.018485 
      19       -0.010323 
      19       -0.007958 
      19       -0.009276 
      19       -0.007759 
      19       -0.009106 
      19       -0.007591 
      19       -0.008939 
      19       -0.007452 
      19       -0.009639 
      19       -0.017532 
      19       -0.051946 
      19       -0.072285 
      19       -0.063586 
      19       -0.070927 
      19       -0.049358 
      19       -0.014276 
      19       -0.006144 
      19       -0.003820 
      19       -0.005180 
      19       -0.003730 
      19       -0.005968 
      19       -0.014324 
      19       -0.053675 
      19       -0.092608 
      19       -0.099245 
      19       -0.090690 
      19       -0.050340 
      19       -0.011205 
      19       -0.012904 
      19       -0.052213 
      20       -0.098312 
      20       -0.067099 
      20       -0.023481 
      20       -0.047583 
      20       -0.075500 
      20       -0.045063 
      20       -0.006407 
      20       -0.003299 
      20       -0.024946 
      20       -0.065564 
      20       -0.086601 
      20       -0.083103 
      20       -0.048535 
      20       -0.031672 
      20       -0.052636 
      20       -0.036994 
      20       -0.017167 
      20       -0.064849 
      20       -0.108559 
      20       -0.062251 
      20       -0.004374 
      20       0.008965 
      20       0.011576 
      20       0.010075 
      20       0.011399 
      20       0.009861 
      20       0.011186 
      20       0.009650 
      20       0.010978 
      20       0.009444 
      20       0.010774 
      20       0.009242 
      20       0.010574 
      20       0.009044 
      20       0.010351 
      20       0.007985 
      20       -0.000071 
      21       -0.034220 
