Human trial picking the raspberry twin 

 time    ||     output     ||     loadcell

      0.000000       -798.401563       0.070000 
      0.015508       -798.401563       0.050000 
      0.030017       -798.401563       0.110000 
      0.045115       -798.401563       0.100000 
      0.060626       -798.401563       0.040000 
      0.076563       -798.401563       0.060000 
      0.091613       -798.401563       0.040000 
      0.105965       -798.401562       0.060000 
      0.121964       -798.401562       0.040000 
      0.136760       -798.401558       0.100000 
      0.153382       -798.400370       0.030000 
      0.183318       -798.293494       0.040000 
      0.199023       -794.754233       0.050000 
      0.215122       -751.637490       0.040000 
      0.230306       -558.405082       0.040000 
      0.246316       -239.834431       0.050000 
      0.260938       -46.642334       0.040000 
      0.276016       -3.578524       0.050000 
      0.291652       -0.104188       0.010000 
      0.306403       -0.047171       0.050000 
      0.322804       -0.069641       0.050000 
      0.337949       -0.079162       0.040000 
      0.352811       -0.088049       0.150000 
      0.369038       -0.126680       0.040000 
      0.384274       -0.086220       0.090000 
      0.400120       -0.012427       0.050000 
      0.414976       -0.032068       0.020000 
      0.430082       -0.072375       0.060000 
      0.445355       -0.041966       0.020000 
      0.460963       -0.050412       0.030000 
      0.476186       -0.121214       0.010000 
      0.492193       -0.096987       0.020000 
      0.508168       0.017682       0.030000 
      0.523463       0.119896       0.010000 
      0.538615       0.125698       0.020000 
      0.555618       0.052208       0.030000 
      0.570125       -0.014528       0.010000 
      0.586210       -0.046408       0.020000 
      0.602193       -0.056210       0.010000 
      0.617210       -0.081806       0.030000 
      0.632893       -0.113157       0.020000 
      0.649578       -0.094759       0.070000 
      0.664482       0.016770       0.070000 
      0.680618       0.105970       0.130000 
      0.696852       0.058905       0.010000 
      0.711733       -0.038751       0.050000 
      0.727742       -0.099272       0.020000 
      0.744747       -0.071478       0.070000 
      0.760828       -0.027128       0.040000 
      0.776819       -0.058120       0.060000 
      0.792769       -0.104602       0.020000 
      0.823241       -0.097141       0.020000 
      0.839857       -0.065155       0.000000 
      0.855592       -0.078786       0.060000 
      0.869823       -0.089335       0.010000 
      0.886063       -0.078357       0.140000 
      0.901878       -0.060266       0.050000 
      0.917879       -0.080572       0.030000 
      0.932375       -0.116277       0.030000 
      0.947758       -0.198012       0.090000 
      0.963459       -0.243499       0.050000 
      0.980009       -0.127583       0.000000 
      0.995798       -0.005673       0.020000 
      1.025607       -0.035195       0.020000 
      1.042329       -0.031608       0.080000 
      1.057108       0.019924       0.010000 
      1.072395       -0.003817       0.150000 
      1.087952       -0.028813       0.050000 
      1.103250       0.002805       0.010000 
      1.118407       0.057243       0.050000 
      1.132714       0.044011       0.040000 
      1.147966       -0.048554       0.070000 
      1.163226       -0.141921       0.030000 
      1.178663       -0.122987       0.060000 
      1.195676       -0.093115       0.060000 
      1.211110       -0.103331       0.010000 
      1.225988       -0.131624       0.040000 
      1.240842       -0.175965       0.000000 
      1.256965       -0.207732       0.030000 
      1.271699       -0.175102       0.110000 
      1.288490       -0.058051       0.000000 
      1.304155       0.022927       0.040000 
      1.320122       -0.046840       0.050000 
      1.335530       -0.184943       0.030000 
      1.351367       -0.191561       0.010000 
      1.366769       -0.093062       0.010000 
      1.382759       -0.032998       0.050000 
      1.397689       -0.067516       0.120000 
      1.412646       -0.088573       0.010000 
      1.428007       -0.080506       0.070000 
      1.443398       -0.151807       0.020000 
      1.457534       -0.214846       0.020000 
      1.474517       -0.180047       0.020000 
      1.490242       -0.133288       0.030000 
      1.506314       -0.097057       0.090000 
      1.521088       0.029839       0.060000 
      1.538112       0.163763       0.020000 
      1.553834       0.189802       0.080000 
      1.568618       0.102430       0.060000 
      1.584391       0.012770       0.010000 
      1.599974       -0.033799       0.010000 
      1.616860       -0.097530       0.050000 
      1.630004       -0.139556       0.090000 
      1.645526       -0.150894       0.010000 
      1.661102       -0.144083       0.050000 
      1.678059       -0.111870       0.020000 
      1.693151       -0.037924       0.010000 
      1.709798       -0.003429       0.060000 
      1.723869       -0.053648       0.010000 
      1.740825       -0.115857       0.070000 
      1.754753       -0.156737       0.010000 
      1.771925       -0.197877       0.040000 
      1.787882       -0.221254       0.010000 
      1.802355       -0.150839       0.020000 
      1.817313       -0.083287       0.030000 
      1.832309       -0.103331       0.030000 
      1.847302       -0.141506       0.040000 
      1.863893       -0.149913       0.040000 
      1.878952       -0.150935       0.080000 
      1.895947       -0.135098       0.050000 
      1.911781       -0.085502       0.070000 
      1.927733       -0.059866       0.010000 
      1.942154       -0.132952       0.040000 
      1.957587       -0.149439       0.000000 
      1.972859       -0.089501       0.000000 
      1.989065       -0.054024       0.020000 
      2.005045       -0.032981       0.040000 
      2.020545       -0.042450       0.070000 
      2.036006       -0.096589       0.110000 
      2.052058       -0.141009       0.120000 
      2.067395       -0.149456       0.190000 
      2.083068       -0.145509       0.040000 
      2.098041       -0.110028       0.080000 
      2.113591       -0.035266       0.020000 
      2.129583       0.006896       0.100000 
      2.145020       -0.076931       0.010000 
      2.159674       -0.159724       0.010000 
      2.174939       -0.123553       0.060000 
      2.190622       -0.062067       0.060000 
      2.204818       -0.035266       0.120000 
      2.220783       -0.041051       0.030000 
      2.236617       -0.098444       0.010000 
      2.251759       -0.144110       0.020000 
      2.267143       -0.165206       0.010000 
      2.282886       -0.147268       0.010000 
      2.298421       -0.115484       0.030000 
      2.314460       -0.123527       0.050000 
      2.331559       -0.125742       0.090000 
      2.346409       -0.124453       0.080000 
      2.361841       -0.107317       0.030000 
      2.377686       -0.042463       0.040000 
      2.393269       -0.022643       0.050000 
      2.408983       -0.074287       0.020000 
      2.424044       -0.118488       0.060000 
      2.439990       -0.147391       0.060000 
      2.455649       -0.143571       0.010000 
      2.471042       -0.130338       0.090000 
      2.486088       -0.118572       0.020000 
      2.501990       -0.157646       0.030000 
      2.533534       -0.143225       0.050000 
      2.550030       -0.115514       0.070000 
      2.565396       -0.192118       0.000000 
      2.580668       -0.232785       0.050000 
      2.612245       -0.150505       0.010000 
      2.628537       -0.047270       0.030000 
      2.644171       -0.016521       0.080000 
      2.659693       -0.036942       0.070000 
      2.673815       -0.107537       0.040000 
      2.705257       -0.178053       0.050000 
      2.721901       -0.193570       0.010000 
      2.737352       -0.167825       0.050000 
      2.752737       -0.194900       0.050000 
      2.766753       -0.194304       0.010000 
      2.782142       -0.181900       0.020000 
      2.798698       -0.178194       0.040000 
      2.814393       -0.184987       0.060000 
      2.829496       -0.211373       0.040000 
      2.843859       -0.189833       0.010000 
      2.859792       -0.130295       0.030000 
      2.874571       -0.073292       0.080000 
      2.890692       -0.019125       0.130000 
      2.906301       -0.021314       0.120000 
      2.922195       -0.081387       0.040000 
      2.952614       -0.079948       0.020000 
      2.968980       -0.022712       0.040000 
      2.983660       -0.016343       0.060000 
      2.999733       -0.058036       0.020000 
      3.015208       -0.049107       0.120000 
      3.030773       -0.026212       0.030000 
      3.045701       -0.005186       0.040000 
      3.059890       -0.000257       0.050000 
      3.076800       -0.068848       0.190000 
      3.090958       -0.114957       0.110000 
      3.107923       -0.130268       0.050000 
      3.122795       -0.147268       0.060000 
      3.138579       -0.150395       0.080000 
      3.155642       -0.151794       0.030000 
      3.168698       -0.144540       0.040000 
      3.184848       -0.116812       0.050000 
      3.214585       -0.056265       0.050000 
      3.230686       -0.013297       0.050000 
      3.246345       -0.008757       0.050000 
      3.262156       -0.037024       0.050000 
      3.277040       -0.095273       0.060000 
      3.293257       -0.130640       0.100000 
      3.308226       -0.106474       0.100000 
      3.323987       -0.090374       0.060000 
      3.338431       -0.107370       0.070000 
      3.352996       -0.078261       0.010000 
      3.368586       -0.061748       0.030000 
      3.397900       -0.142795       0.010000 
      3.413650       -0.206444       0.010000 
      3.430166       -0.213671       0.030000 
      3.445375       -0.241385       0.030000 
      3.461617       -0.235610       0.040000 
      3.477329       -0.180018       0.120000 
      3.492912       -0.134326       0.130000 
      3.508341       -0.110555       0.080000 
      3.522913       -0.118169       0.040000 
      3.539890       -0.107401       0.060000 
      3.555295       -0.115027       0.040000 
      3.570886       -0.157580       0.060000 
      3.586019       -0.144567       0.000000 
      3.601986       -0.111914       0.030000 
      3.618326       -0.102445       0.110000 
      3.632342       -0.102041       0.030000 
      3.649367       -0.107388       0.070000 
      3.664592       -0.130725       0.030000 
      3.694615       -0.160693       0.020000 
      3.710557       -0.146838       0.000000 
      3.726017       -0.115028       0.000000 
      3.741035       -0.118155       0.010000 
      3.758064       -0.102458       0.060000 
      3.772666       -0.096270       0.080000 
      3.788630       -0.143252       0.070000 
      3.804018       -0.177790       0.020000 
      3.819878       -0.219473       0.030000 
      3.834951       -0.298801       0.010000 
      3.850917       -0.284377       0.030000 
      3.864876       -0.152791       0.020000 
      3.879836       -0.088591       0.110000 
      3.895964       -0.145564       0.070000 
      3.911423       -0.192988       0.090000 
      3.925741       -0.215456       0.070000 
      3.941740       -0.190707       0.010000 
      3.956598       -0.136607       0.010000 
      3.970579       -0.108731       0.020000 
      3.986356       -0.112853       0.010000 
      4.002874       -0.150839       0.070000 
      4.018307       -0.191689       0.030000 
      4.034166       -0.192545       0.030000 
      4.050406       -0.163891       0.020000 
      4.065763       -0.103375       0.050000 
      4.081486       -0.125852       0.040000 
      4.095634       -0.211773       0.140000 
      4.111227       -0.189430       0.050000 
      4.126865       -0.125813       0.030000 
      4.142490       -0.124427       0.030000 
      4.156252       -0.126655       0.020000 
      4.172688       -0.135238       0.010000 
      4.188214       -0.155281       0.090000 
      4.203594       -0.117255       0.070000 
      4.218639       -0.050936       0.140000 
      4.234874       -0.054064       0.010000 
      4.249843       -0.072875       0.090000 
      4.264661       -0.090857       0.020000 
      4.278813       -0.147725       0.030000 
      4.294779       -0.195688       0.090000 
      4.311246       -0.224372       0.120000 
      4.325683       -0.234657       0.010000 
      4.341758       -0.184018       0.080000 
      4.357994       -0.077818       0.090000 
      4.373519       0.020339       0.040000 
      4.388657       0.026611       0.110000 
      4.404254       -0.036524       0.180000 
      4.419944       -0.059834       0.020000 
      4.435735       -0.031142       0.040000 
      4.451113       -0.012826       0.080000 
      4.466888       -0.027555       0.030000 
      4.481755       -0.058147       0.010000 
      4.497656       -0.105116       0.020000 
      4.513730       -0.168418       0.120000 
      4.530019       -0.205089       0.130000 
      4.545441       -0.257206       0.060000 
      4.561633       -0.314890       0.050000 
      4.577247       -0.339666       0.080000 
      4.591864       -0.314460       0.160000 
      4.607846       -0.252277       0.040000 
      4.623294       -0.187204       0.070000 
      4.637560       -0.164459       0.070000 
      4.654428       -0.181805       0.050000 
      4.670360       -0.227597       0.070000 
      4.685661       -0.267851       0.010000 
      4.701040       -0.275504       0.030000 
      4.715343       -0.201948       0.070000 
      4.732152       -0.131265       0.010000 
      4.747360       -0.138283       0.090000 
      4.762980       -0.123165       0.060000 
      4.777773       -0.100230       0.070000 
      4.794226       -0.150023       0.130000 
      4.809589       -0.193391       0.110000 
      4.825032       -0.215039       0.100000 
      4.839714       -0.185764       0.110000 
      4.854893       -0.118212       0.020000 
      4.871136       -0.097103       0.130000 
      4.885648       -0.136524       0.030000 
      4.900851       -0.136094       0.000000 
      4.918489       -0.091704       0.130000 
      4.932542       -0.094029       0.140000 
      4.947924       -0.146353       0.040000 
      4.963116       -0.197571       0.020000 
      4.978806       -0.228386       0.030000 
      4.995099       -0.262092       0.030000 
      5.009912       -0.245010       0.040000 
      5.024986       -0.212840       0.010000 
      5.041573       -0.214129       0.010000 
      5.055585       -0.261180       0.080000 
      5.070936       -0.333811       0.040000 
      5.087236       -0.337728       0.020000 
      5.103140       -0.227637       0.020000 
      5.117372       -0.113231       0.080000 
      5.134168       -0.121464       0.020000 
      5.149495       -0.189805       0.060000 
      5.164823       -0.241992       0.070000 
      5.180776       -0.247614       0.120000 
      5.196439       -0.243320       0.030000 
      5.211605       -0.205976       0.040000 
      5.227384       -0.193169       0.080000 
      5.242730       -0.222129       0.040000 
      5.257930       -0.252291       0.030000 
      5.274668       -0.280006       0.000000 
      5.288848       -0.317242       0.050000 
      5.305010       -0.325728       0.030000 
      5.320343       -0.330241       0.010000 
      5.335583       -0.335597       0.000000 
      5.350930       -0.290760       0.020000 
      5.367204       -0.218226       0.030000 
      5.381913       -0.192604       0.020000 
      5.412825       -0.223151       0.050000 
      5.427969       -0.245453       0.060000 
      5.443093       -0.257207       0.130000 
      5.460121       -0.274593       0.100000 
      5.475804       -0.287202       0.070000 
      5.490964       -0.255822       0.140000 
      5.506041       -0.237480       0.030000 
      5.520206       -0.254037       0.120000 
      5.536585       -0.285404       0.000000 
      5.552245       -0.340110       0.110000 
      5.567895       -0.349439       0.010000 
      5.583985       -0.282304       0.040000 
      5.598825       -0.227156       0.130000 
      5.613803       -0.248235       0.050000 
      5.628968       -0.267006       0.080000 
      5.643725       -0.265693       0.060000 
      5.660099       -0.294736       0.050000 
      5.675461       -0.293443       0.060000 
      5.690841       -0.185818       0.000000 
      5.706459       -0.041649       0.030000 
      5.722137       -0.019570       0.060000 
      5.737068       -0.144691       0.080000 
      5.752998       -0.251653       0.030000 
      5.768626       -0.284476       0.030000 
      5.784516       -0.244070       0.010000 
      5.800439       -0.177831       0.040000 
      5.816392       -0.120012       0.040000 
      5.831698       -0.127652       0.040000 
      5.847047       -0.217686       0.030000 
      5.862761       -0.283574       0.030000 
      5.877911       -0.289377       0.040000 
      5.893063       -0.252210       0.080000 
      5.909901       -0.210072       0.020000 
      5.925240       -0.193542       0.010000 
      5.940689       -0.157608       0.020000 
      5.955291       -0.153261       0.010000 
      5.971993       -0.221659       0.730000 
      5.987118       -0.285859       0.950000 
      6.001948       -0.292061       0.740000 
      6.018530       -0.262991       0.230000 
      6.033013       -0.192563       0.340000 
      6.050085       -0.177002       1.260000 
      6.064022       -0.226169       0.390000 
      6.081130       -0.212326       2.660000 
      6.095650       -0.161721       4.010000 
      6.111598       -0.207843       6.710000 
      6.126112       -0.276834       16.400000 
      6.141636       -0.278233       23.400000 
      6.157669       -0.271022       32.120000 
      6.173422       -0.242339       53.430000 
      6.189143       -0.191300       64.810000 
      6.204363       -0.183633       85.550000 
      6.219487       -0.201490       96.910000 
      6.234736       -0.217159       124.100000 
      6.250263       -0.181207       140.440000 
      6.265970       0.005725       157.320000 
      6.280175       0.291629       189.430000 
      6.297078       0.483960       204.200000 
      6.312440       0.544539       230.360000 
      6.327193       0.573762       243.040000 
      6.342623       0.600322       266.000000 
      6.358679       0.648359       277.030000 
      6.373308       0.793669       289.230000 
      6.390177       1.082745       317.270000 
      6.405818       1.400114       331.330000 
      6.421843       1.562435       354.430000 
      6.437660       1.603398       363.300000 
      6.452756       1.653677       370.980000 
      6.468221       1.812480       381.790000 
      6.483530       2.098497       385.380000 
      6.499024       2.386298       387.790000 
      6.513855       2.568846       391.320000 
      6.528492       2.740653       394.650000 
      6.543665       3.033881       399.770000 
      6.560616       3.356258       396.240000 
      6.574929       3.558089       379.290000 
      6.591977       3.722862       318.440000 
      6.605931       4.038893       264.170000 
      6.622122       4.501667       76.860000 
      6.637581       4.977314       6.330000 
      6.652074       5.382632       15.900000 
      6.668865       5.662939       2.800000 
      6.684529       5.975575       2.150000 
      6.700242       6.348040       8.390000 
      6.715355       6.574185       12.880000 
      6.731966       6.717711       1.370000 
      6.746213       6.913112       0.690000 
      6.761571       7.149954       9.350000 
      6.777037       7.330192       11.340000 
      6.792642       6.906771       6.090000 
      6.808250       5.042801       0.620000 
      6.824004       2.311040       4.980000 
      6.840014       1.116510       10.470000 
      6.854271       1.756402       5.670000 
      6.870714       2.391091       1.770000 
      6.886190       2.401658       6.920000 
      6.901894       2.055486       11.000000 
      6.916862       1.544011       5.830000 
      6.932131       0.970852       3.340000 
      6.947156       0.298799       4.580000 
      6.961688       -0.521173       11.220000 
      6.977092       -1.244746       9.230000 
      6.992913       -1.774814       5.240000 
      7.007943       -2.170691       4.680000 
      7.024348       -2.364513       7.860000 
      7.039950       -2.422960       7.440000 
      7.054944       -2.446770       3.720000 
      7.070955       -2.450395       2.410000 
      7.086200       -2.452251       7.350000 
      7.102308       -2.450396       8.770000 
      7.117501       -2.446878       3.420000 
      7.132638       -2.426629       2.790000 
      7.148591       -2.411940       7.770000 
      7.162732       -2.421256       8.490000 
      7.178920       -2.423124       6.060000 
      7.195498       -2.415901       3.600000 
      7.210824       -2.452264       5.810000 
      7.226192       -2.485361       8.430000 
      7.242381       -2.476918       5.870000 
      7.258011       -2.467036       4.570000 
      7.273262       -2.501558       6.940000 
      7.289183       -2.536053       8.340000 
      7.305860       -2.525298       5.820000 
      7.320212       -2.506474       4.410000 
      7.336004       -2.495702       7.490000 
      7.350952       -2.466133       8.880000 
      7.366053       -2.407857       5.300000 
      7.382048       -2.372919       4.190000 
      7.396709       -2.402002       5.080000 
      7.411900       -2.435624       8.110000 
      7.427067       -2.419900       6.670000 
      7.443222       -2.382304       4.660000 
      7.459644       -2.356735       5.140000 
      7.475867       -2.354064       7.060000 
      7.490604       -2.367077       6.120000 
      7.507681       -2.425755       4.390000 
      7.522744       -2.481333       5.600000 
      7.538701       -2.473693       7.210000 
      7.555623       -2.451794       5.900000 
      7.570800       -2.421256       4.630000 
      7.586760       -2.383230       4.850000 
      7.601130       -2.367520       7.620000 
      7.618115       -2.402015       7.550000 
      7.632833       -2.441453       5.210000 
      7.648464       -2.449509       5.460000 
      7.664463       -2.446852       6.830000 
      7.679894       -2.426642       7.540000 
      7.693887       -2.412397       6.110000 
      7.709109       -2.427085       5.290000 
      7.726013       -2.452291       6.840000 
      7.740786       -2.475036       7.650000 
      7.757733       -2.497544       5.600000 
      7.772864       -2.498790       4.910000 
      7.788556       -2.492158       6.560000 
      7.804826       -2.450839       7.270000 
      7.819913       -2.412383       5.260000 
      7.836643       -2.402458       4.770000 
      7.851700       -2.402028       6.730000 
      7.866855       -2.406958       7.170000 
      7.882811       -2.425769       6.330000 
      7.897965       -2.441896       4.830000 
      7.914248       -2.431181       5.750000 
      7.929592       -2.432054       7.160000 
      7.945726       -2.453137       6.360000 
      7.960958       -2.479562       5.260000 
      7.976309       -2.510956       6.150000 
      7.992217       -2.490733       7.100000 
      8.008264       -2.441993       6.230000 
      8.022616       -2.432941       5.510000 
      8.038413       -2.453164       5.580000 
      8.054010       -2.479576       7.220000 
      8.069648       -2.511386       6.980000 
      8.084687       -2.495716       5.410000 
      8.100637       -2.461650       5.560000 
      8.115607       -2.458536       6.450000 
      8.130608       -2.474633       6.680000 
      8.145898       -2.487216       5.760000 
      8.161037       -2.456238       5.640000 
      8.177466       -2.441980       6.410000 
      8.191893       -2.466993       6.840000 
      8.207528       -2.471519       5.510000 
      8.224569       -2.460751       5.210000 
      8.240717       -2.471505       6.560000 
      8.256277       -2.466549       6.880000 
      8.271678       -2.436567       5.670000 
      8.287634       -2.431598       5.460000 
      8.303249       -2.441909       5.910000 
      8.318562       -2.425756       6.770000 
      8.333147       -2.406528       6.300000 
      8.350023       -2.397046       5.560000 
      8.365014       -2.382774       6.140000 
      8.381114       -2.385875       6.890000 
      8.395957       -2.417725       6.420000 
      8.411814       -2.426641       5.790000 
      8.427521       -2.441483       6.150000 
      8.442450       -2.489403       6.720000 
      8.457242       -2.495202       6.170000 
      8.473320       -2.412370       5.620000 
      8.487835       -2.357652       5.600000 
      8.503755       -2.399371       6.640000 
      8.519944       -2.439624       6.560000 
      8.535859       -2.451364       5.520000 
      8.550846       -2.450356       5.630000 
      8.566146       -2.446435       6.270000 
      8.582152       -2.421243       6.360000 
      8.597817       -2.388173       5.880000 
      8.612876       -2.386304       5.810000 
      8.628368       -2.417269       6.380000 
      8.645468       -2.420370       6.460000 
      8.661444       -2.406971       5.950000 
      8.677062       -2.407831       5.800000 
      8.692561       -2.431195       6.520000 
      8.707765       -2.466549       6.720000 
      8.724025       -2.476891       5.950000 
      8.738834       -2.484948       5.770000 
      8.755442       -2.511386       6.590000 
      8.769804       -2.490303       6.630000 
      8.786200       -2.436580       6.210000 
      8.800860       -2.408287       5.770000 
      8.817271       -2.407427       6.020000 
      8.832400       -2.425769       6.450000 
      8.847249       -2.441439       6.160000 
      8.862387       -2.425326       5.720000 
      8.877633       -2.402015       6.110000 
      8.892180       -2.383633       6.470000 
      8.907794       -2.390844       6.120000 
      8.924103       -2.436483       5.840000 
      8.938492       -2.441009       5.820000 
      8.954812       -2.409615       6.490000 
      8.969787       -2.398874       6.500000 
      8.986295       -2.380475       5.850000 
      9.001495       -2.376945       5.970000 
      9.017115       -2.372849       6.270000 
      9.031751       -2.367090       6.340000 
      9.047478       -2.407374       6.120000 
      9.064149       -2.465193       5.970000 
      9.080173       -2.483575       6.250000 
      9.094205       -2.441882       6.560000 
      9.110722       -2.372905       6.040000 
      9.126525       -2.367506       5.940000 
      9.141387       -2.411883       6.380000 
      9.156688       -2.414971       6.550000 
      9.172016       -2.387703       6.330000 
      9.188622       -2.386277       5.840000 
      9.203514       -2.416825       6.030000 
      9.220013       -2.414944       6.520000 
      9.235725       -2.381874       6.330000 
      9.249994       -2.356708       6.010000 
      9.264476       -2.353634       6.030000 
      9.280262       -2.362107       6.370000 
      9.296507       -2.406528       6.220000 
      9.311474       -2.460694       5.930000 
      9.326545       -2.471048       5.850000 
      9.341899       -2.460737       6.380000 
      9.356251       -2.471478       6.460000 
      9.372400       -2.465663       5.900000 
      9.388814       -2.425769       5.940000 
      9.404837       -2.383204       6.410000 
      9.421117       -2.362121       6.390000 
      9.436848       -2.377375       5.830000 
      9.452313       -2.396146       5.970000 
      9.467729       -2.400672       6.170000 
      9.483788       -2.396146       6.300000 
      9.499522       -2.377374       6.050000 
      9.515696       -2.362107       6.040000 
      9.530868       -2.382760       6.120000 
      9.546410       -2.420356       6.260000 
      9.562129       -2.441009       6.190000 
      9.577526       -2.425729       6.030000 
      9.593187       -2.406527       6.220000 
      9.608638       -2.397046       6.320000 
      9.623153       -2.382787       6.120000 
      9.638847       -2.386318       6.030000 
      9.655020       -2.423084       6.150000 
      9.671052       -2.449496       6.370000 
      9.686165       -2.464750       6.230000 
      9.703037       -2.436040       5.920000 
      9.717311       -2.361677       6.030000 
      9.733747       -2.319112       6.300000 
      9.749477       -2.332525       6.180000 
      9.765427       -2.371546       5.980000 
      9.780203       -2.396146       6.060000 
      9.795065       -2.406501       6.280000 
      9.811607       -2.425742       6.300000 
      9.826568       -2.441466       6.030000 
      9.842093       -2.426198       6.070000 
      9.857473       -2.412357       6.270000 
      9.872702       -2.426212       6.300000 
      9.887737       -2.441895       6.160000 
      9.903165       -2.430684       6.050000 
      9.918725       -2.424856       6.130000 
      9.934683       -2.406457       6.330000 
      9.950618       -2.332081       6.190000 
      9.965566       -2.278788       6.030000 
      9.981647       -2.308771       6.180000 
      9.996606       -2.371975       6.380000 
      10.012097       -2.424842       6.160000 
      10.028691       -2.464736       5.940000 
      10.042874       -2.460237       6.180000 
      10.058021       -2.406957       6.440000 
      10.073600       -2.367506       6.100000 
      10.089783       -2.377818       6.010000 
      10.105462       -2.396159       6.160000 
      10.120223       -2.400672       6.270000 
      10.136691       -2.396146       6.240000 
      10.151230       -2.377361       5.970000 
      10.168281       -2.361651       6.000000 
      10.183042       -2.376918       6.220000 
      10.198632       -2.390760       6.300000 
      10.213924       -2.376918       6.070000 
      10.230232       -2.361637       6.060000 
      10.245341       -2.376931       6.220000 
      10.261030       -2.391203       6.280000 
      10.276523       -2.382304       5.990000 
      10.292379       -2.385405       6.040000 
      10.308368       -2.411856       6.320000 
      10.337905       -2.396146       6.240000 
      10.354222       -2.366164       5.960000 
      10.369071       -2.371962       6.010000 
      10.384853       -2.367020       6.190000 
      10.401497       -2.342436       6.080000 
      10.416700       -2.362080       5.990000 
      10.430965       -2.416812       6.100000 
      10.446397       -2.438724       6.200000 
      10.463062       -2.422641       6.120000 
      10.478207       -2.391676       6.060000 
      10.493783       -2.406527       6.160000 
      10.509788       -2.431098       6.150000 
      10.525778       -2.401128       6.130000 
      10.539987       -2.367050       6.030000 
      10.556078       -2.377804       6.140000 
      10.571062       -2.396159       6.240000 
      10.586787       -2.400672       6.140000 
      10.602108       -2.396146       6.120000 
      10.618118       -2.377361       6.180000 
      10.635120       -2.361651       6.220000 
      10.651115       -2.376931       6.120000 
      10.666730       -2.391203       6.060000 
      10.682338       -2.382317       6.180000 
      10.698437       -2.385834       6.190000 
      10.713644       -2.416812       6.210000 
      10.728791       -2.414970       6.070000 
      10.744239       -2.382747       6.030000 
      10.759567       -2.367063       6.160000 
      10.774014       -2.396616       6.170000 
      10.790131       -2.417256       6.190000 
      10.805535       -2.409615       6.140000 
      10.821776       -2.422655       6.180000 
      10.837709       -2.421256       6.150000 
      10.852395       -2.412370       6.110000 
      10.867654       -2.431571       6.050000 
      10.883004       -2.465220       6.070000 
      10.899104       -2.460251       6.190000 
      10.914774       -2.406957       6.130000 
      10.930135       -2.367506       6.080000 
      10.945265       -2.377818       6.030000 
      10.961012       -2.396173       6.280000 
      10.977034       -2.401102       6.240000 
      10.992324       -2.401102       6.070000 
      11.007302       -2.396159       6.150000 
      11.023476       -2.377361       6.210000 
      11.038580       -2.361664       6.170000 
      11.053926       -2.377348       6.060000 
      11.070794       -2.395716       6.140000 
      11.085064       -2.395716       6.200000 
      11.101628       -2.377361       6.190000 
      11.117784       -2.362120       6.220000 
      11.133893       -2.383203       6.120000 
      11.148831       -2.425755       6.240000 
      11.165242       -2.465193       6.130000 
      11.180517       -2.465193       6.120000 
      11.195685       -2.425755       6.130000 
      11.211819       -2.383204       6.260000 
      11.226069       -2.362134       6.290000 
      11.242156       -2.377818       6.020000 
      11.256836       -2.401559       6.030000 
      11.273392       -2.425326       6.060000 
      11.288608       -2.441882       6.210000 
      11.304367       -2.431154       6.170000 
      11.320332       -2.431154       6.150000 
      11.334140       -2.441882       6.210000 
      11.350574       -2.425326       6.190000 
      11.366886       -2.401572       6.120000 
      11.381927       -2.378248       6.100000 
      11.396473       -2.367076       6.130000 
      11.412605       -2.401531       6.210000 
      11.428359       -2.435153       6.280000 
      11.443684       -2.414044       6.120000 
      11.458864       -2.352264       6.150000 
      11.474271       -2.287218       6.160000 
      11.490017       -2.264889       6.240000 
      11.504998       -2.286788       6.220000 
      11.520352       -2.347322       6.160000 
      11.536799       -2.395689       6.190000 
      11.552051       -2.424868       6.170000 
      11.568038       -2.441856       6.110000 
      11.583586       -2.430724       6.030000 
      11.598895       -2.426212       6.220000 
      11.614806       -2.423541       6.270000 
      11.630061       -2.415471       6.130000 
      11.646092       -2.446852       6.110000 
      11.662227       -2.460694       6.230000 
      11.677215       -2.430738       6.300000 
      11.692850       -2.407803       6.160000 
      11.708014       -2.406501       6.140000 
      11.723373       -2.414084       6.120000 
      11.738801       -2.382247       6.190000 
      11.755011       -2.297130       6.080000 
      11.769961       -2.273389       6.090000 
      11.785790       -2.319055       6.110000 
      11.801761       -2.355405       6.260000 
      11.816832       -2.401088       6.140000 
      11.833030       -2.441425       6.100000 
      11.847348       -2.449509       6.110000 
      11.862506       -2.446838       6.140000 
      11.877944       -2.426198       6.210000 
      11.893180       -2.406971       6.140000 
      11.908981       -2.402002       6.120000 
      11.924556       -2.401572       6.140000 
      11.940262       -2.401558       6.170000 
      11.954391       -2.401545       6.100000 
      11.984751       -2.401102       6.240000 
      12.001009       -2.395716       6.220000 
      12.016292       -2.371962       6.190000 
      12.031895       -2.337467       6.200000 
      12.046908       -2.337454       6.100000 
      12.062086       -2.371532       6.140000 
      12.077489       -2.390773       6.170000 
      12.092227       -2.382747       6.270000 
      12.108434       -2.391247       6.190000 
      12.122557       -2.441466       6.170000 
      12.137575       -2.460694       6.240000 
      12.152908       -2.436110       6.140000 
      12.168040       -2.431584       6.180000 
      12.184124       -2.441896       6.300000 
      12.199451       -2.425326       6.220000 
      12.215430       -2.401545       6.200000 
      12.231920       -2.377348       6.180000 
      12.246057       -2.355835       6.120000 
      12.262840       -2.347765       6.030000 
      12.278088       -2.332068       6.110000 
      12.293661       -2.337024       6.150000 
      12.308779       -2.371962       6.090000 
      12.324233       -2.396132       6.140000 
      12.340298       -2.405614       6.250000 
      12.355721       -2.414944       6.260000 
      12.370853       -2.393058       6.230000 
      12.386154       -2.345980       6.260000 
      12.400789       -2.359006       6.100000 
      12.417029       -2.396602       6.090000 
      12.432291       -2.424882       6.200000 
      12.448051       -2.441412       6.180000 
      12.463089       -2.425298       6.230000 
      12.477752       -2.401102       6.070000 
      12.493448       -2.371949       6.100000 
      12.509957       -2.331625       6.200000 
      12.523895       -2.307441       6.170000 
      12.539760       -2.302915       6.090000 
      12.555829       -2.312827       6.200000 
      12.570676       -2.355808       6.250000 
      12.587307       -2.411400       6.100000 
      12.603215       -2.419899       6.130000 
      12.618851       -2.406474       6.160000 
      12.634285       -2.401088       6.210000 
      12.650016       -2.390330       6.210000 
      12.665171       -2.347779       6.110000 
      12.680123       -2.298043       6.150000 
      12.695212       -2.319569       6.180000 
      12.711051       -2.402015       6.210000 
      12.725672       -2.489417       6.160000 
      12.741686       -2.535100       6.120000 
      12.758509       -2.524385       6.160000 
      12.773883       -2.495702       6.140000 
      12.789809       -2.448195       6.140000 
      12.806423       -2.397156       6.250000 
      12.821954       -2.408301       6.200000 
      12.837601       -2.447308       6.140000 
      12.853236       -2.473707       6.130000 
      12.869142       -2.486316       6.080000 
      12.884293       -2.445882       6.140000 
      12.900314       -2.398944       6.190000 
      12.916091       -2.410058       6.130000 
      12.931614       -2.446378       6.140000 
      12.946942       -2.396173       6.230000 
      12.963360       -2.332568       6.170000 
      12.978702       -2.359436       6.140000 
      12.994073       -2.414984       6.130000 
      13.011572       -2.440566       6.070000 
      13.025529       -2.425729       6.080000 
      13.040617       -2.406957       6.100000 
      13.056723       -2.402001       6.150000 
      13.071715       -2.401558       6.130000 
      13.086922       -2.401115       6.140000 
      13.103654       -2.396146       6.270000 
      13.118979       -2.376918       6.220000 
      13.134433       -2.356252       6.140000 
      13.149656       -2.352721       6.210000 
      13.165685       -2.350853       6.250000 
      13.181888       -2.352291       6.180000 
      13.198028       -2.351296       6.190000 
      13.213773       -2.358120       6.250000 
      13.228034       -2.380422       6.250000 
      13.244298       -2.415926       6.090000 
      13.260248       -2.409531       6.150000 
      13.275587       -2.357663       6.170000 
      13.291894       -2.316357       6.210000 
      13.307533       -2.323568       6.190000 
      13.322662       -2.326226       6.180000 
      13.336997       -2.331181       6.220000 
      13.352705       -2.347712       6.230000 
      13.367980       -2.354948       6.160000 
      13.384923       -2.366550       6.100000 
      13.401102       -2.353164       6.110000 
      13.416493       -2.345967       6.210000 
      13.431643       -2.398444       6.160000 
      13.447821       -2.439154       6.120000 
      13.462409       -2.445965       6.070000 
      13.477766       -2.426171       6.240000 
      13.493994       -2.406931       6.210000 
      13.508111       -2.400699       6.100000 
      13.524361       -2.386261       6.040000 
      13.539932       -2.339752       6.120000 
      13.555954       -2.329826       6.270000 
      13.571791       -2.403330       6.150000 
      13.586721       -2.408671       6.110000 
      13.602502       -2.360308       6.260000 
      13.617650       -2.328927       6.350000 
      13.632903       -2.305599       6.080000 
      13.648704       -2.304327       6.070000 
      13.664560       -2.310972       6.300000 
      13.680519       -2.352721       6.250000 
      13.695476       -2.396146       6.080000 
      13.712482       -2.425312       6.030000 
      13.727164       -2.446825       6.250000 
      13.743556       -2.449965       6.120000 
      13.758203       -2.447295       6.110000 
      13.774472       -2.431584       6.130000 
      13.788673       -2.430725       6.120000 
      13.805033       -2.436497       6.160000 
      13.819973       -2.401585       6.170000 
      13.835910       -2.367493       6.170000 
      13.852054       -2.382773       6.230000 
      13.867369       -2.415400       6.210000 
      13.882843       -2.421755       6.160000 
      13.897972       -2.404189       6.140000 
      13.913198       -2.392602       6.120000 
      13.929816       -2.350866       6.060000 
      13.945572       -2.312853       6.140000 
      13.960103       -2.308744       6.160000 
      13.976064       -2.337024       6.130000 
      13.993230       -2.395260       6.160000 
      14.007802       -2.430211       6.150000 
      14.022999       -2.401545       6.240000 
      14.038449       -2.372435       6.140000 
      14.052953       -2.401558       6.200000 
      14.068165       -2.430668       6.180000 
      14.084243       -2.401115       6.210000 
      14.099980       -2.367050       6.130000 
      14.114506       -2.377817       6.100000 
      14.131054       -2.396602       6.210000 
      14.146053       -2.406071       6.180000 
      14.161284       -2.420316       6.100000 
      14.192208       -2.416342       6.170000 
      14.207787       -2.374177       6.160000 
      14.222814       -2.323568       6.100000 
      14.239733       -2.268420       6.140000 
      14.255871       -2.272946       6.160000 
      14.271410       -2.342353       6.160000 
      14.285871       -2.389860       6.100000 
      14.301963       -2.400215       6.120000 
      14.317664       -2.396562       6.200000 
      14.333322       -2.382317       6.180000 
      14.348006       -2.380449       6.070000 
      14.362816       -2.392615       6.030000 
      14.378411       -2.375050       6.170000 
      14.393965       -2.357677       6.270000 
      14.408793       -2.351296       6.160000 
      14.425379       -2.352734       6.130000 
      14.440458       -2.356265       6.250000 
      14.456037       -2.377361       6.150000 
      14.472411       -2.401531       6.100000 
      14.488008       -2.424869       6.110000 
      14.503497       -2.436053       6.140000 
      14.517608       -2.402001       6.150000 
      14.534058       -2.372422       6.200000 
      14.549071       -2.400631       6.150000 
      14.563947       -2.418500       6.150000 
      14.578681       -2.335181       6.320000 
      14.595519       -2.198016       6.290000 
      14.610819       -2.131294       6.190000 
      14.625846       -2.163491       6.100000 
      14.642695       -2.246879       6.120000 
      14.658260       -2.313614       6.190000 
      14.673569       -2.335570       6.170000 
      14.687558       -2.306474       6.180000 
      14.718974       -2.285418       6.150000 
      14.735372       -2.288116       6.170000 
      14.750763       -2.256708       6.110000 
      14.766046       -2.247379       6.200000 
      14.783028       -2.291203       6.210000 
      14.798179       -2.311870       6.180000 
      14.814384       -2.290817       6.080000 
      14.829965       -2.307401       6.180000 
      14.845741       -2.342352       6.140000 
      14.861034       -2.355365       6.180000 
      14.876552       -2.376448       6.230000 
      14.892466       -2.390746       6.310000 
      14.908718       -2.376918       6.180000 
      14.924681       -2.361651       6.190000 
      14.940458       -2.377361       6.160000 
      14.956974       -2.396159       6.250000 
      14.970953       -2.401102       6.260000 
      14.986480       -2.401088       6.160000 
      15.002020       -2.395702       6.150000 
      15.018543       -2.371506       6.220000 
      15.032701       -2.331625       6.190000 
      15.049670       -2.307871       6.250000 
      15.065367       -2.307857       6.220000 
      15.080315       -2.331168       6.170000 
      15.095767       -2.365663       6.200000 
      15.111679       -2.366093       6.170000 
      15.125708       -2.336567       6.180000 
      15.142291       -2.332054       6.180000 
      15.156523       -2.347765       6.200000 
      15.171826       -2.355808       6.210000 
      15.187061       -2.376461       6.130000 
      15.202813       -2.390746       6.150000 
      15.219011       -2.376904       6.220000 
      15.234227       -2.361194       6.230000 
      15.249839       -2.371519       6.250000 
      15.263954       -2.366550       6.170000 
      15.279614       -2.336580       6.170000 
      15.295747       -2.332028       6.160000 
      15.311511       -2.346878       6.210000 
      15.326612       -2.345010       6.210000 
      15.341006       -2.328080       6.190000 
      15.357401       -2.311374       6.140000 
      15.372698       -2.333023       6.150000 
      15.387830       -2.363808       6.250000 
      15.403230       -2.362575       6.200000 
      15.418588       -2.316330       6.130000 
      15.433189       -2.317769       6.130000 
      15.447917       -2.361124       6.100000 
      15.464115       -2.364803       6.160000 
      15.479902       -2.326186       6.130000 
      15.494631       -2.288616       6.240000 
      15.510336       -2.286761       6.220000 
      15.525486       -2.322682       6.130000 
      15.539780       -2.345010       6.180000 
      15.555687       -2.352291       6.270000 
      15.569862       -2.357111       6.220000 
      15.586142       -2.387259       6.170000 
      15.601731       -2.438657       6.200000 
      15.615968       -2.449964       6.180000 
      15.631712       -2.369180       6.180000 
      15.648366       -2.269388       6.130000 
      15.663578       -2.218170       6.170000 
      15.678434       -2.234863       6.160000 
      15.693410       -2.280906       6.250000 
      15.708145       -2.345992       6.330000 
      15.723620       -2.385320       6.270000 
      15.739826       -2.381833       6.190000 
      15.756033       -2.384948       6.200000 
      15.771850       -2.406443       6.200000 
      15.786257       -2.371506       6.220000 
      15.803320       -2.320883       6.180000 
      15.818306       -2.323984       6.160000 
      15.833578       -2.326239       6.310000 
      15.849903       -2.331168       6.250000 
      15.865230       -2.347282       6.230000 
      15.880681       -2.349979       6.300000 
      15.896595       -2.347295       6.260000 
      15.911969       -2.331611       6.100000 
      15.927513       -2.331624       6.200000 
      15.942744       -2.347725       6.230000 
      15.958606       -2.354935       6.220000 
      15.974493       -2.366106       6.200000 
      15.989856       -2.347751       6.210000 
      16.005573       -2.321326       6.180000 
      16.020864       -2.353137       6.220000 
      16.036108       -2.390303       6.230000 
      16.051301       -2.394843       6.260000 
      16.066883       -2.372352       6.250000 
      16.083015       -2.341979       6.200000 
      16.098813       -2.350839       6.200000 
      16.114797       -2.362576       6.130000 
      16.129626       -2.329313       6.140000 
      16.146688       -2.309256       6.130000 
      16.161729       -2.305559       6.210000 
      16.178799       -2.322695       6.180000 
      16.193780       -2.326629       6.160000 
      16.224710       -2.336137       6.180000 
      16.240704       -2.366509       6.220000 
      16.256121       -2.370632       6.200000 
      16.271562       -2.350396       6.150000 
      16.287611       -2.328510       6.150000 
      16.301848       -2.310972       6.220000 
      16.317840       -2.328537       6.280000 
      16.332938       -2.351282       6.270000 
      16.348762       -2.381404       6.210000 
      16.363755       -2.414044       6.270000 
      16.379076       -2.406014       6.310000 
      16.394327       -2.337440       6.230000 
      16.410005       -2.302515       6.290000 
      16.424216       -2.342366       6.220000 
      16.440148       -2.360720       6.170000 
      16.455464       -2.336097       6.190000 
      16.470939       -2.331141       6.210000 
      16.486552       -2.336523       6.220000 
      16.502059       -2.302028       6.180000 
      16.517514       -2.272906       6.170000 
      16.532545       -2.307401       6.150000 
      16.548143       -2.360277       6.250000 
      16.563531       -2.365650       6.220000 
      16.578470       -2.336553       6.170000 
      16.594715       -2.332027       6.110000 
      16.609781       -2.346878       6.120000 
      16.624862       -2.345010       6.180000 
      16.640510       -2.328041       6.270000 
      16.655669       -2.310072       6.260000 
      16.669719       -2.317725       6.150000 
      16.686077       -2.302458       6.150000 
      16.700998       -2.296659       6.240000 
      16.715963       -2.346852       6.280000 
      16.746778       -2.379491       6.130000 
      16.762907       -2.351351       6.120000 
      16.792796       -2.310071       6.150000 
      16.808946       -2.294388       6.140000 
      16.824191       -2.267077       6.230000 
      16.837937       -2.285431       6.200000 
      16.854367       -2.327983       6.200000 
      16.870951       -2.304229       6.170000 
      16.885548       -2.287716       6.230000 
      16.900562       -2.297489       6.190000 
      16.916226       -2.306984       6.210000 
      16.932938       -2.331155       6.210000 
      16.948249       -2.366106       6.180000 
      16.962554       -2.371505       6.150000 
      16.979121       -2.361207       6.280000 
      16.995134       -2.377348       6.230000 
      17.010477       -2.396159       6.170000 
      17.025833       -2.401102       6.240000 
      17.040935       -2.401088       6.230000 
      17.056134       -2.395676       6.230000 
      17.072329       -2.370632       6.190000 
      17.087662       -2.321256       6.210000 
      17.102773       -2.264433       6.230000 
      17.117796       -2.246880       6.200000 
      17.134454       -2.298901       6.230000 
      17.149452       -2.344124       6.240000 
      17.163689       -2.365206       6.240000 
      17.180774       -2.347268       6.290000 
      17.196017       -2.315484       6.270000 
      17.212115       -2.323554       6.320000 
      17.227323       -2.326655       6.340000 
      17.243051       -2.336111       6.260000 
      17.257596       -2.365650       6.310000 
      17.274039       -2.360720       6.220000 
      17.288552       -2.312813       6.310000 
      17.305808       -2.297559       6.250000 
      17.320619       -2.347738       6.280000 
      17.335206       -2.389417       6.270000 
      17.350982       -2.389403       6.260000 
      17.366014       -2.347268       6.210000 
      17.381588       -2.291274       6.230000 
      17.397226       -2.277832       6.170000 
      17.413379       -2.272889       6.190000 
      17.428646       -2.267520       6.150000 
      17.443033       -2.312330       6.240000 
      17.459883       -2.384031       6.220000 
      17.476000       -2.400601       6.240000 
      17.492131       -2.342382       6.230000 
      17.508141       -2.326698       6.130000 
      17.523875       -2.382233       6.160000 
      17.539976       -2.384031       6.170000 
      17.554938       -2.330712       6.240000 
      17.571102       -2.283660       6.190000 
      17.586067       -2.263047       6.200000 
      17.602026       -2.289059       6.230000 
      17.616523       -2.355352       6.290000 
      17.631905       -2.429298       6.250000 
      17.647873       -2.429741       6.150000 
      17.663164       -2.361181       6.150000 
      17.678851       -2.318226       6.220000 
      17.694696       -2.322169       6.200000 
      17.709188       -2.328537       6.180000 
      17.725082       -2.340085       6.190000 
      17.742037       -2.391729       6.250000 
      17.756997       -2.404588       6.170000 
      17.772954       -2.363062       6.160000 
      17.789912       -2.345940       6.320000 
      17.804596       -2.387646       6.220000 
      17.819869       -2.389874       6.240000 
      17.835939       -2.355365       6.210000 
      17.850976       -2.328913       6.290000 
      17.867800       -2.310085       6.290000 
      17.883852       -2.317269       6.120000 
      17.898131       -2.296603       6.200000 
      17.912798       -2.266647       6.190000 
      17.928981       -2.278248       6.210000 
      17.944626       -2.302015       6.190000 
      17.959549       -2.330725       6.230000 
      17.975427       -2.366093       6.200000 
      17.991999       -2.371492       6.190000 
      18.006652       -2.360750       6.240000 
      18.021760       -2.371479       6.260000 
      18.037185       -2.365677       6.240000 
      18.054270       -2.326239       6.210000 
      18.068819       -2.289503       6.190000 
      18.083827       -2.297572       6.200000 
      18.099396       -2.371505       6.230000 
      18.114577       -2.429714       6.210000 
      18.129117       -2.418113       6.120000 
      18.144217       -2.366093       6.250000 
      18.160916       -2.284090       6.220000 
      18.177026       -2.232595       6.190000 
      18.191624       -2.272419       6.330000 
      18.207158       -2.306457       6.310000 
      18.223541       -2.284532       6.240000 
      18.238609       -2.277334       6.170000 
      18.253772       -2.272392       6.200000 
      18.269608       -2.260791       6.200000 
      18.284763       -2.271962       6.250000 
      18.300468       -2.272405       6.150000 
      18.316266       -2.266634       6.140000 
      18.331563       -2.302015       6.370000 
      18.347078       -2.342325       6.310000 
      18.361928       -2.359878       6.270000 
      18.378281       -2.390277       6.260000 
      18.394140       -2.387202       6.260000 
      18.409840       -2.340124       6.230000 
      18.425592       -2.334312       6.190000 
      18.441307       -2.349966       6.220000 
      18.456698       -2.359848       6.160000 
      18.472016       -2.318142       6.200000 
      18.487653       -2.257221       6.100000 
      18.503265       -2.288603       6.150000 
      18.518305       -2.355308       6.270000 
      18.532696       -2.364776       6.230000 
      18.549836       -2.331101       6.240000 
      18.564789       -2.306500       6.230000 
      18.580990       -2.290760       6.250000 
      18.595781       -2.247335       6.240000 
      18.610769       -2.192174       6.250000 
      18.626848       -2.189059       6.190000 
      18.642357       -2.226226       6.280000 
      18.657953       -2.265690       6.260000 
      18.672358       -2.271909       6.220000 
      18.688602       -2.265733       6.260000 
      18.704196       -2.291190       6.270000 
      18.719228       -2.293058       6.230000 
      18.735240       -2.269734       6.220000 
      18.750616       -2.298887       6.280000 
      18.765862       -2.320813       6.260000 
      18.781029       -2.330738       6.140000 
      18.796112       -2.347725       6.130000 
      18.812289       -2.355794       6.240000 
      18.827400       -2.376005       6.320000 
      18.843392       -2.384917       6.140000 
      18.859327       -2.347751       6.160000 
      18.875073       -2.302488       6.200000 
      18.891573       -2.331168       6.240000 
      18.907410       -2.371019       6.280000 
      18.921870       -2.325782       6.310000 
      18.937966       -2.278291       6.270000 
      18.953011       -2.307830       6.300000 
      18.968573       -2.359834       6.200000 
      18.983045       -2.359821       6.240000 
      19.000261       -2.307374       6.230000 
      19.015094       -2.272475       6.290000 
      19.031333       -2.297059       6.230000 
      19.048270       -2.317282       6.240000 
      19.062513       -2.310045       6.250000 
      19.078907       -2.327597       6.200000 
      19.093557       -2.339584       6.250000 
      19.109840       -2.321795       6.230000 
      19.124686       -2.281349       6.150000 
      19.140674       -2.264445       6.130000 
      19.155170       -2.287191       6.230000 
      19.171390       -2.351834       6.210000 
      19.187386       -2.409088       6.310000 
      19.201773       -2.416315       6.300000 
      19.218690       -2.384491       6.300000 
      19.234284       -2.366106       6.200000 
      19.250153       -2.318142       6.220000 
      19.265612       -2.250963       6.220000 
      19.280535       -2.254051       6.280000 
      19.295025       -2.272432       6.230000 
      19.312142       -2.285458       6.180000 
      19.326851       -2.323527       6.180000 
      19.342050       -2.355767       6.280000 
      19.358894       -2.399302       6.200000 
      19.374018       -2.418916       6.220000 
      19.389196       -2.340996       6.160000 
      19.404356       -2.226739       6.160000 
      19.421075       -2.185030       6.360000 
      19.436107       -2.184574       6.280000 
      19.449908       -2.220454       6.190000 
      19.465938       -2.305988       6.230000 
      19.481264       -2.330211       6.220000 
      19.497280       -2.290790       6.280000 
      19.513200       -2.288119       6.220000 
      19.559488       -2.314983       6.220000 
      19.574807       -2.311843       6.200000 
      19.591168       -2.266177       6.160000 
      19.606695       -2.256681       6.200000 
      19.620837       -2.268431       6.280000 
      19.637453       -2.253980       6.230000 
      19.651590       -2.255019       6.250000 
      19.682356       -2.260252       6.260000 
      19.698580       -2.303413       6.210000 
      19.713677       -2.344527       6.220000 
      19.728677       -2.364776       6.270000 
      19.744694       -2.341882       6.250000 
      19.759710       -2.291689       6.250000 
      19.773720       -2.287689       6.190000 
      19.790464       -2.309102       6.240000 
      19.806057       -2.280957       6.250000 
      19.821351       -2.187178       6.190000 
      19.836875       -2.134893       6.210000 
      19.853760       -2.176420       6.250000 
      19.882758       -2.232993       6.230000 
      19.898789       -2.234269       6.140000 
      19.914663       -2.258106       6.210000 
      19.929955       -2.297032       6.250000 
      19.945101       -2.330724       6.190000 
      19.974155       -2.371022       6.300000 
      19.992147       -2.389833       6.320000 
      20.007104       -2.370619       6.190000 
      20.022190       -2.326628       6.220000 
      20.037474       -2.288173       6.280000 
      20.053688       -2.280919       6.210000 
      20.069359       -2.293072       6.150000 
      20.083610       -2.280449       6.270000 
      20.099966       -2.281861       6.170000 
      20.114443       -2.290760       6.270000 
      20.130280       -2.271989       6.270000 
      20.145176       -2.243296       6.270000 
      20.160829       -2.267063       6.140000 
      20.176227       -2.336053       6.210000 
      20.191901       -2.359807       6.260000 
      20.207940       -2.330685       6.320000 
      20.223211       -2.306957       6.160000 
      20.238574       -2.297072       6.180000 
      20.253192       -2.283231       6.200000 
      20.269989       -2.291730       6.270000 
      20.284577       -2.347751       6.180000 
      20.299747       -2.395689       6.210000 
      20.315992       -2.424412       6.140000 
      20.332016       -2.436000       6.160000 
      20.346452       -2.400658       6.170000 
      20.363246       -2.355808       6.140000 
      20.377774       -2.323554       6.240000 
      20.393386       -2.286331       6.270000 
      20.409747       -2.282774       6.250000 
      20.424675       -2.296616       6.220000 
      20.439960       -2.301585       6.180000 
      20.454342       -2.307387       6.280000 
      20.470989       -2.331168       6.200000 
      20.487157       -2.366106       6.180000 
      20.502179       -2.371505       6.230000 
      20.518237       -2.361194       6.250000 
      20.533345       -2.376891       6.150000 
      20.548857       -2.390303       6.130000 
      20.563928       -2.371049       6.260000 
      20.579878       -2.331181       6.300000 
      20.595476       -2.302915       6.260000 
      20.611567       -2.289073       6.190000 
      20.626330       -2.315914       6.280000 
      20.642715       -2.386719       6.290000 
      20.657215       -2.407758       6.180000 
      20.673515       -2.365220       6.180000 
      20.688943       -2.284090       6.120000 
      20.703568       -2.233468       6.170000 
      20.718640       -2.282774       6.120000 
      20.734637       -2.349452       6.150000 
      20.750741       -2.340110       6.220000 
      20.766409       -2.285405       6.160000 
      20.781663       -2.254050       6.200000 
      20.796755       -2.237923       6.140000 
      20.811989       -2.261221       6.250000 
      20.827942       -2.311373       6.290000 
      20.844016       -2.313627       6.200000 
      20.859593       -2.271505       6.180000 
      20.875552       -2.213673       6.210000 
      20.890691       -2.196699       6.220000 
      20.907166       -2.236953       6.160000 
      20.923045       -2.241466       6.190000 
      20.938751       -2.215001       6.200000 
      20.953872       -2.222641       6.190000 
      20.968779       -2.215427       6.190000 
      20.982999       -2.182787       6.250000 
      20.999960       -2.167910       6.210000 
      21.015707       -2.206098       6.210000 
