Human trial picking the raspberry twin 

 time    ||     output compensated 

      0       -800.942857 
      0       -800.942857 
      0       -800.942857 
      0       -800.942857 
      0       -800.942857 
      0       -800.942857 
      0       -800.942857 
      0       -800.942857 
      0       -800.942857 
      0       -800.942852 
      0       -800.941662 
      0       -800.834504 
      0       -797.285883 
      0       -754.053999 
      0       -560.292273 
      0       -240.791567 
      0       -46.945153 
      0       -3.662661 
      0       -0.101414 
      0       0.005205 
      0       0.007861 
      0       0.006428 
      0       0.007866 
      0       0.006428 
      0       0.007866 
      0       0.006428 
      0       0.007866 
      0       0.006428 
      0       0.007866 
      0       0.006428 
      1       0.007866 
      1       0.006428 
      1       0.007866 
      1       0.006428 
      1       0.007866 
      1       0.006428 
      1       0.007866 
      1       0.006428 
      1       0.007866 
      1       0.006428 
      1       0.007866 
      1       0.006428 
      1       0.007866 
      1       0.006428 
      1       0.007866 
      1       0.006428 
      1       0.007866 
      1       0.006428 
      1       0.007866 
      1       0.006428 
      1       0.007866 
      1       0.006428 
      1       0.007866 
      1       0.006428 
      1       0.007866 
      1       0.006428 
      1       0.007866 
      1       0.006428 
      1       0.007866 
      1       0.006428 
      1       0.007866 
      1       0.006428 
      1       0.007866 
      1       0.006428 
      1       0.007866 
      2       0.006428 
      2       0.007866 
      2       0.006428 
      2       0.007866 
      2       0.006428 
      2       0.007866 
      2       0.006428 
      2       0.007866 
      2       0.006428 
      2       0.007866 
      2       0.006428 
      2       0.007866 
      2       0.006414 
      2       0.007410 
      2       0.000599 
      2       -0.021300 
      2       -0.052694 
      2       -0.036997 
      2       -0.002502 
      2       0.005555 
      2       0.007840 
      2       0.006428 
      2       0.007866 
      2       0.006428 
      2       0.007866 
      2       0.006428 
      2       0.007866 
      2       0.006428 
      2       0.007866 
      2       0.006428 
      2       0.007866 
      3       0.006428 
      3       0.007866 
      3       0.006428 
      3       0.007866 
      3       0.006428 
      3       0.007866 
      3       0.006415 
      3       0.007423 
      3       0.001029 
      3       -0.016331 
      3       -0.033466 
      3       -0.016331 
      3       0.001029 
      3       0.007396 
      3       0.005528 
      3       -0.002932 
      3       -0.041966 
      3       -0.071922 
      3       -0.041966 
      3       -0.002932 
      3       0.005528 
      3       0.007396 
      3       0.001015 
      3       -0.016774 
      3       -0.038865 
      3       -0.040528 
      3       -0.038490 
      3       -0.016660 
      3       -0.003802 
      3       -0.016456 
      3       -0.037749 
      3       -0.039430 
      3       -0.042296 
      3       -0.038613 
      3       -0.036168 
      3       -0.014362 
      3       -0.001925 
      3       -0.018666 
      3       -0.049134 
      3       -0.033090 
      3       0.001365 
      4       0.008477 
      4       0.000841 
      4       -0.037798 
      4       -0.067502 
      4       -0.042090 
      4       -0.022061 
      4       -0.033898 
      4       -0.034354 
      4       -0.032338 
      4       -0.010144 
      4       0.007556 
      4       0.013398 
      4       0.007359 
      4       -0.009887 
      4       -0.026752 
      4       -0.009521 
      4       0.007760 
      4       0.014013 
      4       0.012875 
      4       0.014183 
      4       0.012591 
      4       0.013038 
      4       0.001671 
      4       -0.034142 
      4       -0.066318 
      4       -0.033576 
      4       -0.002351 
      4       -0.009701 
      4       -0.025730 
      4       -0.008921 
      4       0.003036 
      4       -0.013768 
      4       -0.044285 
      4       -0.028289 
      4       0.006144 
      5       0.014046 
      5       0.015729 
      5       0.008855 
      5       -0.012914 
      5       -0.043865 
      5       -0.027886 
      5       0.006543 
      5       0.014454 
      5       0.016571 
      5       0.014994 
      5       0.015843 
      5       0.009354 
      5       -0.007925 
      5       -0.024810 
      5       -0.007598 
      5       0.009664 
      5       0.015898 
      5       0.014727 
      5       0.015592 
      5       0.009105 
      5       -0.008172 
      5       -0.025054 
      5       -0.007839 
      5       0.009412 
      5       0.015223 
      5       0.009165 
      5       -0.008099 
      5       -0.024982 
      5       -0.007768 
      6       0.009482 
      6       0.015292 
      6       0.009235 
      6       -0.008031 
      6       -0.024914 
      6       -0.007701 
      6       0.009589 
      6       0.016755 
      6       0.028074 
      6       0.099850 
      6       0.288713 
      6       0.570352 
      6       0.812216 
      6       0.940466 
      6       0.987937 
      6       1.065175 
      6       1.230127 
      6       1.445835 
      6       1.664039 
      6       1.795060 
      6       1.843442 
      6       1.888833 
      6       1.914303 
      7       1.931022 
      7       1.901264 
      7       1.832020 
      7       1.792390 
      7       1.771915 
      7       1.769966 
      7       1.851582 
      7       1.864853 
      7       1.713885 
      7       1.464182 
      7       1.279074 
      7       1.209996 
      7       1.131452 
      7       1.033351 
      7       0.978535 
      7       0.968745 
      7       0.966407 
      7       0.967819 
      7       0.966434 
      7       0.969686 
      7       0.991227 
      7       1.107370 
      7       1.357950 
      7       1.651938 
      7       1.818300 
      7       1.824161 
      7       1.838211 
      7       1.901788 
      7       1.932904 
      7       1.939178 
      7       2.029380 
      7       2.249478 
      7       2.574891 
      7       2.842485 
      7       2.946098 
      7       2.967281 
      7       2.978118 
      7       3.030221 
      7       3.136036 
      7       3.313113 
      7       3.556093 
      7       3.758192 
      7       3.854284 
      7       3.880341 
      7       3.738924 
      7       2.818818 
      8       0.862662 
      8       -0.456261 
      8       0.150655 
      8       1.225282 
      8       1.837234 
      8       2.060861 
      8       2.040293 
      8       1.697081 
      8       0.940505 
      8       -0.025147 
      8       -0.986320 
      8       -1.852892 
      8       -2.505283 
      8       -2.871702 
      8       -3.007307 
      8       -3.030273 
      8       -3.033579 
      8       -3.032638 
      8       -3.039476 
      8       -3.062222 
      8       -3.103124 
      8       -3.120914 
      8       -3.108510 
      8       -3.055554 
      8       -3.018035 
      8       -2.965984 
      8       -2.924044 
      8       -2.912402 
      8       -2.952875 
      8       -2.970651 
      8       -2.958261 
      8       -2.936612 
      8       -2.934937 
      8       -2.935740 
      8       -2.947933 
      8       -2.928596 
      8       -2.909854 
      8       -2.973893 
      8       -3.084588 
      8       -3.119084 
      8       -3.032155 
      8       -2.939438 
      8       -2.939864 
      8       -2.973889 
      8       -2.990959 
      8       -3.020967 
      8       -3.014643 
      8       -2.968161 
      8       -3.016915 
      9       -3.093142 
      9       -3.054081 
      9       -3.004484 
      9       -3.002046 
      9       -2.999068 
      9       -2.965349 
      9       -2.954192 
      9       -2.933552 
      9       -2.922851 
      9       -2.960907 
      9       -3.016511 
      9       -3.096273 
      9       -3.136584 
      9       -3.109742 
      9       -3.078335 
      9       -3.032665 
      9       -2.987802 
      9       -2.965460 
      9       -2.966705 
      9       -3.004884 
      9       -3.029910 
      9       -3.048322 
      9       -3.038011 
      9       -3.040695 
      9       -3.064019 
      9       -3.030340 
      9       -2.994130 
      9       -2.981973 
      9       -2.974359 
      9       -2.955122 
      9       -3.000384 
      9       -3.094002 
      9       -3.080576 
      9       -3.056006 
      9       -3.084563 
      9       -3.056406 
      9       -3.021025 
      9       -3.014657 
      9       -2.968601 
      9       -2.958692 
      9       -3.029954 
      9       -3.093572 
      9       -3.111970 
      9       -3.062624 
      9       -3.026866 
      9       -3.038397 
      9       -3.002196 
      9       -2.947451 
      9       -2.941666 
      9       -2.965832 
      9       -3.018283 
      9       -3.026796 
      9       -3.016928 
      9       -3.034910 
      10       -3.054564 
      10       -3.069432 
      10       -3.041581 
      10       -3.043437 
      10       -3.072989 
      10       -3.076103 
      10       -3.033888 
      10       -3.005220 
      10       -3.007647 
      10       -2.978365 
      10       -2.926463 
      10       -2.853248 
      10       -2.785673 
      10       -2.759653 
      10       -2.772771 
      10       -2.806357 
      10       -2.803042 
      10       -2.768872 
      10       -2.681654 
      10       -2.595469 
      10       -2.546341 
      10       -2.480132 
      10       -2.416674 
      10       -2.394782 
      10       -2.416455 
      10       -2.472240 
      10       -2.488659 
      10       -2.451958 
      10       -2.388234 
      10       -2.351222 
      10       -2.352868 
      10       -2.339139 
      10       -2.262948 
      10       -2.250539 
      10       -2.260348 
      10       -2.184133 
      10       -2.141450 
      10       -2.145237 
      10       -2.140310 
      10       -2.153895 
      10       -2.148760 
      10       -2.105606 
      10       -2.096022 
      10       -2.090216 
      10       -2.057256 
      10       -2.040356 
      10       -2.035315 
      10       -2.033324 
      10       -1.994203 
      10       -1.954418 
      10       -1.917484 
      10       -1.913038 
      10       -1.905805 
      11       -1.870372 
      11       -1.890313 
      11       -1.925868 
      11       -1.868568 
      11       -1.808568 
      11       -1.842417 
      11       -1.834996 
      11       -1.754212 
      11       -1.688625 
      11       -1.662512 
      11       -1.643586 
      11       -1.628561 
      11       -1.611289 
      11       -1.601946 
      11       -1.608457 
      11       -1.633252 
      11       -1.638200 
      11       -1.614693 
      11       -1.550693 
      11       -1.517383 
      11       -1.540416 
      11       -1.510305 
      11       -1.465537 
      11       -1.453964 
      11       -1.486879 
      11       -1.489773 
      11       -1.435832 
      11       -1.426805 
      11       -1.410262 
      11       -1.383824 
      11       -1.368588 
      11       -1.305663 
      11       -1.273150 
      11       -1.342435 
      11       -1.397324 
      11       -1.348779 
      11       -1.301579 
      11       -1.304925 
      11       -1.274634 
      11       -1.222818 
      11       -1.184854 
      11       -1.165016 
      11       -1.207524 
      11       -1.243715 
      11       -1.206528 
      11       -1.156243 
      11       -1.136279 
      11       -1.121804 
      11       -1.102609 
      11       -1.058258 
      11       -1.041097 
      11       -1.089187 
      11       -1.094260 
      12       -1.032806 
      12       -1.033963 
      12       -1.067982 
      12       -1.048449 
      12       -1.011790 
      12       -0.958148 
      12       -0.918458 
      12       -0.938066 
      12       -0.957490 
      12       -0.918233 
      12       -0.870472 
      12       -0.855533 
      12       -0.870111 
      12       -0.966509 
      12       -1.079767 
      12       -1.057377 
      12       -0.948916 
      12       -0.894904 
      12       -0.935368 
      12       -0.974623 
      12       -0.949501 
      12       -0.868910 
      12       -0.835923 
      12       -0.849204 
      12       -0.901583 
      12       -0.933296 
      12       -0.861459 
      12       -0.795195 
      12       -0.850238 
      12       -0.923288 
      12       -0.893746 
      12       -0.826130 
      12       -0.782495 
      12       -0.731515 
      12       -0.708798 
      12       -0.721553 
      12       -0.765878 
      12       -0.767020 
      12       -0.753236 
      12       -0.768248 
      12       -0.749520 
      12       -0.730979 
      12       -0.746226 
      12       -0.733036 
      12       -0.738163 
      12       -0.787037 
      12       -0.767695 
      12       -0.710301 
      12       -0.687219 
      12       -0.656375 
      12       -0.622761 
      13       -0.577503 
      13       -0.557051 
      13       -0.597680 
      13       -0.673706 
      13       -0.734475 
      13       -0.681786 
      13       -0.612985 
      13       -0.620941 
      13       -0.618744 
      13       -0.543366 
      13       -0.475772 
      13       -0.462639 
      13       -0.479679 
      13       -0.520642 
      13       -0.555725 
      13       -0.562664 
      13       -0.503279 
      13       -0.449554 
      13       -0.464464 
      13       -0.474083 
      13       -0.438248 
      13       -0.413024 
      13       -0.411577 
      13       -0.442038 
      13       -0.463396 
      13       -0.470286 
      13       -0.500229 
      13       -0.512043 
      13       -0.555393 
      13       -0.609590 
      13       -0.578358 
      13       -0.519229 
      13       -0.507497 
      13       -0.516934 
      13       -0.530500 
      13       -0.510449 
      13       -0.493899 
      13       -0.445822 
      13       -0.400236 
      13       -0.436936 
      13       -0.471197 
      13       -0.463362 
      13       -0.466280 
      13       -0.430985 
      13       -0.355717 
      13       -0.322903 
      13       -0.385712 
      14       -0.451553 
      14       -0.424333 
      14       -0.384732 
      14       -0.365206 
      14       -0.348837 
      14       -0.351462 
      14       -0.394554 
      14       -0.393253 
      14       -0.355196 
      14       -0.326322 
      14       -0.314670 
      14       -0.361227 
      14       -0.393055 
      14       -0.378095 
      14       -0.413796 
      14       -0.468185 
      14       -0.434259 
      14       -0.366922 
      14       -0.368581 
      14       -0.388794 
      14       -0.359691 
      14       -0.336047 
      14       -0.339864 
      14       -0.319515 
      14       -0.309332 
      14       -0.341622 
      14       -0.384388 
      14       -0.349038 
      14       -0.288293 
      14       -0.258386 
      14       -0.250878 
      14       -0.258143 
      14       -0.232032 
      14       -0.245238 
      14       -0.268960 
      14       -0.237874 
      14       -0.216916 
      14       -0.221324 
      14       -0.277776 
      14       -0.323664 
      14       -0.295265 
      14       -0.249188 
      14       -0.219710 
      15       -0.199698 
      15       -0.214652 
      15       -0.230117 
      15       -0.239066 
      15       -0.254712 
      15       -0.274022 
      15       -0.272077 
      15       -0.257871 
      15       -0.195364 
      15       -0.135319 
      15       -0.126002 
      15       -0.146834 
      15       -0.195646 
      15       -0.248960 
      15       -0.270616 
      15       -0.238914 
      15       -0.231822 
      15       -0.221337 
      15       -0.205967 
      15       -0.197125 
      15       -0.186353 
      15       -0.145832 
      15       -0.114717 
      15       -0.143213 
      15       -0.179999 
      15       -0.181669 
      15       -0.163078 
      15       -0.139191 
      15       -0.131646 
      15       -0.117421 
      15       -0.131348 
      15       -0.140655 
      15       -0.107769 
      15       -0.085849 
      15       -0.088087 
      15       -0.126263 
      15       -0.164456 
      15       -0.170388 
      15       -0.161559 
      15       -0.125793 
      15       -0.108144 
      15       -0.128330 
      15       -0.111494 
      15       -0.085603 
      15       -0.109496 
      15       -0.123104 
      16       -0.090792 
      16       -0.069042 
      16       -0.071009 
      16       -0.104011 
      16       -0.118498 
      16       -0.086232 
      16       -0.063690 
      16       -0.056337 
      16       -0.057610 
      16       -0.065409 
      16       -0.103399 
      16       -0.132048 
      16       -0.101922 
      16       -0.072072 
      16       -0.100196 
      16       -0.128438 
      16       -0.102816 
      16       -0.087098 
      16       -0.117308 
      16       -0.136963 
      16       -0.132498 
      16       -0.092142 
      16       -0.052603 
      16       -0.053927 
      16       -0.094103 
      16       -0.154515 
      16       -0.178983 
      16       -0.185373 
      16       -0.175817 
      16       -0.154216 
      16       -0.124225 
      16       -0.148718 
      16       -0.157426 
      16       -0.108805 
      16       -0.083380 
      16       -0.078886 
      16       -0.099529 
      16       -0.116119 
      17       -0.120863 
      17       -0.113337 
      17       -0.090563 
      17       -0.059415 
      17       -0.083735 
      17       -0.148936 
      17       -0.162987 
      17       -0.098362 
      17       -0.057909 
      17       -0.073253 
      17       -0.055691 
      17       -0.020944 
      17       -0.012758 
      17       -0.010368 
      17       -0.011663 
      17       -0.010122 
      17       -0.011444 
      17       -0.009906 
      17       -0.011244 
      17       -0.010133 
      17       -0.016363 
      17       -0.033411 
      17       -0.050892 
      17       -0.043232 
      17       -0.062847 
      17       -0.087407 
      17       -0.061770 
      17       -0.045599 
      17       -0.066411 
      17       -0.049369 
      17       -0.015137 
      17       -0.012328 
      17       -0.033046 
      17       -0.063770 
      17       -0.047592 
      17       -0.012966 
      18       -0.004860 
      18       -0.002550 
      18       -0.003922 
      18       -0.002458 
      18       -0.003858 
      18       -0.002435 
      18       -0.005111 
      18       -0.018355 
      18       -0.075426 
      18       -0.119868 
      18       -0.073473 
      18       -0.015484 
      18       -0.002034 
      18       0.000687 
      18       -0.000705 
      18       0.000727 
      18       -0.000705 
      18       0.000726 
      18       -0.000705 
      18       0.000726 
      18       -0.000705 
      18       0.000726 
      18       -0.000718 
      18       0.000287 
      18       -0.006059 
      18       -0.023610 
      18       -0.045245 
      18       -0.046438 
      18       -0.044341 
      18       -0.022466 
      18       -0.009975 
      18       -0.027487 
      18       -0.067705 
      18       -0.089533 
      18       -0.094968 
      18       -0.087688 
      18       -0.064333 
      18       -0.024060 
      18       -0.016447 
      18       -0.070688 
      18       -0.141516 
      18       -0.130700 
      18       -0.089541 
      19       -0.045096 
      19       -0.027416 
      19       -0.048357 
      19       -0.031481 
      19       0.003010 
      19       0.010956 
      19       0.013109 
      19       0.011580 
      19       0.012888 
      19       0.011335 
      19       0.012646 
      19       0.011095 
      19       0.012408 
      19       0.010860 
      19       0.012136 
      19       0.009314 
      19       -0.004074 
      19       -0.061287 
      19       -0.105871 
      19       -0.059616 
      19       -0.001792 
      19       0.010683 
      19       0.003877 
      19       -0.030273 
      19       -0.045524 
      19       -0.014426 
      19       0.002079 
      19       -0.014303 
      19       -0.044802 
      19       -0.028800 
      19       0.005638 
      19       0.013531 
      19       0.014807 
      19       0.003435 
      19       -0.032834 
      19       -0.070329 
      19       -0.060238 
      19       -0.053922 
      20       -0.032949 
      20       -0.016654 
      20       -0.028931 
      20       -0.029450 
      20       -0.027483 
      20       -0.005364 
      20       0.011463 
      20       0.008292 
      20       -0.025516 
      20       -0.040787 
      20       -0.009299 
      20       0.012460 
      20       0.018640 
      20       0.012149 
      20       -0.009639 
      20       -0.040623 
      20       -0.024676 
      20       0.009721 
      20       0.017586 
      20       0.019234 
      20       0.012325 
      20       -0.009478 
      20       -0.040503 
      20       -0.025835 
      20       -0.006171 
      20       -0.054802 
      20       -0.108012 
      20       -0.094436 
      20       -0.053201 
      20       -0.006870 
      20       0.016155 
      20       0.022776 
      20       0.021563 
      20       0.022785 
      20       0.021120 
      20       0.021894 
      21       0.014932 
