

 time    ||    gripping force   ||   raspberry measurement 

      0       45.260000       2.008416 
      0       36.420000       2.006977 
      0       27.820000       2.008416 
      0       22.020000       2.006977 
      0       19.440000       2.008416 
      0       17.070000       2.007004 
      0       15.250000       2.009302 
      0       15.030000       2.017762 
      0       14.860000       2.056367 
      0       14.560000       2.081367 
      1       13.980000       2.032613 
      1       13.610000       1.977881 
      1       13.040000       1.985077 
      1       12.240000       2.000611 
      1       12.140000       1.993547 
      1       12.320000       1.912583 
      1       12.290000       1.698089 
      1       11.840000       1.435716 
      1       11.570000       1.265060 
      1       11.260000       1.129956 
      1       11.050000       1.091113 
      1       10.830000       1.148646 
      1       10.620000       1.195885 
      1       10.620000       1.195696 
      1       10.650000       1.164978 
      1       10.740000       1.146900 
      2       10.720000       1.187390 
      2       10.760000       1.239244 
      2       10.770000       1.311931 
      2       10.790000       1.310506 
      2       10.840000       1.241139 
      2       10.920000       1.191781 
      2       10.920000       1.177505 
      2       10.880000       1.222742 
      2       10.910000       1.244684 
      2       10.890000       1.236644 
      2       10.890000       1.307932 
      2       10.910000       1.370568 
      2       10.960000       1.331687 
      2       10.910000       1.276565 
      2       10.930000       1.270237 
      2       10.960000       1.245211 
      2       10.990000       1.260881 
      2       11.010000       1.354029 
      2       10.990000       1.363909 
      2       10.980000       1.310577 
      2       10.830000       1.254999 
      2       10.850000       1.191347 
      2       10.880000       1.160909 
      2       10.860000       1.142926 
      2       10.660000       1.163579 
      3       10.700000       1.203863 
      3       10.780000       1.235284 
      3       10.750000       1.267955 
      3       10.710000       1.257254 
      3       10.720000       1.242039 
      3       10.770000       1.256328 
      3       10.750000       1.276122 
      3       10.730000       1.340156 
      3       10.770000       1.348683 
      3       10.770000       1.261754 
      3       10.820000       1.260912 
      3       10.780000       1.336100 
      3       10.830000       1.355867 
      3       10.870000       1.292236 
      3       10.850000       1.248271 
      3       10.890000       1.255052 
      3       10.830000       1.255438 
      3       10.920000       1.254582 
      3       10.880000       1.241959 
      3       10.880000       1.256394 
      3       10.950000       1.258069 
      4       10.850000       1.198561 
      4       10.920000       1.182851 
      4       10.890000       1.238855 
      4       10.910000       1.246938 
      4       10.920000       1.228561 
      4       10.940000       1.268025 
      4       10.900000       1.329787 
      4       10.930000       1.312402 
      4       10.940000       1.226302 
      4       10.920000       1.196776 
      4       11.000000       1.212860 
      4       10.930000       1.251451 
      4       10.950000       1.268411 
      4       10.940000       1.246942 
      4       10.970000       1.262666 
      4       11.000000       1.288122 
      4       10.970000       1.268091 
      4       10.960000       1.272442 
      4       10.930000       1.323643 
      4       10.860000       1.338328 
      4       10.850000       1.300346 
      4       10.680000       1.238417 
      4       10.640000       1.273934 
      4       10.550000       1.352201 
      5       10.680000       1.350095 
      5       10.650000       1.311933 
      5       10.810000       1.285951 
      5       9.990000       1.277021 
      5       12.310000       1.321788 
      5       17.670000       1.332113 
      5       31.390000       1.266653 
      5       43.870000       1.231355 
      6       56.930000       1.262570 
      6       56.790000       1.323253 
      6       56.640000       1.344547 
      6       56.560000       1.333998 
      6       56.450000       1.310105 
      6       56.470000       1.301245 
      7       56.170000       1.277855 
      7       56.160000       1.315640 
      7       56.130000       1.363869 
      7       56.020000       1.304485 
      7       55.940000       1.309845 
      7       55.990000       1.478835 
      8       55.910000       1.654995 
      8       55.880000       1.825374 
      8       55.810000       1.955759 
      8       55.790000       1.999321 
      8       55.710000       2.007906 
      9       55.730000       2.006990 
      10       55.510000       2.009302 
      10       55.520000       2.017776 
      11       55.490000       2.056810 
      11       55.520000       2.086766 
      11       55.400000       2.056810 
      11       55.500000       2.017776 
      12       55.620000       2.009302 
      12       55.730000       2.007004 
      12       55.680000       2.008416 
      12       55.660000       2.006977 
      14       55.690000       2.008416 
      14       55.690000       2.006977 
      14       55.670000       2.008416 
      14       55.670000       2.006977 
      14       55.650000       2.008416 
      15       55.620000       2.006977 
      15       55.680000       2.008416 
      15       55.690000       2.006977 
      15       55.700000       2.008416 
      15       55.630000       2.006977 
      16       58.500000       2.008416 
      16       58.510000       2.006977 
      16       58.530000       2.008416 
      16       58.500000       2.006977 
      17       58.460000       2.008416 
      17       58.400000       2.006977 
      18       58.400000       2.008416 
      18       58.410000       2.006978 
      18       58.420000       2.008429 
      18       58.410000       2.007421 
      18       58.370000       2.013815 
      18       58.360000       2.031174 
      19       58.360000       2.048310 
      19       58.370000       2.031174 
      19       58.330000       2.013815 
      19       58.400000       2.007447 
      19       58.350000       2.009316 
      19       58.340000       2.017776 
      19       58.350000       2.056810 
      20       58.330000       2.086766 
      20       58.330000       2.056810 
      20       58.300000       2.017776 
      21       58.310000       2.009302 
      21       58.340000       2.007004 
      21       58.390000       2.008416 
      21       58.400000       2.006977 
      22       59.700000       2.008416 
      22       59.770000       2.006977 
      23       59.840000       2.008416 
      23       59.800000       2.006977 
      24       59.770000       2.008416 
      24       59.720000       2.006977 
      24       59.680000       2.008416 
      25       59.690000       2.006977 
      25       59.690000       2.008416 
      25       59.690000       2.006977 
      25       59.670000       2.008416 
      25       59.690000       2.007004 
      25       59.670000       2.009302 
      26       59.670000       2.017776 
      26       59.690000       2.056810 
      26       59.710000       2.086766 
      26       59.720000       2.056810 
      26       59.680000       2.017776 
      26       59.650000       2.009302 
      26       59.640000       2.007031 
      26       59.640000       2.009302 
      26       59.670000       2.017776 
      27       59.620000       2.056810 
      27       59.710000       2.086766 
      27       59.630000       2.056810 
      28       59.680000       2.017802 
      28       59.650000       2.010188 
      29       59.650000       2.017802 
      29       59.600000       2.056810 
      29       59.630000       2.086766 
      29       59.630000       2.056810 
      29       59.640000       2.017776 
      29       59.610000       2.009302 
      29       59.660000       2.007004 
      30       59.620000       2.008416 
      30       59.600000       2.006977 
      31       59.640000       2.008416 
      31       59.660000       2.007004 
      31       59.620000       2.009302 
      31       59.640000       2.017802 
      32       59.540000       2.057696 
      32       59.580000       2.097564 
      32       59.630000       2.105204 
      32       59.620000       2.097564 
      32       59.550000       2.057697 
      32       59.610000       2.017829 
      33       59.650000       2.010189 
      33       59.600000       2.017802 
      33       59.600000       2.056824 
      33       59.540000       2.087209 
      33       59.590000       2.062209 
      33       59.540000       2.041973 
      33       59.560000       2.049196 
      33       59.590000       2.031201 
      34       59.580000       2.013815 
      34       59.540000       2.007421 
      34       59.540000       2.008429 
      34       59.540000       2.007004 
      34       59.550000       2.009289 
      35       59.640000       2.017346 
      35       59.530000       2.051841 
      35       59.550000       2.067538 
      36       59.570000       2.036144 
      36       59.510000       2.014258 
      36       59.540000       2.007891 
      36       59.530000       2.014285 
      36       59.600000       2.037030 
      36       59.520000       2.078363 
      36       59.540000       2.101108 
      36       59.560000       2.107502 
      37       59.510000       2.101108 
      37       59.520000       2.078363 
      37       59.500000       2.037030 
      38       59.520000       2.014272 
      38       59.510000       2.007461 
      39       59.500000       2.009316 
      39       59.540000       2.017776 
      39       59.500000       2.056810 
      39       59.560000       2.086793 
      40       59.570000       2.057696 
      40       59.530000       2.028574 
      40       59.610000       2.057696 
      40       59.630000       2.086793 
      40       59.650000       2.056810 
      40       59.600000       2.017802 
      42       60.600000       2.010189 
      42       60.540000       2.017829 
      43       60.430000       2.057697 
      43       60.520000       2.097564 
      43       60.420000       2.105204 
      44       60.440000       2.097591 
      45       60.410000       2.058583 
      45       60.440000       2.028601 
      45       60.500000       2.057697 
      45       60.440000       2.086793 
      45       60.440000       2.056810 
      45       60.470000       2.017802 
      48       60.440000       2.010189 
      48       60.400000       2.017829 
      50       60.370000       2.057697 
      50       60.410000       2.097591 
      50       60.420000       2.106090 
      50       60.420000       2.108362 
      50       60.390000       2.106091 
      50       60.460000       2.097618 
      51       60.400000       2.058583 
      51       60.380000       2.028601 
      52       60.380000       2.057697 
      52       60.400000       2.086819 
      52       60.420000       2.057697 
      52       60.410000       2.028601 
      53       60.390000       2.058583 
      53       60.430000       2.097618 
      53       60.390000       2.106091 
      53       60.390000       2.108362 
      54       60.400000       2.106090 
      54       60.380000       2.097591 
      55       60.390000       2.057697 
      55       60.440000       2.017829 
      56       60.400000       2.010189 
      56       60.380000       2.017802 
      56       60.390000       2.056810 
      56       60.340000       2.086793 
      57       60.400000       2.057697 
      57       60.390000       2.028601 
      57       60.360000       2.058583 
      57       60.420000       2.097618 
      58       60.380000       2.106091 
      58       60.400000       2.108389 
      58       60.390000       2.106977 
      58       60.370000       2.108389 
      58       60.430000       2.106091 
      58       60.390000       2.097618 
      58       60.380000       2.058583 
      59       60.360000       2.028601 
      59       60.300000       2.057697 
      59       60.310000       2.086819 
      59       60.400000       2.057697 
      59       60.340000       2.028600 
      59       60.360000       2.058570 
      59       60.410000       2.097174 
      59       60.310000       2.100678 
      59       60.420000       2.083735 
      59       60.360000       2.061254 
      60       60.390000       2.055052 
      60       60.330000       2.042456 
      60       60.360000       2.063109 
      61       60.310000       2.098007 
