

 time    ||    gripping force   ||   raspberry measurement 

      0       0.140000       -802.957895 
      0       0.010000       -802.957895 
      0       0.110000       -802.957895 
      0       1.030000       -802.957895 
      0       0.620000       -802.957895 
      0       0.280000       -802.957895 
      0       0.870000       -802.957895 
      0       0.540000       -802.957895 
      0       0.480000       -802.957895 
      0       0.070000       -802.957895 
      0       0.360000       -802.957895 
      0       0.050000       -802.957895 
      0       0.070000       -802.957895 
      0       0.170000       -802.957890 
      0       0.340000       -802.957890 
      0       0.040000       -802.957890 
      1       1.380000       -802.957890 
      1       0.410000       -802.957890 
      1       9.090000       -802.957890 
      1       35.470000       -802.957890 
      1       54.080000       -802.957890 
      1       53.240000       -794.927131 
      1       58.870000       -786.871614 
      1       58.870000       -783.317701 
      1       57.740000       -740.021915 
      1       57.810000       -545.980622 
      1       57.560000       -226.049580 
      1       57.030000       -31.992590 
      1       56.840000       11.306271 
      1       56.780000       14.861179 
      1       56.560000       14.957160 
      1       56.310000       14.957160 
      1       56.250000       14.957160 
      1       56.010000       14.922195 
      1       55.990000       14.889421 
      1       55.890000       14.889421 
      1       55.740000       14.924040 
      1       55.700000       14.924040 
      1       55.650000       14.982210 
      1       55.510000       15.094889 
      1       55.460000       15.268198 
      1       55.410000       15.369583 
      1       55.410000       15.391636 
      1       55.340000       15.460601 
      2       55.340000       15.505505 
      2       55.220000       15.505505 
      2       55.280000       15.505921 
      2       55.140000       15.531491 
      2       55.090000       15.505421 
      2       55.060000       15.505421 
      2       55.010000       15.434686 
      2       54.970000       15.326630 
      2       55.000000       15.246855 
      2       54.970000       15.246855 
      2       54.890000       15.258538 
      2       54.910000       15.312177 
      2       54.880000       15.312177 
      2       54.840000       15.349483 
      2       54.820000       15.311707 
      2       54.820000       15.252226 
      2       54.730000       15.210960 
      2       54.660000       15.227073 
      2       54.730000       15.227073 
      2       54.700000       15.275967 
      2       54.680000       15.335045 
      2       54.700000       15.361084 
      2       54.680000       15.361084 
      2       54.580000       15.282624 
      2       54.650000       15.241914 
      2       54.590000       15.261099 
      2       54.600000       15.261099 
      2       54.510000       15.262507 
      2       54.570000       15.241831 
      2       54.510000       15.241831 
      3       54.510000       15.214989 
      3       54.510000       15.244515 
      3       54.460000       15.275479 
      3       54.440000       15.247159 
      3       54.460000       15.226686 
      3       54.410000       15.213493 
      3       54.410000       15.197116 
      3       54.450000       15.178125 
      3       54.330000       15.192577 
      3       54.410000       15.198792 
      3       54.420000       15.219888 
      3       54.420000       15.241401 
      3       54.340000       15.252611 
      3       54.400000       15.252611 
      3       54.360000       15.287138 
      3       54.290000       15.298321 
      3       54.350000       15.298321 
      3       54.300000       15.318948 
      3       54.300000       15.329246 
      3       54.280000       15.287080 
      3       54.240000       15.222173 
      3       54.290000       15.159771 
      3       54.240000       15.152266 
      3       54.280000       15.164200 
      3       54.320000       15.169748 
      3       54.170000       15.164630 
      3       54.250000       15.157195 
      3       54.220000       15.177682 
      3       54.210000       15.227099 
      4       54.200000       15.223849 
      4       54.250000       15.223849 
      4       54.220000       15.240598 
      4       54.230000       15.304067 
      4       54.230000       15.328856 
      4       54.170000       15.328856 
      4       54.230000       15.298322 
      4       54.190000       15.277282 
      4       54.210000       15.279523 
      4       54.160000       15.308176 
      4       54.150000       15.299636 
      4       54.120000       15.227488 
      4       54.080000       15.171507 
      4       54.110000       15.122574 
      4       54.110000       15.102061 
      4       54.100000       15.174138 
      4       54.050000       15.259242 
      4       54.130000       15.242272 
      4       54.090000       15.203264 
      4       54.110000       15.182638 
      4       54.100000       15.134297 
      4       54.090000       15.134297 
      4       54.050000       15.132003 
      4       54.070000       15.171024 
      4       54.020000       15.211291 
      4       54.050000       15.211291 
      4       54.040000       15.226159 
      4       54.020000       15.226159 
      4       54.050000       15.226159 
      5       54.030000       15.177655 
      5       53.980000       15.157195 
      5       54.020000       15.157195 
      5       54.010000       15.164629 
      5       54.090000       15.164629 
      5       54.040000       15.169734 
      5       54.000000       15.163743 
      5       54.030000       15.146410 
      5       54.000000       15.129718 
      5       54.020000       15.152226 
      5       54.000000       15.192936 
      5       54.000000       15.229729 
      5       54.060000       15.229729 
      5       53.960000       15.219821 
      5       54.060000       15.208260 
      5       53.970000       15.225633 
      5       53.980000       15.225633 
      5       53.950000       15.195221 
      5       53.980000       15.162954 
      5       53.990000       15.176823 
      5       54.000000       15.145428 
      5       53.970000       15.145428 
      5       54.010000       15.125358 
      5       54.010000       15.185282 
      5       53.940000       15.223900 
      5       53.890000       15.197865 
      5       54.020000       15.197865 
      5       53.950000       15.176410 
      5       53.980000       15.176410 
      6       54.060000       15.169652 
      6       53.950000       15.171937 
      6       53.970000       15.171937 
      6       53.960000       15.171937 
      6       53.950000       15.185340 
      6       53.990000       15.242755 
      6       53.930000       15.283882 
      6       53.990000       15.224360 
      6       53.930000       15.168769 
      6       53.930000       15.176796 
      6       53.970000       15.138726 
      6       53.880000       15.085380 
      6       53.930000       15.077323 
      6       53.930000       15.093876 
      6       53.890000       15.117217 
      6       53.920000       15.133774 
      6       53.920000       15.189365 
      6       53.890000       15.224317 
      6       53.950000       15.198321 
      6       53.920000       15.181782 
      6       53.880000       15.192922 
      6       53.970000       15.199703 
      6       53.910000       15.199703 
      6       53.910000       15.144959 
      6       53.860000       15.144959 
      6       53.940000       15.144959 
      6       53.890000       15.144959 
      6       53.900000       15.096218 
      7       53.930000       15.096218 
      7       53.930000       15.096218 
      7       53.930000       15.096218 
      7       53.890000       15.121647 
      7       53.950000       15.165181 
      7       53.820000       15.165181 
      7       53.880000       15.191580 
      7       53.920000       15.199663 
      7       53.910000       15.144958 
      7       53.860000       15.096218 
      7       53.900000       15.121688 
      7       53.880000       15.166538 
      7       53.910000       15.208663 
      7       53.860000       15.283026 
      7       53.880000       15.312149 
      7       53.940000       15.237786 
      7       53.860000       15.137401 
      7       53.890000       15.092122 
      7       53.920000       15.119915 
      7       53.930000       15.148998 
      7       53.940000       15.119875 
      7       53.900000       15.119875 
      7       53.880000       15.090792 
      7       53.860000       15.121217 
      7       53.860000       15.121217 
      7       53.830000       15.121217 
      7       53.830000       15.165625 
      7       53.860000       15.165625 
      7       53.860000       15.197449 
      8       53.920000       15.230146 
      8       53.830000       15.219848 
      8       53.830000       15.208703 
      8       53.910000       15.231032 
      8       53.900000       15.219444 
      8       53.870000       15.203708 
      8       53.890000       15.210918 
      8       53.860000       15.187967 
      8       53.860000       15.151340 
      8       53.860000       15.123875 
      8       53.840000       15.123875 
      8       53.920000       15.117231 
      8       53.840000       15.117231 
      8       53.940000       15.117231 
      8       53.870000       15.104205 
      8       53.870000       15.120331 
      8       53.820000       15.141414 
      8       53.860000       15.152572 
      8       53.890000       15.185835 
      8       53.830000       15.182997 
      8       53.850000       15.182997 
      8       53.950000       15.182997 
      8       53.770000       15.182997 
      8       53.830000       15.156765 
      8       53.900000       15.154332 
      8       53.850000       15.191730 
      8       53.890000       15.191730 
      8       53.880000       15.191730 
      8       53.870000       15.191730 
      9       53.760000       15.213050 
      9       53.860000       15.213050 
      9       53.850000       15.226672 
      9       53.780000       15.247172 
      9       53.810000       15.247172 
      9       53.880000       15.275895 
      9       53.770000       15.275895 
      9       53.840000       15.249001 
      9       53.900000       15.227515 
      9       53.790000       15.222989 
      9       53.830000       15.222989 
      9       53.870000       15.164296 
      9       53.850000       15.165669 
      9       53.830000       15.219348 
      9       53.880000       15.202374 
      9       53.820000       15.131090 
      9       53.820000       15.091222 
      9       53.860000       15.114959 
      9       53.840000       15.130656 
      9       53.870000       15.110033 
      9       53.800000       15.136489 
      9       53.820000       15.208190 
      9       53.850000       15.243115 
      9       53.840000       15.200190 
      9       53.820000       15.200190 
      9       53.870000       15.165156 
      9       53.800000       15.198392 
      9       53.840000       15.198392 
      9       53.810000       15.240901 
      9       53.850000       15.269207 
      10       53.820000       15.215765 
      10       53.860000       15.215765 
      10       53.810000       15.215765 
      10       53.870000       15.160836 
      10       53.840000       15.216221 
      10       53.800000       15.275023 
      10       53.840000       15.269597 
      10       53.760000       15.269597 
      10       53.810000       15.251229 
      10       53.800000       15.175051 
      10       53.790000       15.175051 
      10       53.820000       15.121758 
      10       53.820000       15.153542 
      10       53.820000       15.216690 
      10       53.780000       15.268281 
      10       53.800000       15.268281 
      10       53.840000       15.268281 
      10       53.820000       15.268281 
      10       53.830000       15.227834 
      10       53.910000       15.141498 
      10       53.790000       15.111350 
      10       53.750000       15.141468 
      10       53.950000       15.141468 
      10       53.830000       15.163327 
      10       53.760000       15.170138 
      10       53.920000       15.169168 
      10       53.740000       15.171454 
      10       53.760000       15.171454 
      10       53.830000       15.171454 
      11       53.890000       15.171454 
      11       53.830000       15.171454 
      11       53.860000       15.179107 
      11       53.860000       15.209519 
      11       53.820000       15.216747 
      11       53.850000       15.211791 
      11       53.810000       15.211791 
      11       53.820000       15.251296 
      11       53.840000       15.235046 
      11       53.820000       15.206076 
      11       53.820000       15.268229 
      11       53.810000       15.322957 
      11       53.780000       15.238673 
      11       53.810000       15.137459 
      11       53.850000       15.156710 
      11       53.820000       15.220731 
      11       53.800000       15.220731 
      11       53.810000       15.220731 
      11       53.740000       15.229343 
      11       53.830000       15.252075 
      11       53.850000       15.290707 
      11       53.800000       15.236414 
      11       53.820000       15.163911 
      11       53.830000       15.163911 
      11       53.860000       15.146371 
      11       53.790000       15.214489 
      11       53.830000       15.269181 
      11       53.800000       15.241316 
      11       53.740000       15.202878 
      11       53.920000       15.177669 
      12       53.820000       15.180932 
      12       53.750000       15.180932 
      12       53.830000       15.140446 
      12       53.890000       15.140446 
      12       53.780000       15.101147 
      12       53.800000       15.144515 
      12       53.840000       15.189335 
      12       53.800000       15.149042 
      12       53.770000       15.115432 
      12       53.810000       15.142744 
      12       53.840000       15.173721 
      12       53.750000       15.214006 
      12       53.830000       15.235102 
      12       53.850000       15.222519 
      12       53.830000       15.216317 
      12       53.800000       15.193836 
      12       53.740000       15.176880 
      12       53.820000       15.179967 
      12       53.890000       15.214059 
      12       53.750000       15.214059 
      12       53.850000       15.230590 
      12       53.800000       15.208717 
      12       53.830000       15.220734 
      12       53.820000       15.240970 
      12       53.840000       15.246716 
      12       53.780000       15.255768 
      12       53.820000       15.212607 
      12       53.800000       15.157182 
      12       53.780000       15.129275 
      13       53.860000       15.129275 
      13       53.850000       15.136055 
      13       53.770000       15.136055 
      13       53.860000       15.136055 
      13       53.800000       15.120332 
      13       53.820000       15.120332 
      13       53.840000       15.109577 
      13       53.760000       15.140958 
      13       53.810000       15.157471 
      13       53.800000       15.140098 
      13       53.850000       15.099678 
      13       53.790000       15.083178 
      13       53.830000       15.110007 
      13       53.760000       15.110007 
      13       53.790000       15.110007 
      13       53.790000       15.183106 
      13       53.780000       15.183106 
      13       53.830000       15.213492 
      13       53.770000       15.154440 
      13       53.790000       15.154440 
      13       53.840000       15.115875 
      13       53.810000       15.142757 
      13       53.840000       15.173681 
      13       53.850000       15.212676 
      13       53.820000       15.212676 
      13       53.810000       15.218905 
      13       53.780000       15.149954 
      13       53.790000       15.097494 
      13       53.770000       15.131143 
      13       53.870000       15.197835 
      14       53.800000       15.204606 
      14       53.880000       15.157528 
      14       53.840000       15.141884 
      14       53.820000       15.121674 
      14       53.830000       15.120388 
      14       53.850000       15.189365 
      14       53.860000       15.237716 
      14       53.810000       15.237716 
      14       53.860000       15.194335 
      14       53.770000       15.140086 
      14       53.790000       15.140086 
      14       53.840000       15.148612 
      14       53.820000       15.179967 
      14       53.740000       15.179967 
      14       53.760000       15.179967 
      14       53.870000       15.242313 
      14       53.830000       15.283882 
      14       53.800000       15.224803 
      14       53.870000       15.174168 
      14       53.800000       15.201033 
      14       53.830000       15.201033 
      14       53.810000       15.201033 
      14       53.830000       15.201033 
      14       53.770000       15.201033 
      14       53.800000       15.179950 
      14       53.840000       15.125788 
      14       53.810000       15.155730 
      14       53.800000       15.155730 
      14       53.900000       15.218488 
      15       53.820000       15.202361 
      15       53.790000       15.131546 
      15       53.820000       15.097091 
      15       53.790000       15.145468 
      15       53.760000       15.206419 
      15       53.870000       15.232847 
      15       53.780000       15.232847 
      15       53.770000       15.232847 
      15       53.870000       15.288008 
      15       53.760000       15.308079 
      15       53.750000       15.308079 
      15       53.810000       15.308079 
      15       53.810000       15.308079 
      15       53.830000       15.224400 
      15       53.780000       15.145888 
      15       53.810000       15.147283 
      15       53.820000       15.157968 
      15       53.790000       15.141038 
      15       53.850000       15.111793 
      15       53.790000       15.147353 
      15       53.750000       15.257873 
      15       53.740000       15.257873 
      15       53.890000       15.257873 
      15       53.770000       15.337771 
      15       53.700000       15.304978 
      15       53.820000       15.223046 
      15       53.770000       15.152227 
      15       53.740000       15.152227 
      15       53.770000       15.185849 
      15       53.830000       15.270040 
      16       53.730000       15.270040 
      16       53.840000       15.270040 
      16       53.720000       15.279895 
      16       53.710000       15.234659 
      16       53.880000       15.151231 
      16       53.800000       15.151231 
      16       53.730000       15.096271 
      16       53.950000       15.096271 
      16       53.850000       15.117149 
      16       53.720000       15.151810 
      16       53.840000       15.200993 
      16       53.860000       15.200993 
      16       53.780000       15.266926 
      16       53.780000       15.246716 
      16       53.840000       15.229813 
      16       53.760000       15.232348 
      16       53.720000       15.232348 
      16       53.820000       15.214129 
      16       53.820000       15.244086 
      16       53.760000       15.271396 
      16       53.810000       15.238756 
      16       53.850000       15.255286 
      16       53.740000       15.300106 
      16       53.820000       15.286664 
      16       53.880000       15.246786 
      16       53.740000       15.209993 
      16       53.760000       15.219028 
      16       53.890000       15.219028 
      16       53.830000       15.220248 
      16       53.720000       15.160283 
      17       53.870000       15.139200 
      17       53.820000       15.171840 
      17       53.780000       15.149082 
      17       53.860000       15.149082 
      17       53.790000       15.134257 
      17       53.750000       15.164283 
      17       53.800000       15.188037 
      17       53.800000       15.263825 
      17       53.830000       15.308092 
      17       53.800000       15.249014 
      17       53.840000       15.249014 
      17       53.840000       15.195748 
      17       53.820000       15.211306 
      17       53.790000       15.222213 
      17       53.840000       15.236861 
      17       53.860000       15.236861 
      17       53.800000       15.301478 
      17       53.820000       15.301478 
      17       53.830000       15.300022 
      17       53.760000       15.300022 
      17       53.830000       15.300022 
      17       53.840000       15.240071 
      17       53.770000       15.156200 
      17       53.800000       15.156200 
      17       53.790000       15.110543 
      17       53.780000       15.110543 
      17       53.840000       15.118547 
      17       53.860000       15.133357 
      17       53.710000       15.183510 
      17       53.740000       15.183510 
      18       53.840000       15.183510 
      18       53.800000       15.183510 
      18       53.800000       15.183510 
      18       53.870000       15.194250 
      18       53.830000       15.127931 
      18       53.720000       15.082266 
      18       53.830000       15.082266 
      18       53.790000       15.070095 
      18       53.740000       15.071507 
      18       53.790000       15.071507 
      18       53.880000       15.071507 
      18       53.780000       15.079954 
      18       53.800000       15.118988 
      18       53.860000       15.148944 
      18       53.760000       15.119015 
      18       53.790000       15.119015 
      18       53.830000       15.119015 
      18       53.830000       15.080854 
      18       53.720000       15.080854 
      18       53.910000       15.080854 
      18       53.790000       15.082735 
      18       53.730000       15.123419 
      18       53.840000       15.180006 
      18       53.750000       15.182541 
      18       53.820000       15.182541 
      18       53.860000       15.182541 
      18       53.790000       15.156738 
      18       53.810000       15.153888 
      18       53.830000       15.186318 
      19       53.790000       15.186318 
      19       53.740000       15.188397 
      19       53.810000       15.180949 
      19       53.870000       15.193782 
      19       53.750000       15.210501 
      19       53.830000       15.193353 
      19       53.860000       15.176033 
      19       53.740000       15.176033 
      19       53.860000       15.170928 
      19       53.820000       15.186805 
      19       53.790000       15.241774 
      19       53.720000       15.291163 
      19       53.860000       15.252545 
      19       53.800000       15.235185 
      19       53.750000       15.235185 
      19       53.850000       15.235185 
      19       53.840000       15.235185 
      19       53.810000       15.250274 
      19       53.810000       15.219042 
      19       53.820000       15.180411 
      19       53.730000       15.177309 
      19       53.810000       15.198348 
      19       53.810000       15.229717 
      19       53.760000       15.214046 
      19       53.830000       15.214046 
      19       53.780000       15.180423 
      19       53.840000       15.182682 
      19       53.800000       15.182682 
      19       53.790000       15.222116 
      20       53.820000       15.264654 
      20       53.800000       15.264654 
      20       53.790000       15.264654 
      20       53.830000       15.264654 
      20       53.780000       15.264654 
      20       53.800000       15.219391 
      20       53.830000       15.168313 
      20       53.790000       15.168313 
      20       53.830000       15.175923 
      20       53.820000       15.128828 
      20       53.760000       15.128828 
      20       53.830000       15.048241 
      20       53.810000       15.051784 
      20       53.800000       15.155296 
      20       53.870000       15.223861 
      20       53.830000       15.226575 
      20       53.780000       15.235545 
      20       53.820000       15.215361 
      20       53.780000       15.190335 
      20       53.850000       15.190335 
      20       53.810000       15.219835 
      20       53.830000       15.219835 
      20       53.810000       15.248097 
      20       53.790000       15.208620 
      20       53.840000       15.136502 
      20       53.790000       15.110060 
      20       53.830000       15.110060 
      20       53.840000       15.131529 
      20       53.850000       15.131529 
      21       53.870000       15.125274 
      21       53.840000       15.132888 
      21       53.850000       15.170510 
      21       53.800000       15.139156 
      21       53.820000       15.096634 
      21       53.780000       15.131989 
      21       53.790000       15.208176 
      21       53.860000       15.247172 
      21       53.790000       15.208190 
      21       53.820000       15.132446 
      21       53.870000       15.102503 
      21       53.760000       15.169639 
      21       53.830000       15.169639 
      21       53.830000       15.245440 
      21       53.830000       15.246689 
      21       53.800000       15.250412 
      21       53.850000       15.252931 
      21       53.810000       15.215927 
      21       53.750000       15.159731 
      21       53.820000       15.159731 
      21       53.890000       15.157209 
      21       53.810000       15.183051 
      21       53.810000       15.187191 
      21       53.830000       15.169669 
      21       53.820000       15.225274 
      21       53.790000       15.294707 
      21       53.810000       15.292022 
      21       53.780000       15.292022 
      21       53.800000       15.292022 
      21       53.850000       15.275469 
      22       53.850000       15.262856 
      22       53.870000       15.229756 
      22       53.770000       15.150815 
      22       53.790000       15.096701 
      22       53.860000       15.122561 
      22       53.830000       15.176436 
      22       53.760000       15.245829 
      22       53.820000       15.309464 
      22       53.820000       15.261983 
      22       53.720000       15.185379 
      22       53.790000       15.153972 
      22       53.850000       15.158025 
      22       53.750000       15.199704 
      22       53.820000       15.179937 
      22       53.830000       15.179937 
      22       53.840000       15.126660 
      22       53.800000       15.166111 
      22       53.830000       15.262356 
      22       53.770000       15.262356 
      22       53.880000       15.268281 
      22       53.820000       15.268281 
      22       53.810000       15.182141 
      22       53.860000       15.128015 
      22       53.820000       15.094749 
      22       53.860000       15.076921 
      22       53.780000       15.076921 
      22       53.830000       15.076921 
      22       53.870000       15.080465 
      22       53.860000       15.080465 
      23       53.820000       15.121258 
      23       53.880000       15.177296 
      23       53.840000       15.257057 
      23       53.760000       15.362841 
      23       53.850000       15.361429 
      23       53.780000       15.259382 
      23       53.790000       15.186656 
      23       53.840000       15.171077 
      23       53.870000       15.158398 
      23       53.760000       15.158398 
      23       53.840000       15.122200 
      23       53.820000       15.122200 
      23       53.810000       15.122200 
      23       53.810000       15.122200 
      23       53.750000       15.122200 
      23       53.780000       15.089367 
      23       53.760000       15.089367 
      23       53.890000       15.122173 
      23       53.840000       15.157471 
      23       53.780000       15.158950 
      23       53.800000       15.122077 
      23       53.790000       15.107419 
      23       53.800000       15.197865 
      23       53.880000       15.292891 
      23       53.840000       15.232844 
      23       53.770000       15.137915 
      23       53.760000       15.168340 
      23       53.810000       15.278594 
      23       53.790000       15.341342 
      23       53.860000       15.341342 
      23       53.860000       15.341342 
      24       53.800000       15.341342 
      24       53.800000       15.308123 
      24       53.890000       15.308123 
      24       53.830000       15.236058 
      24       53.810000       15.236058 
      24       53.820000       15.205064 
      24       53.830000       15.211402 
      24       53.800000       15.211402 
      24       53.840000       15.211402 
      24       53.830000       15.193406 
      24       53.850000       15.176866 
      24       53.810000       15.179940 
      24       53.740000       15.179940 
      24       53.750000       15.213146 
      24       53.760000       15.218918 
      24       53.880000       15.149928 
      24       53.830000       15.096634 
      24       53.740000       15.121218 
      24       53.870000       15.159823 
      24       53.880000       15.168712 
      24       53.770000       15.168712 
      24       53.820000       15.175966 
      24       53.830000       15.193339 
      24       53.790000       15.210045 
      24       53.880000       15.210045 
      24       53.830000       15.187953 
      24       53.820000       15.151796 
      24       53.760000       15.129731 
      25       53.810000       15.129731 
      25       53.820000       15.147297 
      25       53.800000       15.174555 
      25       53.870000       15.174555 
      25       53.850000       15.218559 
      25       53.930000       15.249414 
      25       53.800000       15.225716 
      25       53.830000       15.220348 
      25       53.780000       15.283966 
      25       53.780000       15.283966 
      25       53.830000       15.283966 
      25       53.830000       15.313089 
      25       53.830000       15.249498 
      25       53.810000       15.197494 
      25       53.760000       15.231546 
      25       53.840000       15.301891 
      25       53.830000       15.312176 
      25       53.780000       15.219848 
      25       53.840000       15.126701 
      25       53.850000       15.126701 
      25       53.790000       15.127530 
      25       53.820000       15.166122 
      25       53.780000       15.166122 
      25       53.830000       15.198336 
      25       53.780000       15.240528 
      25       53.850000       15.263742 
      25       53.850000       15.275510 
      25       53.840000       15.292493 
      25       53.740000       15.301006 
      25       53.780000       15.260699 
      26       53.870000       15.262940 
      26       53.820000       15.310834 
      26       53.770000       15.262453 
      26       53.800000       15.262453 
      26       53.810000       15.190349 
      26       53.840000       15.173226 
      26       53.780000       15.179550 
      26       53.850000       15.213147 
      26       53.850000       15.219401 
      26       53.820000       15.156669 
      26       53.810000       15.156669 
      26       53.850000       15.137459 
      26       53.870000       15.238673 
      26       53.850000       15.322943 
      26       53.890000       15.267799 
      26       53.880000       15.267799 
      26       53.820000       15.201080 
      26       53.840000       15.214905 
      26       53.870000       15.218971 
      26       53.870000       15.149928 
      26       53.800000       15.149928 
      26       53.840000       15.096648 
      26       53.860000       15.121674 
      26       53.890000       15.165638 
      26       53.860000       15.165638 
      26       53.800000       15.197435 
      26       53.870000       15.197435 
      26       53.810000       15.197435 
      26       53.850000       15.197435 
      26       53.850000       15.229689 
      27       53.820000       15.214032 
      27       53.870000       15.179980 
      27       53.880000       15.177323 
      27       53.850000       15.199221 
      27       53.760000       15.240058 
      27       53.830000       15.256557 
      27       53.810000       15.229259 
      27       53.810000       15.149914 
      27       53.850000       15.085836 
      27       53.870000       15.071951 
      27       53.770000       15.069652 
      27       53.860000       15.076450 
      27       53.880000       15.076450 
      27       53.780000       15.076450 
      27       53.870000       15.099208 
      27       53.870000       15.140541 
      27       53.750000       15.163326 
      27       53.790000       15.170997 
      27       53.810000       15.179054 
      27       53.840000       15.208203 
      27       53.850000       15.201006 
      27       53.850000       15.145028 
      27       53.800000       15.160700 
      27       53.770000       15.160700 
      27       53.850000       15.218971 
      27       53.850000       15.204121 
      27       53.760000       15.152283 
      27       53.820000       15.183954 
      27       53.770000       15.266966 
      27       53.790000       15.266966 
      28       53.800000       15.265084 
      28       53.840000       15.265084 
      28       53.800000       15.245457 
      28       53.780000       15.215335 
      28       53.850000       15.179604 
      28       53.840000       15.172770 
      28       53.820000       15.184507 
      28       53.820000       15.232844 
      28       53.850000       15.246286 
      28       53.840000       15.192966 
      28       53.850000       15.200190 
      28       53.800000       15.215305 
      28       53.800000       15.160310 
      28       53.870000       15.145029 
      28       53.830000       15.145029 
      28       53.880000       15.145029 
      28       53.790000       15.201449 
      28       53.800000       15.213576 
      28       53.900000       15.213576 
      28       53.860000       15.213576 
      28       53.850000       15.213576 
      28       53.850000       15.213576 
      28       53.820000       15.213576 
      28       53.800000       15.202418 
      28       53.810000       15.202418 
      28       53.860000       15.202418 
      28       53.830000       15.201892 
      28       53.840000       15.201892 
      29       53.790000       15.161625 
      29       53.840000       15.174195 
      29       53.780000       15.265071 
      29       53.810000       15.271851 
      29       53.790000       15.203264 
      29       53.830000       15.203264 
      29       53.860000       15.153072 
      29       53.830000       15.153072 
      29       53.850000       15.153072 
      29       53.760000       15.128885 
      29       53.870000       15.128885 
      29       53.890000       15.136486 
      29       53.820000       15.136486 
      29       53.850000       15.125731 
      29       53.830000       15.133787 
      29       53.850000       15.181308 
      29       53.840000       15.187510 
      29       53.880000       15.175080 
      29       53.820000       15.163756 
      29       53.870000       15.141427 
      29       53.860000       15.109577 
      29       53.780000       15.109577 
      29       53.860000       15.109577 
      29       53.800000       15.109577 
      29       53.780000       15.119901 
      29       53.820000       15.131059 
      29       53.930000       15.109160 
      29       53.840000       15.125731 
      29       53.770000       15.161112 
      30       53.890000       15.179081 
      30       53.830000       15.218962 
      30       53.770000       15.248984 
      30       53.840000       15.220331 
      30       53.850000       15.196634 
      30       53.830000       15.196634 
      30       53.820000       15.196634 
      30       53.810000       15.196634 
      30       53.800000       15.196634 
      30       53.780000       15.196634 
      30       53.870000       15.250787 
      30       53.900000       15.328803 
      30       53.810000       15.349815 
      30       53.790000       15.299207 
      30       53.850000       15.180880 
      30       53.800000       15.103376 
      30       53.820000       15.131586 
      30       53.870000       15.197392 
      30       53.850000       15.198791 
      30       53.800000       15.198791 
      30       53.850000       15.128805 
      30       53.870000       15.088134 
      30       53.810000       15.100108 
      30       53.850000       15.140125 
      30       53.830000       15.157888 
      30       53.860000       15.145510 
      30       53.830000       15.124278 
      30       53.800000       15.127156 
      30       53.860000       15.142687 
      30       53.850000       15.162537 
      31       53.860000       15.158844 
      31       53.850000       15.158844 
      31       53.820000       15.199747 
      31       53.840000       15.243961 
      31       53.850000       15.243961 
      31       53.830000       15.218102 
      31       53.810000       15.174112 
      31       53.800000       15.142341 
      31       53.870000       15.110987 
      31       53.810000       15.110987 
      31       53.830000       15.137872 
      31       53.850000       15.225247 
      31       53.800000       15.325605 
      31       53.800000       15.325605 
      31       53.840000       15.356999 
      31       53.810000       15.262843 
      31       53.820000       15.147783 
      31       53.820000       15.147783 
      31       53.840000       15.147783 
      31       53.800000       15.111820 
      31       53.880000       15.141508 
      31       53.800000       15.164200 
      31       53.830000       15.164200 
      31       53.860000       15.180506 
      31       53.810000       15.212593 
      31       53.810000       15.232014 
      31       53.850000       15.206835 
      31       53.920000       15.206835 
      31       53.850000       15.216774 
      32       53.890000       15.216774 
      32       53.810000       15.215362 
      32       53.860000       15.209160 
      32       53.860000       15.241375 
      32       53.840000       15.262466 
      32       53.780000       15.262466 
      32       53.860000       15.262466 
      32       53.860000       15.260199 
      32       53.880000       15.230673 
      32       53.840000       15.228818 
      32       53.840000       15.256668 
      32       53.790000       15.241773 
      32       53.820000       15.221287 
      32       53.890000       15.194266 
      32       53.850000       15.176906 
      32       53.880000       15.180397 
      32       53.900000       15.218975 
      32       53.840000       15.218975 
      32       53.850000       15.248071 
      32       53.860000       15.208646 
      32       53.790000       15.137402 
      32       53.900000       15.121289 
      32       53.920000       15.184933 
      32       53.830000       15.225634 
      32       53.860000       15.225634 
      32       53.910000       15.218602 
      32       53.920000       15.218602 
      32       53.850000       15.263273 
      32       53.880000       15.291163 
      32       53.830000       15.231019 
      33       53.810000       15.202462 
      33       53.870000       15.183441 
      33       53.870000       15.145551 
      33       53.860000       15.100122 
      33       53.880000       15.083232 
      33       53.820000       15.111336 
      33       53.800000       15.199304 
      33       53.840000       15.199304 
      33       53.840000       15.286083 
      33       53.860000       15.274136 
      33       53.870000       15.188870 
      33       53.840000       15.163037 
      33       53.860000       15.163037 
      33       53.860000       15.183468 
      33       53.820000       15.185888 
      33       53.840000       15.153902 
      33       53.820000       15.157625 
      33       53.880000       15.193392 
      33       53.790000       15.230159 
      33       53.830000       15.224347 
      33       53.840000       15.222089 
      33       53.840000       15.222129 
      33       53.890000       15.159771 
      33       53.900000       15.152323 
      33       53.800000       15.229634 
      33       53.840000       15.280032 
      33       53.810000       15.277172 
      33       53.850000       15.296645 
      33       53.850000       15.308054 
      34       53.890000       15.301145 
      34       53.860000       15.290611 
      34       53.850000       15.272835 
      34       53.860000       15.189354 
      34       53.830000       15.171135 
      34       53.890000       15.221174 
      34       53.840000       15.220371 
      34       53.900000       15.220371 
      34       53.900000       15.225734 
      34       53.860000       15.313522 
      34       53.850000       15.313522 
      34       53.870000       15.376280 
      34       53.870000       15.302308 
      34       53.860000       15.171981 
      34       53.870000       15.117675 
      34       53.860000       15.147794 
      34       53.890000       15.193837 
      34       53.910000       15.245497 
      34       53.880000       15.287913 
      34       53.860000       15.314974 
      34       53.850000       15.314974 
      34       53.850000       15.311707 
      34       53.850000       15.286707 
      34       53.870000       15.234190 
      34       53.910000       15.224414 
      34       53.850000       15.220221 
      34       53.890000       15.154010 
      34       53.790000       15.104178 
      34       53.880000       15.082719 
      35       53.900000       15.036070 
      35       53.890000       15.036070 
      35       53.870000       15.053639 
      35       53.920000       15.169129 
      35       53.860000       15.286662 
      35       53.850000       15.286662 
      35       53.900000       15.291469 
      35       53.880000       15.210975 
      35       53.860000       15.165599 
      35       53.890000       15.193073 
      35       53.830000       15.218476 
      35       53.900000       15.250870 
      35       53.860000       15.287053 
      35       53.820000       15.299676 
      35       53.820000       15.299676 
      35       53.850000       15.249914 
      35       53.880000       15.215459 
      35       53.880000       15.215459 
      35       53.850000       15.215459 
      35       53.870000       15.215459 
      35       53.840000       15.242757 
      35       53.840000       15.274125 
      35       53.940000       15.274125 
      35       53.920000       15.274125 
      35       53.870000       15.274125 
      35       53.860000       15.318088 
      35       53.880000       15.343518 
      35       53.900000       15.294348 
      35       53.880000       15.234660 
      36       53.810000       15.223046 
      36       53.900000       15.222572 
      36       53.860000       15.230173 
      36       53.870000       15.195638 
      36       53.860000       15.162967 
      36       53.920000       15.176823 
      36       53.900000       15.145428 
      36       53.860000       15.145428 
      36       53.900000       15.125331 
      36       53.920000       15.184423 
      36       53.840000       15.213962 
      36       53.870000       15.159437 
      36       53.850000       15.136003 
      36       53.880000       15.174651 
      36       53.930000       15.230602 
      36       53.860000       15.314434 
      36       53.860000       15.296881 
      36       53.890000       15.208273 
      36       53.910000       15.149016 
      36       53.840000       15.115942 
      36       53.920000       15.150371 
      36       53.850000       15.205063 
      36       53.850000       15.210874 
      36       53.870000       15.187607 
      36       53.890000       15.146358 
      36       53.870000       15.146358 
      36       53.880000       15.190335 
      36       53.820000       15.288825 
      36       53.880000       15.295592 
      36       53.880000       15.218962 
      37       53.880000       15.132446 
      37       53.880000       15.091718 
      37       53.800000       15.120775 
      37       53.870000       15.120775 
      37       53.890000       15.120775 
      37       53.890000       15.159366 
      37       53.910000       15.159366 
      37       53.880000       15.163300 
      37       53.860000       15.151313 
      37       53.880000       15.151313 
      37       53.910000       15.151313 
      37       53.900000       15.147629 
      37       53.890000       15.157112 
      37       53.860000       15.128402 
      37       53.870000       15.125744 
      37       53.880000       15.142287 
      37       53.910000       15.142287 
      37       53.870000       15.157567 
      37       53.890000       15.205479 
      37       53.860000       15.205479 
      37       53.910000       15.208176 
      37       53.900000       15.173682 
      37       53.860000       15.147284 
      37       53.900000       15.130201 
      37       53.790000       15.158069 
      37       53.910000       15.222532 
      37       53.890000       15.293807 
      37       53.910000       15.283509 
      37       53.890000       15.233773 
      38       53.940000       15.223033 
      38       53.910000       15.223002 
      38       53.890000       15.223002 
      38       53.920000       15.235155 
      38       53.840000       15.215322 
      38       53.880000       15.189449 
      38       53.870000       15.209090 
      38       53.930000       15.201476 
      38       53.930000       15.150414 
      38       53.900000       15.184466 
      38       53.950000       15.253869 
      38       53.880000       15.208190 
      38       53.880000       15.125748 
      38       53.910000       15.125748 
      38       53.900000       15.126173 
      38       53.940000       15.149898 
      38       53.860000       15.124871 
      38       53.890000       15.110450 
      38       53.920000       15.146840 
      38       53.900000       15.188007 
      38       53.870000       15.216734 
      38       53.940000       15.232847 
      38       53.880000       15.277694 
      38       53.880000       15.265541 
      38       53.930000       15.174638 
      38       53.930000       15.166542 
      38       53.860000       15.166542 
      38       53.960000       15.219388 
      38       53.970000       15.202831 
      39       53.910000       15.202831 
      39       53.910000       15.202831 
      39       53.880000       15.136932 
      39       53.940000       15.136932 
      39       53.880000       15.136932 
      39       53.930000       15.136932 
      39       53.900000       15.120832 
      39       53.910000       15.179520 
      39       53.850000       15.201006 
      39       53.900000       15.201006 
      39       53.900000       15.173739 
      39       53.950000       15.219875 
      39       53.910000       15.219875 
      39       53.860000       15.265997 
      39       53.880000       15.265997 
      39       53.890000       15.265997 
      39       53.910000       15.238273 
      39       53.940000       15.253984 
      39       53.960000       15.253984 
      39       53.920000       15.285225 
      39       53.870000       15.229827 
      39       53.950000       15.194310 
      39       53.850000       15.233370 
      39       53.970000       15.242216 
      39       53.880000       15.249984 
      39       53.920000       15.252514 
      39       53.880000       15.211818 
      39       53.870000       15.150428 
      39       53.940000       15.150428 
      39       53.920000       15.174608 
      40       53.900000       15.217133 
      40       53.940000       15.186721 
      40       53.920000       15.195234 
      40       53.870000       15.195234 
      40       53.980000       15.202309 
      40       53.920000       15.173349 
      40       53.890000       15.214879 
      40       54.000000       15.245883 
      40       53.880000       15.206835 
      40       53.940000       15.202932 
      40       53.960000       15.213963 
      40       53.900000       15.227182 
      40       53.890000       15.253875 
      40       53.960000       15.315417 
      40       53.900000       15.351158 
      40       53.890000       15.329273 
      40       53.900000       15.255770 
      40       53.910000       15.216345 
      40       53.920000       15.247687 
      40       53.970000       15.291620 
      40       53.840000       15.318448 
      40       53.930000       15.318448 
      40       53.930000       15.265128 
      40       53.850000       15.192993 
      40       53.950000       15.182222 
      40       54.020000       15.140029 
      40       53.830000       15.095319 
      40       53.900000       15.115362 
      40       53.950000       15.130643 
      41       53.940000       15.109174 
      41       53.910000       15.109174 
      41       53.980000       15.126617 
      41       53.840000       15.171897 
      41       53.910000       15.171897 
      41       54.040000       15.227045 
      41       53.860000       15.293781 
      41       53.900000       15.278123 
      41       53.940000       15.209550 
      41       53.930000       15.182292 
      41       53.840000       15.189310 
      41       53.940000       15.196687 
      41       53.980000       15.197353 
      41       53.830000       15.218615 
      41       53.910000       15.226063 
      41       54.000000       15.255782 
      41       53.900000       15.233690 
      41       53.920000       15.233690 
      41       53.910000       15.184506 
      41       53.890000       15.171897 
      41       53.910000       15.171897 
      41       53.980000       15.169195 
      41       53.870000       15.170608 
      41       53.890000       15.169612 
      41       53.900000       15.176450 
      41       53.900000       15.199208 
      41       53.950000       15.240501 
      41       53.900000       15.261970 
      41       53.910000       15.253953 
      41       53.890000       15.196980 
      41       53.920000       15.196980 
      42       53.990000       15.155854 
      42       53.930000       15.214946 
      42       53.920000       15.265581 
      42       53.940000       15.238756 
      42       53.960000       15.261116 
      42       53.890000       15.329729 
      42       53.900000       15.351641 
      42       53.900000       15.321663 
      42       53.850000       15.287567 
      42       53.940000       15.300120 
      42       53.980000       15.254827 
      42       53.920000       15.169253 
      42       53.820000       15.153113 
      42       53.930000       15.164280 
      42       53.900000       15.171534 
      42       53.940000       15.186696 
      42       53.970000       15.260269 
      42       53.890000       15.372254 
      42       53.950000       15.412122 
      42       53.960000       15.347685 
      42       53.950000       15.275454 
      42       53.900000       15.229358 
      42       53.920000       15.218117 
      42       53.940000       15.275493 
      42       53.890000       15.274027 
      42       53.990000       15.274027 
      42       53.890000       15.218602 
      42       53.940000       15.214905 
      42       53.940000       15.201462 
      43       54.000000       15.144156 
      43       53.920000       15.149928 
      43       53.900000       15.171436 
      43       53.960000       15.134231 
      43       53.930000       15.141028 
      43       53.910000       15.198695 
      43       53.940000       15.204699 
      43       53.930000       15.159744 
      43       53.920000       15.168840 
      43       53.860000       15.168840 
      43       53.930000       15.241343 
      43       53.950000       15.304119 
      43       53.910000       15.243655 
      43       53.900000       15.176397 
      43       53.930000       15.176397 
      43       53.880000       15.176397 
      43       53.860000       15.209620 
      43       53.890000       15.283936 
      43       53.900000       15.283936 
      43       53.920000       15.325256 
      43       53.910000       15.230121 
      43       53.900000       15.177476 
      43       53.920000       15.281199 
      43       53.960000       15.362935 
      43       53.890000       15.340391 
      43       53.950000       15.297035 
      43       53.950000       15.297035 
      43       53.930000       15.248502 
      43       53.960000       15.221770 
      43       53.960000       15.194253 
      44       53.910000       15.176033 
      44       53.910000       15.170042 
      44       53.950000       15.176020 
      44       53.890000       15.193809 
      44       53.940000       15.193809 
      44       54.020000       15.193809 
      44       53.890000       15.216317 
      44       53.950000       15.222519 
      44       53.950000       15.235115 
      44       53.890000       15.214462 
      44       53.900000       15.179577 
      44       53.950000       15.172783 
      44       53.900000       15.172783 
      44       53.870000       15.184950 
      44       53.970000       15.238256 
      44       53.950000       15.270940 
      44       53.910000       15.238716 
      44       53.920000       15.254427 
      44       53.960000       15.290181 
      44       53.900000       15.248585 
      44       53.930000       15.208691 
      44       53.960000       15.201946 
      44       53.970000       15.157113 
      44       53.890000       15.160353 
      44       53.980000       15.268212 
      44       53.980000       15.268212 
      44       53.850000       15.304576 
      44       53.960000       15.304576 
      44       53.930000       15.222616 
      44       53.900000       15.213607 
      45       53.940000       15.266068 
      45       53.930000       15.310445 
      45       53.910000       15.321620 
      45       53.970000       15.263826 
      45       53.880000       15.260699 
      45       53.950000       15.300146 
      45       53.960000       15.300146 
      45       53.940000       15.282581 
      45       53.910000       15.282581 
      45       53.880000       15.237914 
      45       53.980000       15.232375 
      45       53.990000       15.232375 
      45       53.900000       15.272875 
      45       53.970000       15.248959 
      45       53.980000       15.251840 
      45       53.920000       15.251840 
      45       53.890000       15.251840 
      45       53.960000       15.251840 
      45       53.930000       15.333690 
      45       53.960000       15.388475 
      45       53.930000       15.349874 
      45       53.930000       15.325290 
      45       53.990000       15.378567 
      45       53.930000       15.378567 
      45       53.890000       15.383479 
      45       53.910000       15.284453 
      45       53.950000       15.220375 
      45       53.980000       15.226117 
      45       53.990000       15.189889 
      46       53.910000       15.140086 
      46       53.880000       15.153099 
      46       53.950000       15.153099 
      46       53.960000       15.192976 
      46       53.950000       15.192976 
      46       53.930000       15.230186 
      46       53.920000       15.230186 
      46       53.930000       15.230186 
      46       54.040000       15.225677 
      46       53.950000       15.225677 
      46       53.920000       15.238286 
      46       54.000000       15.294720 
      46       53.920000       15.279453 
      46       53.930000       15.224914 
      46       53.990000       15.245804 
      46       53.910000       15.280435 
      46       53.990000       15.280435 
      46       53.980000       15.265111 
      46       53.940000       15.232888 
      46       53.960000       15.232888 
      46       53.910000       15.164753 
      46       53.960000       15.164753 
      46       53.900000       15.164753 
      46       53.940000       15.161639 
      46       53.960000       15.211818 
      46       53.980000       15.211818 
      46       53.900000       15.241343 
      46       53.910000       15.261128 
      46       54.010000       15.261128 
      47       53.950000       15.241316 
      47       53.940000       15.241316 
      47       53.950000       15.210932 
      47       53.920000       15.150828 
      47       53.980000       15.115916 
      47       53.940000       15.147754 
      47       53.960000       15.147754 
      47       53.930000       15.194266 
      47       53.920000       15.250426 
      47       53.900000       15.305811 
      47       53.950000       15.319443 
      47       53.890000       15.242647 
      47       53.910000       15.168906 
      47       53.970000       15.168906 
      47       53.990000       15.160644 
      47       53.960000       15.215955 
      47       53.930000       15.252958 
      47       53.950000       15.251313 
      47       53.960000       15.251313 
      47       53.890000       15.257971 
      47       53.970000       15.257971 
      47       53.960000       15.300576 
      47       53.950000       15.290278 
      47       53.970000       15.269226 
      47       53.970000       15.316747 
      47       53.980000       15.352098 
      47       53.970000       15.352098 
      47       53.990000       15.352098 
      47       53.970000       15.352098 
      48       53.880000       15.352098 
      48       53.970000       15.340502 
      48       53.980000       15.309147 
      48       54.020000       15.309147 
      48       53.920000       15.309147 
      48       54.010000       15.315818 
      48       54.010000       15.322629 
      48       53.980000       15.336861 
      48       53.950000       15.401049 
      48       53.990000       15.395106 
      48       53.930000       15.322616 
      48       53.940000       15.257103 
      48       53.990000       15.302914 
      48       53.930000       15.302914 
      48       53.980000       15.365484 
      48       53.960000       15.284063 
      48       54.010000       15.234704 
      48       53.970000       15.298321 
      48       53.980000       15.305475 
      48       53.970000       15.269708 
      48       53.990000       15.222064 
      48       53.960000       15.196244 
      48       53.970000       15.245388 
      48       54.020000       15.304606 
      48       53.860000       15.309934 
      48       53.960000       15.275440 
      48       54.000000       15.180450 
      48       53.880000       15.122202 
      48       53.920000       15.153582 
      49       54.020000       15.217590 
      49       53.950000       15.217590 
      49       53.870000       15.279549 
      49       53.970000       15.282514 
      49       53.900000       15.256282 
      49       53.920000       15.248072 
      49       53.980000       15.257594 
      49       53.970000       15.257594 
      49       53.960000       15.257594 
      49       53.950000       15.234661 
      49       53.910000       15.259866 
      49       53.980000       15.320261 
      49       53.980000       15.319861 
      49       53.980000       15.319861 
      49       53.980000       15.319005 
      49       53.960000       15.373154 
      49       53.930000       15.364641 
      49       53.960000       15.267896 
      49       53.980000       15.226173 
      49       53.890000       15.207749 
      49       53.940000       15.168420 
      49       53.980000       15.191152 
      49       53.940000       15.211845 
      49       53.930000       15.212704 
      49       53.940000       15.267870 
      49       53.910000       15.311290 
      49       54.030000       15.311290 
      49       53.940000       15.329273 
      49       53.890000       15.295611 
      49       54.010000       15.262967 
      50       54.000000       15.276823 
      50       53.950000       15.245428 
      50       53.960000       15.225331 
      50       53.960000       15.225331 
      50       53.960000       15.284396 
      50       53.990000       15.313102 
      50       53.960000       15.249471 
      50       54.010000       15.196594 
      50       53.980000       15.220331 
      50       53.970000       15.249011 
      50       53.960000       15.219902 
      50       54.020000       15.191665 
      50       53.980000       15.231559 
      50       54.020000       15.308163 
      50       53.970000       15.347171 
      50       53.950000       15.308190 
      50       54.020000       15.232432 
      50       54.000000       15.202046 
      50       53.940000       15.263757 
      50       54.000000       15.314528 
      50       53.990000       15.266857 
      50       53.970000       15.219572 
      50       53.990000       15.233248 
      50       53.980000       15.301572 
      50       53.950000       15.306725 
      50       53.920000       15.280023 
      50       53.990000       15.263326 
      50       54.020000       15.231542 
      50       53.970000       15.231542 
      50       53.990000       15.172438 
      51       53.960000       15.194337 
      51       53.930000       15.291660 
      51       53.980000       15.291660 
      51       53.980000       15.307221 
      51       53.970000       15.297133 
      51       53.920000       15.348461 
      51       53.960000       15.420316 
      51       53.940000       15.410364 
      51       54.000000       15.364711 
      51       54.000000       15.296564 
      51       53.990000       15.240556 
      51       53.970000       15.252683 
      51       53.980000       15.287967 
      51       54.000000       15.309615 
      51       53.940000       15.288383 
      51       53.950000       15.288383 
      51       53.940000       15.288383 
      51       53.990000       15.288383 
      51       53.940000       15.257195 
      51       54.000000       15.253875 
      51       53.970000       15.285432 
      51       53.950000       15.277639 
      51       53.960000       15.277639 
      51       54.010000       15.233871 
      51       53.990000       15.229721 
      51       53.980000       15.328386 
      51       54.000000       15.366382 
      51       54.030000       15.249484 
      51       53.990000       15.143758 
      51       53.960000       15.181766 
      52       53.970000       15.269677 
      52       53.980000       15.281212 
      52       53.960000       15.281212 
      52       53.970000       15.281212 
      52       53.970000       15.281212 
      52       53.980000       15.250856 
      52       53.960000       15.250856 
      52       53.980000       15.223862 
      52       53.970000       15.223862 
      52       53.970000       15.217271 
      52       53.960000       15.205521 
      52       53.920000       15.205521 
      52       53.980000       15.205521 
      52       53.950000       15.236072 
      52       53.940000       15.308150 
      52       53.980000       15.342215 
      52       53.940000       15.288882 
      52       53.990000       15.209133 
      52       53.990000       15.166995 
      52       53.970000       15.127101 
      52       53.960000       15.120872 
      52       53.980000       15.120872 
      52       53.980000       15.190708 
      52       53.950000       15.190708 
      52       53.930000       15.190708 
      52       53.980000       15.253900 
      52       54.040000       15.266496 
      52       54.000000       15.254760 
      52       53.980000       15.200714 
      52       54.000000       15.161583 
      53       53.970000       15.196705 
      53       53.960000       15.309466 
      53       53.950000       15.463337 
      53       53.920000       15.430005 
      53       53.990000       15.430005 
      53       53.990000       15.430005 
      53       53.960000       15.430005 
      53       54.000000       15.288177 
      53       53.980000       15.263845 
      53       53.930000       15.378633 
      53       54.000000       15.378633 
      53       53.920000       15.447115 
      53       53.980000       15.372338 
      53       54.020000       15.291611 
      53       53.960000       15.277336 
      53       54.020000       15.287993 
      53       53.940000       15.287993 
      53       53.990000       15.287993 
      53       53.910000       15.287993 
      53       53.990000       15.285808 
      53       53.950000       15.246729 
      53       54.020000       15.246729 
      53       53.980000       15.211374 
      53       54.000000       15.150801 
      53       53.920000       15.114573 
      53       53.990000       15.131073 
      53       53.960000       15.114973 
      53       53.980000       15.091262 
      53       54.010000       15.091262 
      53       53.960000       15.091262 
      54       53.960000       15.091262 
      54       54.000000       15.132433 
      54       54.030000       15.132433 
      54       53.960000       15.219028 
      54       54.000000       15.297808 
      54       54.010000       15.315834 
      54       53.990000       15.311764 
      54       53.950000       15.351228 
      54       54.040000       15.332817 
      54       53.920000       15.278637 
      54       53.990000       15.278637 
      54       54.000000       15.241844 
      54       54.050000       15.199248 
      54       54.010000       15.176450 
      54       54.000000       15.169612 
      54       54.000000       15.170581 
      54       54.020000       15.168309 
      54       53.980000       15.161112 
      54       53.960000       15.136502 
      54       53.940000       15.136502 
      54       53.990000       15.157594 
      54       53.960000       15.157594 
      54       53.970000       15.157594 
      54       53.970000       15.212164 
      54       54.010000       15.184063 
      54       53.930000       15.187997 
      54       53.960000       15.242769 
      54       54.020000       15.215748 
      54       53.990000       15.189103 
      55       54.010000       15.204055 
      55       54.060000       15.266176 
      55       54.020000       15.300869 
      55       53.970000       15.284961 
      55       54.010000       15.224278 
      55       54.010000       15.187678 
      55       53.930000       15.198779 
      55       53.990000       15.198779 
      55       54.020000       15.224344 
      55       54.020000       15.189836 
      55       54.050000       15.140086 
      55       54.020000       15.153139 
      55       53.970000       15.194279 
      55       54.020000       15.245497 
      55       54.030000       15.287470 
      55       54.020000       15.309588 
      55       54.000000       15.287926 
      55       54.020000       15.251339 
      55       54.050000       15.251339 
      55       54.020000       15.223835 
      55       54.040000       15.215901 
      55       53.950000       15.187994 
      55       53.970000       15.147270 
      55       54.060000       15.147270 
      55       54.000000       15.147270 
      55       53.960000       15.115433 
      55       54.020000       15.144542 
      55       54.040000       15.175950 
      55       54.010000       15.153485 
      55       54.020000       15.163024 
      56       54.020000       15.218435 
      56       54.010000       15.279522 
      56       53.980000       15.280768 
      56       54.000000       15.280768 
      56       54.020000       15.235571 
      56       54.030000       15.162042 
      56       54.040000       15.145069 
      56       54.030000       15.201007 
      56       54.000000       15.208217 
      56       53.990000       15.208217 
      56       54.010000       15.208217 
      56       53.970000       15.179551 
      56       53.980000       15.178183 
      56       54.000000       15.178183 
      56       53.990000       15.178183 
      56       54.020000       15.178183 
      56       54.020000       15.209617 
      56       54.020000       15.284423 
      56       54.020000       15.329689 
      56       54.040000       15.327031 
      56       54.000000       15.327031 
      56       53.940000       15.335505 
      56       54.020000       15.313576 
      56       54.000000       15.268309 
      56       53.990000       15.218077 
      56       54.030000       15.169253 
      56       54.030000       15.189876 
      56       54.010000       15.189876 
      56       54.050000       15.196520 
      56       54.030000       15.196520 
      57       54.040000       15.150441 
      57       54.030000       15.190309 
      57       54.040000       15.283935 
      57       54.020000       15.283935 
      57       54.040000       15.278580 
      57       53.970000       15.225277 
      57       54.050000       15.225277 
      57       54.090000       15.249457 
      57       54.010000       15.283949 
      57       53.960000       15.219915 
      57       54.050000       15.157116 
      57       53.940000       15.206033 
      57       54.010000       15.281221 
      57       53.980000       15.251269 
      57       54.030000       15.164730 
      57       53.990000       15.206046 
      57       54.030000       15.273997 
      57       54.010000       15.223528 
      57       53.990000       15.169616 
      57       54.060000       15.187178 
      57       54.040000       15.182648 
      57       53.960000       15.153113 
      57       54.020000       15.150858 
      57       54.030000       15.150858 
      57       54.000000       15.150858 
      57       54.040000       15.150858 
      57       54.060000       15.238256 
      57       54.010000       15.304992 
      57       54.040000       15.304992 
      57       54.010000       15.257098 
      58       54.050000       15.257098 
      58       54.000000       15.236529 
      58       54.020000       15.262441 
      58       53.990000       15.284506 
      58       54.050000       15.284506 
      58       53.980000       15.343159 
      58       54.020000       15.388891 
      58       54.040000       15.344931 
      58       54.020000       15.306036 
      58       54.030000       15.306036 
      58       53.990000       15.357014 
      58       54.070000       15.369151 
      58       54.000000       15.234258 
      58       54.050000       15.144228 
      58       54.030000       15.203306 
      58       54.050000       15.302388 
      58       54.040000       15.347601 
      58       54.100000       15.347601 
      58       54.070000       15.347601 
      58       53.980000       15.318947 
      58       54.010000       15.279926 
      58       54.080000       15.270581 
      58       53.990000       15.270581 
      58       54.020000       15.270581 
      58       54.100000       15.257954 
      58       53.990000       15.257954 
      58       53.990000       15.217230 
      58       54.030000       15.170099 
      58       54.020000       15.200230 
      59       54.010000       15.239502 
      59       53.990000       15.205616 
      59       54.060000       15.194323 
      59       54.070000       15.258011 
      59       54.040000       15.292909 
      59       53.990000       15.323058 
      59       54.100000       15.344418 
      59       54.050000       15.300633 
      59       54.010000       15.269239 
      59       54.020000       15.306848 
      59       54.090000       15.314046 
      59       54.060000       15.303278 
      59       54.010000       15.311348 
      59       54.000000       15.293379 
      59       54.040000       15.275994 
      59       54.040000       15.269625 
      59       54.100000       15.271481 
      59       54.000000       15.271481 
      59       54.040000       15.279537 
      59       54.000000       15.314462 
      59       54.040000       15.335115 
      59       54.010000       15.322505 
      59       54.030000       15.315874 
      59       54.060000       15.288410 
      59       54.020000       15.251823 
      59       54.060000       15.230201 
      59       54.060000       15.230201 
      59       54.020000       15.253596 
      59       54.070000       15.310006 
      59       54.020000       15.412649 
      59       54.050000       15.481625 
      60       54.080000       15.426034 
      60       54.030000       15.305562 
      60       54.030000       15.205964 
      60       54.030000       15.153193 
      60       53.990000       15.130202 
      60       54.110000       15.152280 
      60       53.990000       15.194266 
      60       53.970000       15.245914 
      60       54.030000       15.292022 
      60       54.070000       15.324276 
      60       53.960000       15.294268 
      60       53.970000       15.294268 
      60       54.030000       15.251283 
      60       54.000000       15.218087 
      60       54.010000       15.123115 
      60       54.020000       15.127658 
      60       54.010000       15.300980 
      60       54.070000       15.424715 
      60       54.020000       15.424715 
      60       54.080000       15.424715 
      60       54.040000       15.406861 
      60       54.050000       15.338690 
      60       54.060000       15.338690 
      60       54.030000       15.337914 
      60       54.070000       15.337914 
      60       54.090000       15.337914 
      60       54.090000       15.462399 
      60       54.040000       15.561455 
      60       54.050000       15.474469 
      61       54.030000       15.474469 
