

 time    ||    gripping force   ||   raspberry measurement 

      0       121.950000       4.108429 
      0       40.230000       4.107407 
      0       14.490000       4.113358 
      0       12.130000       4.125345 
      0       11.540000       4.119143 
      0       11.140000       4.072026 
      0       11.860000       4.068065 
      1       11.860000       4.087693 
      1       11.810000       4.057723 
      1       11.770000       4.028601 
      1       11.740000       4.058581 
      1       11.520000       4.097412 
      1       11.380000       4.099051 
      1       11.230000       4.014131 
      1       10.450000       3.573316 
      1       10.290000       2.627643 
      1       10.150000       1.666247 
      1       10.260000       1.205748 
      2       10.320000       1.105101 
      2       10.350000       1.058802 
      2       10.360000       1.028630 
      2       10.450000       1.058583 
      2       10.430000       1.097591 
      2       10.520000       1.105231 
      2       10.510000       1.098464 
      2       10.490000       1.068965 
      2       10.570000       1.072496 
      2       10.560000       1.124556 
      2       10.550000       1.149986 
      2       10.590000       1.158665 
      2       10.640000       1.156258 
      2       10.640000       1.159551 
      2       10.600000       1.160784 
      2       10.630000       1.172950 
      2       10.680000       1.152284 
      2       10.710000       1.117345 
      2       10.650000       1.108832 
      3       10.700000       1.101148 
      3       10.740000       1.078363 
      3       10.770000       1.037057 
      3       10.740000       1.015158 
      3       10.780000       1.018272 
      3       10.860000       1.058140 
      3       10.900000       1.102534 
      3       10.940000       1.124459 
      3       10.910000       1.119117 
      3       10.950000       1.072052 
      3       10.920000       1.068952 
      3       10.880000       1.098504 
      4       10.950000       1.106561 
      4       10.970000       1.113788 
      4       10.900000       1.131174 
      4       10.600000       1.148310 
      4       10.330000       1.131174 
      4       10.070000       1.113815 
      4       10.060000       1.107421 
      4       10.150000       1.108429 
      4       10.170000       1.106964 
      4       10.140000       1.107973 
      4       10.200000       1.101578 
      4       10.120000       1.084219 
      4       10.110000       1.067083 
      4       10.180000       1.084232 
      4       10.190000       1.102035 
      5       44.960000       1.113801 
      5       112.110000       1.136103 
      5       226.450000       1.166652 
      5       282.180000       1.141056 
      5       267.980000       1.069408 
      5       184.690000       1.035329 
      5       119.980000       1.087776 
      5       116.980000       1.156740 
      5       129.150000       1.150928 
      5       164.380000       1.116432 
      5       199.480000       1.098492 
      5       208.560000       1.058748 
      5       200.490000       1.033455 
      5       180.980000       1.126090 
      6       170.390000       1.518554 
      6       176.970000       2.494110 
      6       176.670000       3.984554 
      6       176.520000       5.299190 
      7       175.300000       5.771532 
      7       175.200000       5.303085 
      8       174.530000       4.270686 
      8       174.660000       3.437463 
      8       174.690000       3.214496 
      9       174.680000       3.511210 
      9       174.440000       4.099795 
      9       174.490000       4.659119 
      11       174.470000       4.865181 
      11       174.500000       4.672703 
      13       176.850000       4.333005 
      13       176.840000       4.139923 
      14       176.730000       4.060934 
      14       176.740000       4.017898 
      14       176.720000       4.009304 
      14       176.740000       4.007031 
      14       176.690000       4.009303 
      15       176.670000       4.017802 
      15       176.710000       4.057697 
      15       176.640000       4.097591 
      15       176.710000       4.106091 
      15       176.580000       4.108389 
      15       176.630000       4.106977 
      17       177.850000       4.108416 
      17       177.870000       4.106977 
      17       177.850000       4.108416 
      17       177.800000       4.106964 
      18       177.780000       4.107959 
      18       177.850000       4.101148 
      18       177.830000       4.079250 
      19       177.740000       4.047855 
      19       177.730000       4.063552 
      19       177.700000       4.098048 
      19       177.790000       4.106104 
      19       177.920000       4.108389 
      21       177.940000       4.106977 
      21       177.950000       4.108416 
      21       177.890000       4.106977 
      21       177.950000       4.108416 
      21       177.980000       4.106964 
      22       177.890000       4.107959 
      22       177.870000       4.101122 
      23       178.840000       4.078376 
      23       178.800000       4.037487 
      24       178.760000       4.020101 
      24       178.810000       4.036600 
      24       178.840000       4.067552 
      24       178.760000       4.051854 
      24       178.770000       4.017802 
      24       178.750000       4.015118 
      25       178.740000       4.036170 
      25       178.700000       4.067538 
      26       178.710000       4.051841 
      26       178.700000       4.017346 
      26       178.720000       4.009289 
      26       178.650000       4.007031 
      26       178.680000       4.009303 
      26       178.670000       4.017802 
      27       178.620000       4.057696 
      27       178.660000       4.097564 
      27       178.990000       4.105204 
      27       179.040000       4.097591 
      28       179.160000       4.058583 
      28       179.240000       4.028601 
      28       179.190000       4.057697 
      28       179.220000       4.086793 
      28       179.220000       4.056810 
      28       179.190000       4.017776 
      28       179.160000       4.009302 
      28       179.230000       4.007031 
      29       179.130000       4.009302 
      29       179.140000       4.017776 
      31       179.170000       4.056810 
      31       179.120000       4.086793 
      32       179.130000       4.057697 
      32       179.160000       4.028601 
      33       179.060000       4.058583 
      33       179.120000       4.097618 
      34       179.080000       4.106091 
      34       179.100000       4.108362 
      34       179.110000       4.106090 
      35       179.050000       4.097591 
      35       179.090000       4.057697 
      35       179.060000       4.017829 
      35       179.020000       4.010189 
      35       179.040000       4.017829 
      35       179.070000       4.057697 
      35       179.050000       4.097591 
      35       179.050000       4.106090 
      36       179.060000       4.108362 
      36       179.050000       4.106091 
      36       178.990000       4.097617 
      36       179.070000       4.058570 
      36       179.050000       4.028171 
      36       179.030000       4.052754 
      37       179.060000       4.068451 
      37       179.100000       4.046969 
      37       179.130000       4.063525 
      37       179.150000       4.098020 
      38       179.090000       4.105218 
      38       179.090000       4.097604 
      38       179.110000       4.059026 
      38       179.150000       4.034026 
      38       179.100000       4.082780 
      39       179.090000       4.137512 
      39       179.070000       4.130288 
      40       179.100000       4.113761 
      40       179.070000       4.106534 
      40       179.100000       4.097631 
      40       179.070000       4.058583 
      41       179.080000       4.028627 
      41       179.080000       4.058583 
      41       179.050000       4.097617 
      41       179.060000       4.106077 
      42       179.090000       4.107933 
      42       179.110000       4.101148 
      42       179.040000       4.079250 
      43       179.100000       4.047855 
      43       179.110000       4.063552 
      43       179.090000       4.098048 
      43       179.090000       4.106104 
      43       179.050000       4.108389 
      43       179.030000       4.106977 
      43       179.030000       4.108416 
      43       179.060000       4.106977 
      43       179.080000       4.108389 
      44       179.060000       4.106104 
      44       179.110000       4.098048 
      44       179.050000       4.063552 
      44       179.110000       4.047855 
      45       180.590000       4.079250 
      45       180.610000       4.101148 
      45       180.810000       4.107933 
      45       180.780000       4.106077 
      46       180.750000       4.097617 
      46       180.740000       4.058570 
      46       180.740000       4.028171 
      46       180.750000       4.052727 
      46       180.740000       4.067565 
      46       180.670000       4.036171 
      46       180.700000       4.015131 
      46       180.760000       4.018232 
      47       180.750000       4.056824 
      47       180.750000       4.086793 
      47       180.770000       4.057697 
      47       180.680000       4.028601 
      48       180.710000       4.058583 
      48       180.690000       4.097591 
      48       180.680000       4.105205 
      48       180.740000       4.097591 
      49       180.670000       4.058583 
      49       180.700000       4.028627 
      49       180.680000       4.058583 
      49       180.620000       4.097618 
      49       180.680000       4.106091 
      50       180.670000       4.108362 
      51       180.630000       4.106091 
      51       180.630000       4.097618 
      51       180.680000       4.058583 
      51       180.630000       4.028601 
      51       180.650000       4.057697 
      51       180.610000       4.086819 
      51       180.670000       4.057683 
      52       180.630000       4.028144 
      53       180.590000       4.052754 
      53       180.570000       4.068451 
      53       180.590000       4.046969 
      53       180.580000       4.063526 
      53       180.600000       4.098047 
      53       180.560000       4.106091 
      53       180.610000       4.107933 
      53       180.550000       4.101148 
      54       180.600000       4.079250 
      54       180.550000       4.047855 
      54       180.510000       4.063552 
      55       180.550000       4.098048 
      55       180.550000       4.106104 
      55       180.540000       4.108389 
      55       180.580000       4.106977 
      55       180.530000       4.108416 
      56       180.530000       4.106977 
      56       180.550000       4.108389 
      56       180.540000       4.106091 
      56       180.510000       4.097618 
      56       180.580000       4.058583 
      57       180.500000       4.028601 
      57       180.550000       4.057697 
      57       180.530000       4.086793 
      57       180.520000       4.056810 
      57       180.550000       4.017776 
      57       180.530000       4.009303 
      57       180.540000       4.007044 
      57       180.490000       4.009759 
      58       180.510000       4.023631 
      58       180.500000       4.086836 
      58       180.490000       4.155827 
      58       180.500000       4.140156 
      58       180.500000       4.068925 
      58       180.500000       4.029514 
      59       180.480000       4.059053 
      59       180.490000       4.102990 
      60       180.490000       4.129402 
      60       180.460000       4.137485 
      60       180.470000       4.082780 
      60       180.440000       4.034026 
