

 time    ||    gripping force   ||   raspberry measurement 

      0       0.090000       -802.189796 
      0       0.040000       -802.189796 
      0       0.100000       -802.189796 
      0       0.020000       -802.189796 
      0       0.060000       -802.189796 
      0       0.030000       -802.189796 
      0       0.310000       -802.189796 
      0       0.110000       -802.189796 
      0       0.000000       -802.189796 
      0       0.340000       -802.189796 
      0       0.230000       -802.189796 
      0       0.320000       -802.189796 
      0       0.540000       -802.189796 
      0       0.110000       -802.189796 
      0       0.230000       -802.189796 
      0       0.050000       -802.189796 
      0       0.060000       -802.189796 
      0       0.170000       -802.189796 
      1       0.340000       -802.189796 
      1       0.310000       -802.189796 
      1       0.400000       -802.189796 
      1       0.260000       -802.189796 
      1       0.440000       -802.189796 
      1       0.620000       -802.189796 
      1       1.020000       -802.189796 
      1       5.780000       -802.189796 
      1       30.250000       -794.167898 
      1       53.220000       -786.226219 
      1       72.490000       -778.363957 
      1       91.260000       -770.580317 
      1       113.400000       -762.874514 
      1       114.850000       -762.874514 
      1       114.000000       -762.874514 
      1       113.020000       -755.245764 
      1       112.840000       -747.692126 
      1       112.220000       -740.108947 
      1       111.570000       -736.554631 
      1       111.400000       -693.254748 
      1       110.940000       -499.204568 
      2       110.740000       -179.295344 
      2       110.350000       14.717255 
      2       110.330000       58.062517 
      2       110.050000       61.814144 
      2       109.860000       62.265315 
      2       109.620000       62.658327 
      2       109.110000       63.053252 
      2       107.590000       63.417731 
      2       102.900000       63.633815 
      2       95.500000       63.678361 
      2       81.520000       63.678361 
      2       66.390000       63.612929 
      2       48.580000       63.564633 
      2       41.390000       63.606310 
      2       36.820000       63.641191 
      3       37.220000       63.641191 
      3       39.360000       63.563262 
      3       43.630000       63.563262 
      3       55.220000       63.496955 
      3       61.180000       63.540336 
      3       67.010000       63.546674 
      3       67.820000       63.520195 
      3       67.410000       63.525527 
      3       65.660000       63.508429 
      3       63.600000       63.508429 
      3       59.170000       63.483773 
      3       51.210000       63.363386 
      3       45.170000       63.101769 
      3       42.370000       63.101769 
      3       41.580000       62.784633 
      4       41.500000       62.784633 
      4       43.100000       62.402836 
      4       44.820000       62.020916 
      4       46.620000       61.854194 
      4       48.960000       61.865281 
      4       51.360000       62.020417 
      4       54.030000       62.298214 
      4       54.470000       62.547394 
      4       54.680000       62.683747 
      4       54.470000       62.723575 
      4       54.440000       62.719601 
      4       54.020000       62.651866 
      4       53.620000       62.474803 
      4       52.650000       62.194267 
      4       51.530000       61.952161 
      5       49.710000       61.952161 
      5       48.090000       61.863911 
      5       47.400000       61.882085 
      5       47.520000       61.918491 
      5       47.900000       61.904886 
      5       48.620000       61.904886 
      5       48.930000       61.890737 
      5       48.950000       61.899611 
      5       48.960000       61.899611 
      5       48.960000       61.899611 
      5       48.950000       61.981754 
      5       48.930000       61.981754 
      5       48.980000       62.142125 
      5       49.020000       62.327266 
      5       49.010000       62.402945 
      6       49.030000       62.402945 
      6       48.970000       62.304872 
      6       48.950000       62.183002 
      6       48.960000       62.130051 
      6       49.000000       62.082556 
      6       49.040000       62.082556 
      6       49.060000       62.082556 
      6       48.980000       62.035907 
      6       49.040000       61.993297 
      6       49.300000       61.913939 
      6       49.450000       61.864715 
      6       49.470000       61.908096 
      6       49.500000       61.963231 
      6       49.750000       61.965462 
      6       49.740000       61.981186 
      6       49.790000       61.982875 
      7       49.760000       61.982875 
      7       49.700000       61.922534 
      7       49.740000       61.897758 
      7       49.770000       61.925608 
      7       49.790000       61.933608 
      7       49.740000       61.943103 
      7       49.780000       61.903073 
      7       49.740000       61.863372 
      7       49.760000       61.902227 
      7       49.720000       61.933675 
      7       49.760000       61.902727 
      7       49.730000       61.934178 
      7       49.720000       62.036695 
      7       49.790000       62.036695 
      7       49.740000       62.036695 
      8       49.770000       62.036695 
      8       49.740000       62.085655 
      8       49.790000       62.060479 
      8       49.780000       62.038620 
      8       49.710000       62.026867 
      8       49.770000       62.009024 
      8       49.820000       61.990586 
      8       49.820000       61.990586 
      8       49.790000       61.992854 
      8       49.930000       61.953820 
      8       49.940000       61.913136 
      8       50.400000       61.959688 
      8       50.500000       62.023766 
      8       50.490000       62.070458 
      8       50.530000       62.070458 
      8       50.510000       62.070458 
      9       50.490000       62.141181 
      9       50.530000       62.162317 
      9       50.480000       62.120612 
      9       50.510000       62.114423 
      9       50.540000       62.121455 
      9       50.470000       62.121455 
      9       50.490000       62.108178 
      9       50.420000       62.086503 
      9       50.520000       62.084828 
      9       50.430000       62.085670 
      9       50.470000       62.099139 
      9       50.450000       62.094187 
      9       50.480000       62.125124 
      9       50.450000       62.125124 
      10       50.440000       62.196356 
      10       50.420000       62.154620 
      10       50.460000       62.033722 
      10       50.440000       61.978960 
      10       50.500000       61.978960 
      10       50.540000       61.993781 
      10       50.490000       61.977627 
      10       50.440000       61.953890 
      10       50.480000       61.994200 
      10       50.460000       61.994200 
      10       50.490000       62.070844 
      10       50.440000       62.110739 
      10       50.500000       62.110739 
      10       50.470000       62.110739 
      10       50.540000       62.082488 
      11       50.530000       62.052950 
      11       50.500000       62.076713 
      11       50.490000       62.082902 
      11       50.500000       62.027893 
      11       50.470000       62.021082 
      11       50.480000       62.055147 
      11       50.500000       62.014836 
      11       50.540000       61.993771 
      11       50.480000       62.004955 
      11       50.460000       62.015293 
      11       50.540000       62.049792 
      11       50.430000       62.061002 
      11       50.460000       62.082516 
      11       50.530000       62.082516 
      11       50.490000       62.103639 
      11       50.500000       62.110753 
      12       50.480000       62.136393 
      12       50.500000       62.169449 
      12       50.420000       62.169449 
      12       50.540000       62.236361 
      12       50.450000       62.225910 
      12       50.440000       62.134621 
      12       50.470000       62.118898 
      12       50.500000       62.206253 
      12       50.460000       62.206253 
      12       50.450000       62.221507 
      12       50.490000       62.131880 
      12       50.510000       62.131880 
      12       50.400000       62.110840 
      12       50.460000       62.172147 
      12       50.460000       62.209423 
      13       50.480000       62.165419 
      13       50.470000       62.070003 
      13       50.440000       62.013969 
      13       50.430000       62.052530 
      13       50.440000       62.077073 
      13       50.470000       62.022508 
      13       50.410000       62.002727 
      13       50.470000       62.045306 
      13       50.380000       62.045306 
      13       50.490000       62.060573 
      13       50.440000       62.082046 
      13       50.440000       62.097810 
      13       50.480000       62.081573 
      13       50.480000       62.081573 
      13       50.450000       62.076787 
      14       50.440000       62.076787 
      14       50.430000       62.076787 
      14       50.490000       62.117870 
      14       50.330000       62.187413 
      14       50.400000       62.114283 
      14       50.410000       61.988898 
      14       50.410000       61.952562 
      14       50.400000       61.987039 
      14       50.350000       62.048919 
      14       50.370000       62.078874 
      14       50.340000       62.091900 
      14       50.290000       62.052463 
      14       50.330000       61.996898 
      14       50.330000       61.996898 
      14       50.380000       61.996898 
      14       50.320000       61.996898 
      15       50.300000       61.985727 
      15       50.340000       61.986543 
      15       50.290000       62.008609 
      15       50.290000       62.026424 
      15       49.750000       62.026424 
      15       49.510000       62.026424 
      15       49.160000       62.033665 
      15       49.150000       62.033665 
      15       49.170000       62.033665 
      15       49.320000       62.041735 
      15       49.390000       62.071730 
      15       49.390000       62.073988 
      15       49.330000       62.049765 
      15       49.360000       62.067287 
      15       49.370000       62.031766 
      16       49.350000       61.934206 
      16       49.350000       61.908597 
      16       49.400000       61.964587 
      16       49.410000       61.964587 
      16       49.420000       61.964587 
      16       49.410000       61.982113 
      16       49.380000       61.982113 
      16       49.430000       61.995972 
      16       49.460000       62.043962 
      16       49.500000       62.050607 
      16       49.510000       62.043147 
      16       49.490000       62.043147 
      16       49.550000       62.051037 
      16       49.530000       62.048918 
      16       49.460000       62.048918 
      17       49.520000       62.014783 
      17       49.540000       61.998253 
      17       49.610000       61.954303 
      17       49.650000       61.954303 
      17       49.700000       61.914465 
      17       49.720000       61.975389 
      17       49.790000       62.089159 
      17       49.720000       62.143434 
      17       49.700000       62.065378 
      17       49.760000       61.934635 
      17       49.760000       61.879873 
      17       49.770000       61.904619 
      17       49.750000       61.927324 
      17       49.760000       61.927324 
      17       49.750000       61.948990 
      18       49.750000       62.004414 
      18       49.780000       62.053817 
      18       49.730000       62.053817 
      18       49.700000       62.015200 
      18       49.670000       61.997907 
      18       49.690000       62.015157 
      18       49.750000       62.015157 
      18       49.740000       62.009148 
      18       49.730000       62.069906 
      18       49.740000       62.169461 
      18       49.720000       62.151049 
      18       49.720000       62.102739 
      18       49.840000       62.030925 
      18       49.790000       62.030925 
      18       49.800000       62.030925 
      19       49.820000       62.030925 
      19       49.830000       61.973241 
      19       49.770000       62.034122 
      19       49.830000       62.100853 
      19       49.780000       62.081616 
      19       49.760000       62.052533 
      19       49.760000       62.073046 
      19       49.770000       62.078972 
      19       49.760000       62.068617 
      19       49.760000       62.084757 
      19       49.810000       62.037652 
      19       49.800000       62.037652 
      19       49.820000       62.011779 
      19       49.760000       62.011779 
      19       49.710000       62.058678 
      20       49.780000       62.046647 
      20       49.760000       62.000968 
      20       49.780000       62.000968 
      20       49.820000       62.000026 
      20       49.830000       61.989714 
      20       49.830000       61.989714 
      20       49.860000       62.011766 
      20       49.790000       62.106212 
      20       49.810000       62.106212 
      20       49.820000       62.127295 
      20       49.800000       62.060147 
      20       49.820000       62.058761 
      20       49.880000       62.064560 
      20       49.850000       62.031047 
      20       49.770000       62.058722 
      20       49.830000       62.092383 
      21       49.790000       62.079331 
      21       49.810000       62.079331 
      21       49.800000       62.054318 
      21       49.780000       62.011170 
      21       49.820000       61.990240 
      21       49.760000       61.986127 
      21       49.760000       61.999556 
      21       49.800000       61.998310 
      21       49.810000       62.034910 
      21       49.830000       62.085726 
      21       49.790000       62.062261 
      21       49.810000       62.062889 
      21       49.790000       62.062889 
      21       49.790000       62.070389 
      21       49.780000       62.122490 
      21       49.780000       62.145252 
      22       49.770000       62.139050 
      22       49.820000       62.212983 
      22       49.880000       62.219597 
      22       49.800000       62.121621 
      22       49.850000       62.049350 
      22       49.850000       62.035491 
      22       49.840000       62.035491 
      22       49.850000       62.042232 
      22       49.890000       62.077117 
      22       49.870000       62.097783 
      22       49.890000       62.085630 
      22       49.840000       62.084800 
      22       49.870000       62.085590 
      22       49.850000       62.096481 
      22       49.880000       62.061860 
      22       49.860000       62.061860 
      23       49.810000       61.982224 
      23       49.810000       61.986176 
      23       49.900000       62.156559 
      23       49.830000       62.311885 
      23       49.820000       62.311885 
      23       49.890000       62.259618 
      23       49.890000       62.116116 
      23       49.820000       62.116116 
      23       49.850000       62.067372 
      23       49.860000       62.067372 
      23       49.910000       62.052058 
      23       49.840000       62.040018 
      23       49.870000       62.053863 
      23       49.840000       62.130936 
      23       49.870000       62.202212 
      24       49.860000       62.179317 
      24       49.860000       62.144019 
      24       49.840000       62.132682 
      24       49.800000       62.132832 
      24       49.900000       62.132832 
      24       49.840000       62.126397 
      24       49.890000       62.108595 
      24       50.020000       62.086100 
      24       50.080000       62.080301 
      24       50.160000       62.071788 
      24       50.200000       62.071788 
      24       50.090000       62.100910 
      24       50.130000       62.109384 
      24       50.140000       62.055674 
      24       50.160000       62.064161 
      25       50.140000       62.093687 
      25       50.100000       62.093687 
      25       50.100000       62.089296 
      25       50.100000       62.093243 
      25       50.040000       62.093243 
      25       50.120000       62.093243 
      25       50.090000       62.058748 
      25       50.100000       62.031020 
      25       50.130000       62.063648 
      25       50.070000       62.047117 
      25       50.050000       62.047117 
      25       50.070000       62.002297 
      25       50.040000       62.015727 
      25       50.070000       62.055161 
      25       50.120000       62.086582 
      26       50.100000       62.054235 
      26       50.110000       62.023880 
      26       50.060000       62.023880 
      26       50.080000       62.023880 
      26       50.080000       62.106726 
      26       50.110000       62.106726 
      26       50.080000       62.186497 
      26       50.090000       62.136309 
      26       50.110000       62.093371 
      26       50.080000       62.142993 
      26       50.040000       62.162345 
      26       50.080000       62.119766 
      26       50.110000       62.119766 
      26       50.060000       62.104941 
      26       50.080000       62.088814 
      27       50.080000       62.095568 
      27       50.120000       62.133138 
      27       50.090000       62.100897 
      27       50.050000       62.047617 
      27       50.080000       62.035880 
      27       50.040000       62.047564 
      27       50.090000       62.047564 
      27       50.100000       62.099165 
      27       50.090000       62.099165 
      27       50.060000       62.112884 
      27       50.060000       62.015367 
      27       50.090000       62.005442 
      27       50.090000       62.129993 
      27       50.050000       62.108494 
      27       50.060000       62.108494 
      28       50.040000       62.018052 
      28       50.070000       62.022925 
      28       50.080000       62.086569 
      28       50.070000       62.172217 
      28       50.070000       62.213356 
      28       50.040000       62.191913 
      28       50.050000       62.191913 
      28       50.090000       62.118384 
      28       50.040000       62.077697 
      28       50.100000       62.095057 
      28       50.140000       62.095057 
      28       50.070000       62.093341 
      28       50.090000       62.119739 
      28       50.070000       62.173073 
      28       50.090000       62.126464 
      29       50.110000       62.070503 
      29       50.080000       62.123756 
      29       50.080000       62.123756 
      29       50.110000       62.222794 
      29       50.040000       62.208883 
      29       50.020000       62.208883 
      29       50.030000       62.042648 
      29       50.050000       61.908212 
      29       50.060000       61.936461 
      29       50.030000       62.060503 
      29       50.060000       62.125106 
      29       50.080000       62.079721 
      29       50.080000       62.025249 
      29       50.050000       62.012553 
      29       50.090000       62.037359 
      30       50.080000       62.081134 
      30       50.090000       62.195553 
      30       50.120000       62.254053 
      30       50.030000       62.254053 
      30       50.030000       62.161515 
      30       50.110000       62.063236 
      30       50.070000       62.061973 
      30       50.060000       62.080271 
      30       50.130000       62.097380 
      30       50.040000       62.078433 
      30       50.030000       62.078433 
      30       50.050000       62.058429 
      30       50.080000       62.108029 
      30       50.050000       62.167247 
      30       50.030000       62.172159 
      31       50.070000       62.133151 
      31       50.050000       62.024736 
      31       50.080000       61.974102 
      31       50.050000       62.050329 
      31       50.050000       62.050329 
      31       50.080000       62.110697 
      31       50.060000       62.124362 
      31       50.100000       62.170765 
      31       50.090000       62.264158 
      31       49.990000       62.292233 
      31       50.050000       62.271329 
      31       50.050000       62.196787 
      31       50.070000       62.196787 
      31       50.020000       62.099653 
      31       50.040000       62.054334 
      31       50.040000       62.077654 
      32       50.040000       62.094197 
      32       50.090000       62.083459 
      32       50.030000       62.146637 
      32       50.040000       62.239351 
      32       50.000000       62.199080 
      32       50.000000       62.054736 
      32       50.080000       61.982241 
      32       50.060000       62.057390 
      32       50.090000       62.147560 
      32       50.040000       62.127766 
      32       50.060000       62.091113 
      32       50.100000       62.079846 
      32       49.970000       62.147201 
      32       50.070000       62.252393 
      32       50.090000       62.275773 
      33       50.040000       62.270808 
      33       50.020000       62.270808 
      33       50.030000       62.291484 
      33       50.020000       62.255976 
      33       50.060000       62.155731 
      33       50.030000       62.117056 
      33       50.010000       62.183911 
      33       50.070000       62.179758 
      33       50.080000       62.104153 
      33       50.030000       62.084803 
      33       50.060000       62.153443 
      33       50.080000       62.217924 
      33       50.040000       62.246664 
      33       50.050000       62.305799 
      33       50.070000       62.305799 
      34       50.010000       62.351478 
      34       50.050000       62.305356 
      34       50.050000       62.241278 
      34       50.080000       62.194156 
      34       50.070000       62.118451 
      34       50.080000       62.118451 
      34       50.000000       62.077671 
      34       50.010000       62.077671 
      34       50.080000       62.077671 
      34       50.090000       62.094197 
      34       50.090000       62.083442 
      34       50.050000       62.083442 
      34       50.140000       62.082560 
      34       50.120000       62.146191 
      34       50.000000       62.146191 
      35       50.030000       62.171231 
      35       50.100000       62.098780 
      35       50.090000       62.069548 
      35       50.050000       62.161060 
      35       50.040000       62.161060 
      35       50.080000       62.262247 
      35       50.020000       62.300882 
      35       50.040000       62.231770 
      35       50.160000       62.164271 
      35       50.040000       62.184759 
      35       50.140000       62.184759 
      35       50.040000       62.228332 
      35       50.040000       62.260963 
      35       50.080000       62.302685 
      35       50.110000       62.319171 
      35       50.040000       62.290597 
      36       50.110000       62.290597 
      36       50.030000       62.196801 
      36       50.040000       62.080895 
      36       50.080000       62.080895 
      36       50.120000       62.035036 
      36       50.020000       62.035036 
      36       50.060000       62.035036 
      36       50.070000       62.091127 
      36       50.080000       62.091127 
      36       50.040000       62.173059 
      36       50.050000       62.220593 
      36       50.040000       62.153309 
      36       50.070000       62.077701 
      36       50.060000       62.123793 
      36       50.080000       62.153332 
      37       50.050000       62.153332 
      37       50.130000       62.111780 
      37       50.080000       62.143091 
      37       50.080000       62.210740 
      37       50.010000       62.230564 
      37       50.030000       62.230564 
      37       50.070000       62.305773 
      37       50.040000       62.366733 
      37       50.080000       62.303111 
      37       50.020000       62.220723 
      37       50.040000       62.174904 
      37       50.050000       62.198806 
      37       50.070000       62.266695 
      37       50.070000       62.295150 
      37       50.070000       62.295150 
      38       50.040000       62.264423 
      38       50.090000       62.192538 
      38       50.020000       62.139882 
      38       50.030000       62.139882 
      38       50.060000       62.139882 
      38       50.110000       62.139882 
      38       50.040000       62.139882 
      38       50.010000       62.139882 
      38       50.030000       62.197491 
      38       50.100000       62.220030 
      38       50.020000       62.228458 
      38       50.040000       62.270655 
      38       50.070000       62.292908 
      38       50.040000       62.252782 
      38       50.070000       62.199651 
      39       50.060000       62.112056 
      39       50.040000       62.055772 
      39       50.030000       62.062333 
      39       50.040000       62.092868 
      39       50.010000       62.082543 
      39       50.030000       62.082543 
      39       50.050000       62.072674 
      39       50.080000       62.072674 
      39       50.080000       62.109468 
      39       50.090000       62.150218 
      39       50.020000       62.174016 
      39       49.980000       62.174016 
      39       50.040000       62.172191 
      39       50.110000       62.211239 
      39       50.020000       62.211239 
      40       50.050000       62.251976 
      40       50.050000       62.207196 
      40       50.100000       62.164648 
      40       50.050000       62.212582 
      40       50.070000       62.276186 
      40       50.020000       62.276186 
      40       49.990000       62.251564 
      40       50.010000       62.201425 
      40       50.030000       62.200926 
      40       50.090000       62.200552 
      40       49.990000       62.261463 
      40       50.010000       62.401285 
      40       50.050000       62.436582 
      40       50.030000       62.330978 
      40       50.020000       62.198174 
      40       50.010000       62.121689 
      41       50.080000       62.093340 
      41       49.990000       62.115821 
      41       50.030000       62.167302 
      41       50.100000       62.252463 
      41       50.040000       62.321510 
      41       50.080000       62.349237 
      41       49.990000       62.348019 
      41       50.050000       62.305314 
      41       50.050000       62.305314 
      41       50.000000       62.266029 
      41       50.070000       62.246179 
      41       50.030000       62.273639 
      41       50.030000       62.273033 
      41       50.040000       62.257476 
      41       50.080000       62.300441 
      42       50.030000       62.317437 
      42       50.030000       62.317437 
      42       50.060000       62.317437 
      42       50.020000       62.229235 
      42       50.040000       62.203174 
      42       50.040000       62.307638 
      42       50.010000       62.332594 
      42       50.050000       62.218977 
      42       50.040000       62.124672 
      42       50.060000       62.124672 
      42       50.040000       62.172436 
      42       50.080000       62.266317 
      42       50.030000       62.340932 
      42       50.010000       62.428601 
      42       50.010000       62.570358 
      43       50.030000       62.583166 
      43       50.030000       62.449886 
      43       50.090000       62.339358 
      43       50.060000       62.266123 
      43       50.020000       62.215211 
      43       50.100000       62.215211 
      43       50.030000       62.208679 
      43       50.060000       62.208679 
      43       50.010000       62.208679 
      43       50.070000       62.197714 
      43       49.990000       62.240459 
      43       50.010000       62.227257 
      43       50.010000       62.227257 
      43       50.030000       62.210892 
      43       50.060000       62.258195 
      43       50.060000       62.240818 
      44       50.010000       62.171815 
      44       50.060000       62.141307 
      44       50.040000       62.148973 
      44       50.060000       62.212569 
      44       50.060000       62.291471 
      44       50.070000       62.313852 
      44       50.040000       62.279818 
      44       50.020000       62.237292 
      44       50.050000       62.277587 
      44       50.080000       62.309007 
      44       50.010000       62.275762 
      44       50.020000       62.300125 
      44       50.040000       62.359010 
      44       50.010000       62.362467 
      44       49.990000       62.285078 
      45       50.050000       62.233859 
      45       50.050000       62.250583 
      45       50.010000       62.338686 
      45       50.030000       62.352765 
      45       50.010000       62.289783 
      45       50.050000       62.238582 
      45       50.050000       62.282582 
      45       50.000000       62.328209 
      45       50.040000       62.295528 
      45       50.020000       62.292401 
      45       50.060000       62.306696 
      45       49.990000       62.253416 
      45       49.990000       62.253416 
      45       50.020000       62.195171 
      45       50.070000       62.248464 
      46       50.010000       62.351103 
      46       49.980000       62.351103 
      46       50.080000       62.359576 
      46       50.010000       62.298283 
      46       49.970000       62.273977 
      46       50.040000       62.273977 
      46       50.030000       62.309078 
      46       49.940000       62.345209 
      46       49.990000       62.353432 
      46       50.100000       62.353432 
      46       49.980000       62.334467 
      46       50.060000       62.325165 
      46       50.000000       62.291526 
      46       50.130000       62.291526 
      46       50.040000       62.289271 
      47       49.950000       62.314880 
      47       50.000000       62.314880 
      47       50.040000       62.358651 
      47       50.030000       62.408566 
      47       49.940000       62.366651 
      47       50.110000       62.286266 
      47       50.020000       62.202618 
      47       50.010000       62.200688 
      47       50.020000       62.241543 
      47       50.000000       62.257541 
      47       50.020000       62.247866 
      47       50.010000       62.217122 
      47       50.000000       62.141776 
      47       49.930000       62.175859 
      47       50.020000       62.268174 
      48       50.020000       62.268174 
      48       50.050000       62.316551 
      48       49.980000       62.316625 
      48       50.010000       62.265933 
      48       50.030000       62.320266 
      48       50.060000       62.406212 
      48       50.000000       62.418808 
      48       49.990000       62.384331 
      48       50.140000       62.346164 
      48       50.010000       62.354761 
      48       49.990000       62.349748 
      48       50.030000       62.322450 
      48       50.070000       62.264591 
      48       49.980000       62.231934 
      48       50.030000       62.269517 
      49       50.090000       62.277157 
      49       49.990000       62.277157 
      49       50.050000       62.271814 
      49       50.020000       62.271814 
      49       50.050000       62.304901 
      49       49.970000       62.335462 
      49       50.080000       62.365418 
      49       49.980000       62.343936 
      49       50.030000       62.280314 
      49       50.000000       62.280301 
      49       49.990000       62.277600 
      49       49.990000       62.266402 
      49       50.020000       62.279375 
      49       50.050000       62.279358 
      49       49.990000       62.268214 
      49       50.020000       62.214409 
      50       50.030000       62.196110 
      50       50.000000       62.300056 
      50       49.970000       62.459079 
      50       50.040000       62.542065 
      50       50.050000       62.477917 
      50       50.020000       62.477917 
      50       49.970000       62.322052 
      50       50.030000       62.216282 
      50       50.000000       62.294308 
      50       50.060000       62.412038 
      50       49.980000       62.410755 
      50       50.010000       62.410755 
      50       50.050000       62.405386 
      50       49.930000       62.446523 
      50       50.010000       62.386568 
      51       50.050000       62.386568 
      51       50.080000       62.262390 
      51       49.950000       62.262390 
      51       50.040000       62.262390 
      51       50.080000       62.227451 
      51       50.000000       62.256517 
      51       50.040000       62.291995 
      51       50.030000       62.277990 
      51       50.040000       62.277990 
      51       50.000000       62.277990 
      51       50.090000       62.277990 
      51       50.040000       62.258415 
      51       50.050000       62.308016 
      51       50.050000       62.366857 
      51       49.990000       62.368519 
      52       50.070000       62.330120 
      52       50.010000       62.276634 
      52       49.990000       62.289367 
      52       49.960000       62.310227 
      52       50.060000       62.279052 
      52       50.000000       62.234096 
      52       49.980000       62.280384 
      52       50.040000       62.280384 
      52       49.970000       62.390045 
      52       50.020000       62.449236 
      52       50.060000       62.449236 
      52       50.050000       62.393242 
      52       50.020000       62.278432 
      52       50.070000       62.278432 
      52       49.980000       62.162500 
      52       50.090000       62.136848 
      53       50.000000       62.136848 
      53       50.020000       62.212193 
      53       50.030000       62.234508 
      53       50.040000       62.267774 
      53       50.020000       62.317427 
      53       50.040000       62.317427 
      53       50.010000       62.325094 
      53       50.060000       62.308582 
      53       50.020000       62.286999 
      53       50.030000       62.291583 
      53       49.990000       62.326911 
      53       50.020000       62.421107 
      53       50.060000       62.470760 
      53       49.980000       62.470760 
      53       50.000000       62.417497 
      54       50.020000       62.387971 
      54       50.000000       62.437125 
      54       50.050000       62.436818 
      54       49.980000       62.364104 
      54       49.990000       62.313095 
      54       50.020000       62.282061 
      54       50.020000       62.331959 
      54       50.010000       62.366678 
      54       50.040000       62.366678 
      54       50.030000       62.297907 
      54       49.980000       62.263679 
      54       49.980000       62.263679 
      54       50.020000       62.331047 
      54       50.010000       62.393630 
      54       50.040000       62.422936 
      55       50.010000       62.404844 
      55       50.000000       62.384827 
      55       49.980000       62.367275 
      55       50.000000       62.382542 
      55       50.040000       62.398213 
      55       50.040000       62.385160 
      55       49.990000       62.378112 
      55       50.030000       62.346578 
      55       50.020000       62.301951 
      55       50.010000       62.311657 
      55       50.020000       62.413063 
      55       50.000000       62.449624 
      55       50.060000       62.396523 
      55       50.010000       62.362682 
      55       49.960000       62.354371 
      56       50.010000       62.329525 
      56       50.060000       62.305507 
      56       50.050000       62.265850 
      56       49.940000       62.265170 
      56       49.980000       62.275692 
      56       49.950000       62.278139 
      56       50.010000       62.278139 
      56       49.990000       62.256894 
      56       49.980000       62.256894 
      56       50.000000       62.256894 
      56       50.000000       62.256894 
      56       49.980000       62.256894 
      56       49.980000       62.244517 
      56       49.980000       62.262346 
      56       50.040000       62.304538 
      56       50.090000       62.342138 
      57       50.040000       62.404899 
      57       50.000000       62.404899 
      57       50.030000       62.404899 
      57       50.010000       62.444710 
      57       50.010000       62.364129 
      57       50.030000       62.219767 
      57       50.010000       62.123479 
      57       50.020000       62.157514 
      57       49.980000       62.273986 
      57       50.000000       62.300414 
      57       50.000000       62.300001 
      57       50.030000       62.300001 
      57       50.040000       62.332707 
      57       50.030000       62.291415 
      58       50.010000       62.214521 
      58       49.970000       62.217456 
      58       49.980000       62.265569 
      58       50.000000       62.265569 
      58       50.090000       62.265569 
      58       49.990000       62.264533 
      58       49.970000       62.289286 
      58       50.040000       62.319655 
      58       50.020000       62.310792 
      58       49.970000       62.235425 
      58       50.040000       62.178614 
      58       49.960000       62.253403 
      58       49.990000       62.322836 
      58       50.020000       62.300941 
      58       50.020000       62.322897 
      59       49.970000       62.382444 
      59       50.020000       62.375773 
      59       50.040000       62.340821 
      59       49.990000       62.340821 
      59       49.990000       62.340821 
      59       49.970000       62.317870 
      59       49.990000       62.317870 
      59       50.000000       62.317870 
      59       50.020000       62.257472 
      59       49.970000       62.191916 
      59       49.960000       62.160644 
      59       50.010000       62.135421 
      59       49.940000       62.135421 
      59       50.010000       62.131074 
      59       50.020000       62.122855 
      60       50.050000       62.173683 
      60       49.950000       62.261322 
      60       49.990000       62.296453 
      60       50.010000       62.285160 
      60       49.950000       62.279857 
      60       49.980000       62.267248 
      60       50.000000       62.286639 
      60       50.010000       62.286639 
      60       49.980000       62.307529 
      60       49.950000       62.268257 
      60       49.920000       62.251095 
      60       50.040000       62.289269 
      60       49.970000       62.289269 
      60       49.990000       62.268963 
      60       49.980000       62.213161 
      60       50.010000       62.159136 
      61       49.970000       62.137417 
