

 time    ||    gripping force   ||   raspberry measurement 

      0       0.030000       -796.911111 
      0       0.030000       -796.911111 
      0       0.000000       -796.911111 
      0       0.120000       -796.911111 
      0       0.020000       -796.911111 
      0       0.030000       -796.911111 
      0       0.050000       -796.911111 
      0       0.030000       -796.911111 
      0       0.030000       -796.911111 
      0       0.060000       -796.911106 
      0       1.270000       -796.909923 
      0       0.050000       -796.803380 
      0       0.130000       -793.275145 
      0       0.130000       -750.291581 
      0       0.180000       -557.641629 
      0       0.240000       -239.961137 
      0       0.000000       -47.169689 
      1       0.170000       -4.069057 
      1       0.000000       -0.504648 
      1       0.210000       -0.406952 
      1       0.110000       -0.488797 
      1       0.160000       -0.573733 
      1       0.110000       -0.629087 
      1       0.210000       -0.637824 
      1       0.140000       -0.582479 
      1       0.020000       -0.505266 
      2       0.120000       -0.495937 
      2       0.080000       -0.519607 
      2       0.000000       -0.568497 
      2       0.030000       -0.556330 
      2       0.050000       -0.460928 
      2       0.110000       -0.439499 
      2       0.040000       -0.502994 
      2       0.070000       -0.566769 
      2       0.090000       -0.636579 
      2       0.040000       -0.694881 
      2       0.020000       -0.624505 
      3       0.040000       -0.523305 
      3       0.090000       -0.529104 
      3       0.110000       -0.595393 
      3       0.170000       -0.625904 
      3       0.140000       -0.618653 
      3       0.120000       -0.625447 
      3       0.140000       -0.589510 
      3       0.310000       -0.498178 
      3       0.310000       -0.443017 
      3       0.220000       -0.487850 
      4       0.210000       -0.546515 
      4       0.390000       -0.569829 
      5       12.180000       -0.609267 
      5       15.860000       -0.628491 
      5       20.260000       -0.551055 
      5       21.180000       -0.443916 
      5       21.230000       -0.446215 
      5       21.130000       -0.560469 
      5       21.000000       -0.680151 
      5       20.850000       -0.711067 
      5       20.700000       -0.740746 
      5       20.690000       -0.846005 
      5       20.600000       -0.909263 
      6       20.530000       -0.888641 
      6       20.420000       -0.867628 
      6       20.390000       -0.860803 
      6       20.360000       -0.860496 
      6       20.400000       -0.843734 
      6       20.240000       -0.783392 
      6       20.270000       -0.711068 
      6       20.210000       -0.723787 
      6       20.210000       -0.763015 
      6       20.270000       -0.747471 
      6       20.110000       -0.685099 
      6       20.160000       -0.692765 
      7       20.070000       -0.722305 
      7       20.120000       -0.719190 
      7       20.060000       -0.737562 
      7       20.080000       -0.754102 
      7       20.060000       -0.750585 
      7       20.040000       -0.711980 
      7       20.020000       -0.682011 
      7       20.010000       -0.711107 
      7       19.970000       -0.740203 
      7       19.980000       -0.710221 
      7       19.950000       -0.671226 
      7       19.950000       -0.664015 
      7       19.880000       -0.675725 
      8       19.880000       -0.723593 
      8       19.890000       -0.730817 
      8       19.890000       -0.644744 
      8       19.870000       -0.591482 
      8       19.910000       -0.631788 
      8       19.870000       -0.740230 
      8       19.850000       -0.790439 
      8       19.850000       -0.772943 
      8       19.830000       -0.783339 
      8       19.830000       -0.780098 
      8       19.830000       -0.772651 
      9       19.790000       -0.790870 
      9       19.790000       -0.831759 
      9       19.760000       -0.853619 
      9       19.780000       -0.849671 
      9       19.780000       -0.800725 
      9       19.770000       -0.727761 
      9       19.740000       -0.701292 
      9       19.770000       -0.722762 
      9       19.720000       -0.716533 
      9       19.730000       -0.724979 
      10       19.750000       -0.771641 
      10       19.690000       -0.767541 
      10       19.710000       -0.713835 
      10       19.700000       -0.666770 
      10       19.680000       -0.712033 
      10       19.690000       -0.767585 
      10       19.670000       -0.772540 
      10       19.740000       -0.802110 
      10       19.740000       -0.800295 
      10       19.710000       -0.770313 
      10       19.750000       -0.754634 
      11       19.750000       -0.740357 
      11       19.750000       -0.720648 
      11       19.690000       -0.715114 
      11       19.710000       -0.741305 
      11       19.800000       -0.744938 
      11       19.680000       -0.757961 
      11       19.720000       -0.762279 
      11       19.660000       -0.732564 
      11       19.720000       -0.736271 
      12       19.680000       -0.739130 
      12       19.730000       -0.700220 
      12       19.680000       -0.671524 
      12       19.680000       -0.658066 
      12       19.640000       -0.652471 
      12       19.710000       -0.644496 
      12       19.720000       -0.639049 
      12       19.720000       -0.626329 
      12       19.690000       -0.602893 
      12       19.740000       -0.580338 
      13       19.640000       -0.596817 
      13       19.690000       -0.631113 
      13       19.700000       -0.659964 
      13       19.740000       -0.629275 
      13       19.670000       -0.561038 
      13       19.710000       -0.549537 
      13       19.730000       -0.595169 
      13       19.680000       -0.619273 
      13       19.660000       -0.640282 
      13       19.680000       -0.647036 
      13       19.660000       -0.628313 
      13       19.610000       -0.605491 
      14       19.680000       -0.616414 
      14       19.680000       -0.627436 
      14       19.680000       -0.627505 
      14       19.610000       -0.620670 
      14       19.730000       -0.621219 
      14       19.670000       -0.636687 
      14       19.610000       -0.661400 
      14       19.650000       -0.639246 
      14       19.590000       -0.598690 
      15       19.480000       -0.584289 
      15       19.460000       -0.570865 
      15       19.540000       -0.543450 
      15       19.510000       -0.506935 
      15       19.540000       -0.517406 
      15       19.560000       -0.546382 
      15       19.500000       -0.548881 
      15       19.510000       -0.545229 
      16       19.540000       -0.533472 
      16       19.520000       -0.510952 
      16       19.560000       -0.488865 
      16       19.560000       -0.500515 
      16       19.570000       -0.507789 
      16       19.590000       -0.490406 
      16       19.550000       -0.468125 
      16       19.510000       -0.471021 
      16       19.530000       -0.450770 
      17       19.540000       -0.435629 
      17       19.520000       -0.462778 
      17       19.520000       -0.479830 
      17       19.510000       -0.481337 
      17       19.460000       -0.470219 
      17       19.510000       -0.443850 
      17       19.490000       -0.408331 
      17       19.500000       -0.419762 
      17       19.510000       -0.448850 
      17       19.520000       -0.442113 
      17       19.520000       -0.398266 
      18       19.490000       -0.348527 
      18       19.530000       -0.385522 
      18       19.500000       -0.467154 
      18       19.510000       -0.492329 
      18       19.490000       -0.457588 
      18       19.540000       -0.431346 
      18       19.570000       -0.419452 
      18       19.420000       -0.406842 
      18       19.550000       -0.368584 
      18       19.550000       -0.348507 
      18       19.500000       -0.366263 
      19       19.560000       -0.346222 
      19       19.590000       -0.309023 
      19       19.540000       -0.303301 
      19       19.630000       -0.321961 
      19       19.540000       -0.359608 
      20       19.590000       -0.377692 
      20       19.630000       -0.370871 
      20       19.610000       -0.328957 
      20       19.570000       -0.296025 
      20       19.670000       -0.322721 
      20       19.590000       -0.358138 
      20       19.650000       -0.362945 
      20       19.590000       -0.361591 
      20       19.610000       -0.356577 
      20       19.620000       -0.354436 
      21       19.630000       -0.349467 
      21       19.580000       -0.347370 
      21       19.610000       -0.341621 
      21       19.530000       -0.329790 
      21       19.600000       -0.287010 
      21       19.600000       -0.245083 
      21       19.640000       -0.239563 
      21       19.600000       -0.258847 
      21       19.610000       -0.297152 
      22       19.590000       -0.316711 
      22       19.580000       -0.320313 
      22       19.590000       -0.316124 
      22       19.590000       -0.314374 
      22       19.550000       -0.308969 
      22       19.520000       -0.297902 
      22       19.640000       -0.260747 
      23       19.590000       -0.241748 
      23       19.640000       -0.260598 
      23       19.580000       -0.242452 
      23       19.570000       -0.215690 
      23       19.610000       -0.243628 
      24       19.590000       -0.279849 
      24       19.620000       -0.285440 
      24       19.550000       -0.284860 
      24       19.600000       -0.280601 
      24       19.590000       -0.278793 
      24       19.690000       -0.269675 
      24       19.540000       -0.249792 
      25       19.570000       -0.230317 
      25       19.590000       -0.244552 
      25       19.600000       -0.254387 
      25       19.600000       -0.239563 
      25       19.620000       -0.220629 
      25       19.610000       -0.235400 
      26       19.610000       -0.250232 
      26       19.540000       -0.254060 
      26       19.560000       -0.250521 
      26       19.570000       -0.249453 
      26       19.600000       -0.245534 
      26       19.580000       -0.244503 
      26       19.580000       -0.240634 
      27       19.600000       -0.239625 
      27       19.610000       -0.234967 
      27       19.560000       -0.224641 
      27       19.600000       -0.188245 
      27       19.600000       -0.170822 
      27       19.580000       -0.200207 
      27       19.600000       -0.220311 
      27       19.550000       -0.229757 
      27       19.600000       -0.245083 
      27       19.560000       -0.259584 
      28       19.610000       -0.239186 
      28       19.570000       -0.210181 
      28       19.550000       -0.168172 
      28       19.580000       -0.140712 
      28       19.640000       -0.133152 
      28       19.510000       -0.122420 
      28       19.560000       -0.159019 
      28       19.570000       -0.193663 
      28       19.560000       -0.202977 
      29       19.530000       -0.200374 
      29       19.560000       -0.199820 
      29       19.590000       -0.196398 
      29       19.590000       -0.195858 
      29       19.600000       -0.192463 
      29       19.600000       -0.191537 
      29       19.630000       -0.183291 
      29       19.580000       -0.164272 
      29       19.590000       -0.145652 
      30       19.560000       -0.160734 
      30       19.620000       -0.171406 
      30       19.560000       -0.157412 
      30       19.530000       -0.139286 
      30       19.590000       -0.154432 
      31       19.600000       -0.164755 
      31       19.570000       -0.146334 
      31       19.500000       -0.114216 
      31       19.530000       -0.128627 
      31       19.580000       -0.161491 
      31       19.560000       -0.167852 
      31       19.610000       -0.168436 
      31       19.600000       -0.165354 
      31       19.510000       -0.165124 
      31       19.570000       -0.162036 
      32       19.560000       -0.161414 
      32       19.540000       -0.153470 
      32       19.540000       -0.134749 
      32       19.580000       -0.116437 
      32       19.530000       -0.132237 
      32       19.630000       -0.148101 
      32       19.550000       -0.152950 
      32       19.550000       -0.150422 
      32       19.530000       -0.150328 
      33       19.540000       -0.146550 
      33       19.640000       -0.136696 
      33       19.540000       -0.096685 
      33       19.610000       -0.066062 
      33       19.610000       -0.095084 
      33       19.620000       -0.133628 
      33       19.570000       -0.150493 
      33       19.540000       -0.188483 
      33       19.610000       -0.216268 
      33       19.490000       -0.184024 
      34       19.670000       -0.138633 
      34       19.570000       -0.110248 
      34       19.520000       -0.091330 
      34       19.560000       -0.107355 
      34       19.570000       -0.123467 
      34       19.540000       -0.128563 
      34       19.590000       -0.126279 
      34       19.610000       -0.126453 
      34       19.600000       -0.123765 
      34       19.630000       -0.123951 
      35       19.670000       -0.121288 
      35       19.620000       -0.121499 
      35       19.640000       -0.118860 
      35       19.670000       -0.119108 
      35       19.640000       -0.116932 
      35       19.700000       -0.122505 
      35       19.670000       -0.142960 
      35       19.680000       -0.172611 
      36       19.650000       -0.155345 
      36       19.760000       -0.119641 
      36       19.680000       -0.110468 
      36       19.670000       -0.107102 
      36       19.660000       -0.107429 
      36       19.680000       -0.104957 
      36       19.630000       -0.106182 
      36       19.690000       -0.113509 
      36       19.700000       -0.151018 
      36       19.650000       -0.179164 
      37       19.690000       -0.147716 
      37       19.660000       -0.107595 
      37       19.680000       -0.098130 
      37       19.680000       -0.094874 
      37       19.670000       -0.095297 
      38       19.680000       -0.092081 
      38       19.640000       -0.083184 
      38       19.680000       -0.048202 
      38       19.720000       -0.032180 
      38       19.680000       -0.062952 
      38       19.710000       -0.084441 
      38       19.710000       -0.095658 
      38       19.740000       -0.116833 
      38       19.670000       -0.147197 
      39       19.730000       -0.135504 
      39       19.770000       -0.123102 
      39       19.720000       -0.143552 
      39       19.730000       -0.125738 
      39       19.750000       -0.090331 
      39       19.720000       -0.082302 
      39       19.780000       -0.089030 
      39       19.690000       -0.126757 
      40       19.690000       -0.155146 
      40       19.730000       -0.123938 
      40       19.780000       -0.084081 
      40       19.670000       -0.075703 
      41       19.800000       -0.082483 
      41       19.750000       -0.120276 
      42       19.730000       -0.148730 
      42       19.740000       -0.117586 
      42       19.750000       -0.077806 
      42       19.780000       -0.069929 
      42       19.700000       -0.082112 
      43       19.710000       -0.143838 
      43       19.760000       -0.210700 
      43       19.710000       -0.193079 
      43       19.720000       -0.120629 
      43       19.760000       -0.080366 
      43       19.700000       -0.107530 
      43       19.760000       -0.135260 
      43       19.810000       -0.105062 
      44       19.780000       -0.074767 
      44       19.700000       -0.098344 
      44       19.710000       -0.111624 
      44       19.750000       -0.074495 
      44       19.700000       -0.033460 
      44       19.700000       -0.010842 
      44       19.720000       -0.027260 
      44       19.650000       -0.044160 
      44       19.800000       -0.050048 
      44       19.760000       -0.048549 
      45       19.750000       -0.049501 
      45       19.770000       -0.047609 
      45       19.760000       -0.049394 
      46       19.820000       -0.056877 
      46       19.790000       -0.090458 
      46       19.760000       -0.105094 
      46       19.720000       -0.072962 
      46       19.730000       -0.050553 
      46       19.770000       -0.043305 
      46       19.700000       -0.043870 
      46       19.770000       -0.042420 
      46       19.750000       -0.048326 
      47       19.810000       -0.065029 
      47       19.810000       -0.081342 
      47       19.810000       -0.063565 
      47       19.780000       -0.045743 
      47       19.800000       -0.038955 
      47       19.760000       -0.039564 
      47       19.800000       -0.037732 
      48       19.770000       -0.038778 
      48       19.800000       -0.036993 
      48       19.830000       -0.038885 
      48       19.790000       -0.046472 
      48       19.780000       -0.080144 
      48       19.850000       -0.094445 
      49       19.830000       -0.057101 
      49       19.850000       -0.011773 
      49       19.820000       0.023893 
      49       19.800000       -0.001260 
      49       19.880000       -0.072604 
      49       19.800000       -0.110935 
      49       19.840000       -0.081007 
      49       19.840000       -0.041579 
      49       19.920000       -0.032775 
      49       19.900000       -0.030172 
      50       19.850000       -0.031268 
      50       19.810000       -0.029531 
      50       19.830000       -0.030660 
      50       19.850000       -0.028929 
      50       19.870000       -0.030064 
      50       19.840000       -0.028339 
      50       19.840000       -0.029480 
      51       19.840000       -0.027761 
      51       19.870000       -0.028881 
      51       19.820000       -0.026330 
      51       19.860000       -0.018091 
      51       19.930000       0.016240 
      52       19.830000       0.031618 
      52       19.850000       0.000221 
      52       19.870000       -0.021461 
      52       19.810000       -0.027989 
      52       19.870000       -0.026723 
      52       19.840000       -0.027893 
      52       19.830000       -0.026191 
      52       19.790000       -0.027353 
      52       19.840000       -0.025655 
      53       19.900000       -0.026823 
      53       19.920000       -0.025130 
      53       19.880000       -0.026303 
      53       19.870000       -0.024616 
      54       19.840000       -0.025794 
      54       19.860000       -0.024112 
      54       19.830000       -0.025295 
      54       19.860000       -0.023618 
      54       19.890000       -0.024806 
      54       19.910000       -0.023160 
      54       19.810000       -0.025204 
      54       19.820000       -0.033340 
      55       19.840000       -0.071651 
      55       19.830000       -0.100591 
      55       19.830000       -0.069929 
      55       19.830000       -0.030612 
      56       19.790000       -0.022768 
      56       19.840000       -0.030078 
      56       19.880000       -0.068395 
      56       19.780000       -0.097367 
      56       19.930000       -0.066737 
      56       19.780000       -0.027426 
      56       19.890000       -0.018763 
      57       19.850000       -0.016300 
      57       19.920000       -0.017535 
      57       19.730000       -0.015935 
      57       19.830000       -0.017200 
      57       19.800000       -0.015604 
      57       19.890000       -0.016885 
      57       19.840000       -0.015731 
      58       19.880000       -0.022303 
      58       19.830000       -0.043321 
      59       19.850000       -0.068650 
      59       19.810000       -0.029319 
      59       19.850000       0.034780 
      59       19.900000       0.028266 
      59       19.850000       -0.006180 
      60       19.840000       -0.023907 
      60       19.820000       -0.064001 
      60       19.880000       -0.102856 
      60       19.830000       -0.109391 
      60       19.880000       -0.100760 
      60       19.790000       -0.061134 
      60       19.800000       -0.030841 
