Human trial picking the raspberry twin 

 time    ||     output compensated 

      0       -800.950000 
      0       -800.950000 
      0       -800.950000 
      0       -800.950000 
      0       -800.950000 
      0       -800.950000 
      0       -800.950000 
      0       -800.950000 
      0       -800.950000 
      0       -800.949995 
      0       -800.948804 
      0       -800.841593 
      0       -797.291253 
      0       -754.039546 
      0       -560.202627 
      0       -240.639133 
      0       -46.855508 
      0       -3.648208 
      0       -0.106784 
      0       -0.001884 
      0       0.000719 
      0       -0.000715 
      0       0.000723 
      0       -0.000715 
      0       0.000723 
      0       -0.000715 
      1       0.000723 
      1       -0.000715 
      1       0.000723 
      1       -0.000715 
      1       0.000723 
      1       -0.000728 
      1       0.000280 
      1       -0.006114 
      1       -0.023473 
      1       -0.040582 
      1       -0.022587 
      1       0.004684 
      1       0.048674 
      1       0.079060 
      1       0.049117 
      1       0.010083 
      1       0.001610 
      1       -0.000688 
      1       0.000724 
      1       -0.000715 
      1       0.000723 
      1       -0.000715 
      1       0.000723 
      1       -0.000715 
      1       0.000723 
      1       -0.000715 
      1       0.000723 
      2       -0.000715 
      2       0.000723 
      2       -0.000715 
      2       0.000723 
      2       -0.000715 
      2       0.000723 
      2       -0.000715 
      2       0.000723 
      2       -0.000715 
      2       0.000724 
      2       -0.000688 
      2       0.001610 
      2       0.010083 
      3       0.049118 
      3       0.079074 
      3       0.049118 
      3       0.010083 
      3       0.001610 
      3       -0.000688 
      3       0.000724 
      3       -0.000715 
      3       0.000723 
      3       -0.000715 
      3       0.000723 
      3       -0.000715 
      3       0.000723 
      3       -0.000715 
      3       0.000723 
      3       -0.000715 
      3       0.000723 
      3       -0.000715 
      3       0.000723 
      3       -0.000715 
      3       0.000723 
      3       -0.000715 
      3       0.000723 
      3       -0.000715 
      3       0.000723 
      3       -0.000715 
      4       0.000723 
      4       -0.000715 
      4       0.000723 
      4       -0.000728 
      4       0.000280 
      4       -0.006114 
      4       -0.023474 
      4       -0.040609 
      4       -0.023474 
      4       -0.006114 
      4       0.000280 
      4       -0.000728 
      4       0.000723 
      4       -0.000715 
      4       0.000724 
      4       -0.000688 
      4       0.001610 
      4       0.010083 
      4       0.049118 
      4       0.079074 
      5       0.049118 
      5       0.010083 
      5       0.001610 
      5       -0.000688 
      5       0.000717 
      5       -0.000715 
      5       0.000716 
      5       -0.000715 
      5       0.000716 
      5       -0.000715 
      5       0.000716 
      5       -0.000715 
      5       0.000716 
      5       -0.000715 
      6       0.000716 
      6       -0.000715 
      6       0.000716 
      6       -0.000728 
      6       0.000278 
      6       -0.006056 
      6       -0.023181 
      6       -0.039913 
      6       -0.022550 
      6       -0.005139 
      6       0.001243 
      6       0.000259 
      6       0.002599 
      6       0.012782 
      6       0.074847 
      6       0.225450 
      6       0.461496 
      6       0.674780 
      6       0.775982 
      6       0.861522 
      6       1.009031 
      6       1.214886 
      6       1.477550 
      6       1.682395 
      6       1.771724 
      6       1.848856 
      6       1.930458 
      6       1.973134 
      6       2.019718 
      6       2.065105 
      6       2.094633 
      6       2.139637 
      6       2.243957 
      6       2.431481 
      6       2.570739 
      6       2.644923 
      6       2.704880 
      6       2.800073 
      6       2.903064 
      6       2.958309 
      7       2.968112 
      7       2.970450 
      7       2.969038 
      7       2.970477 
      7       2.969039 
      7       2.970477 
      7       2.969038 
      7       2.970436 
      7       2.967668 
      7       2.952883 
      7       2.878020 
      7       2.750711 
      7       2.648607 
      7       2.636330 
      7       2.690714 
      7       2.719604 
      7       2.682617 
      7       2.598220 
      7       2.610067 
      7       2.671281 
      7       2.758782 
      7       2.869787 
      7       2.881838 
      7       2.686398 
      7       2.373608 
      7       2.133753 
      7       1.956233 
      7       1.841934 
      7       1.878121 
      7       1.948881 
      7       1.961424 
      7       1.940371 
      7       1.899118 
      7       1.877246 
      7       1.881207 
      7       1.930597 
      7       2.008987 
      7       2.060566 
      8       2.090689 
      8       2.180737 
      8       2.310828 
      8       2.411577 
      8       2.490230 
      8       2.537492 
      8       2.575864 
      8       2.602026 
      8       2.569062 
      8       2.367237 
      8       2.171990 
      8       2.140566 
      8       2.265117 
      8       2.396957 
      8       2.461398 
      8       2.577677 
      8       2.701193 
      8       2.778424 
      8       2.783700 
      8       2.729499 
      8       2.541200 
      8       2.276445 
      8       2.180864 
      8       2.213165 
      8       2.242625 
      8       2.278230 
      8       2.329102 
      8       2.435596 
      8       2.579283 
      8       2.747979 
      8       2.762629 
      8       2.689845 
      8       2.732732 
      8       2.824710 
      8       2.862324 
      8       2.875836 
      8       2.899105 
      8       2.941379 
      8       2.976319 
      8       3.049519 
      8       3.222388 
      8       3.484742 
      8       3.669075 
      9       3.414977 
      9       2.272687 
      9       0.528399 
      9       -0.283852 
      9       0.462732 
      9       1.192986 
      9       0.956040 
      9       0.302652 
      9       -0.327477 
      9       -0.996962 
      9       -1.638968 
      9       -2.075946 
      9       -2.383245 
      9       -2.653765 
      9       -2.846122 
      9       -2.918935 
      9       -2.930981 
      9       -2.943688 
      9       -2.984412 
      9       -3.031504 
      9       -3.000110 
      9       -2.946817 
      9       -2.933804 
      9       -2.931117 
      9       -2.933415 
      9       -2.943204 
      9       -2.997966 
      9       -3.094267 
      9       -3.150289 
      9       -3.110451 
      9       -3.071430 
      9       -3.073269 
      9       -3.049914 
      9       -3.014563 
      9       -3.001967 
      9       -3.051729 
      9       -3.086184 
      9       -3.058899 
      9       -3.027935 
      9       -2.988081 
      9       -2.971940 
      10       -3.003295 
      10       -3.024347 
      10       -3.021690 
      10       -2.988497 
      10       -2.982712 
      10       -3.051272 
      10       -3.099609 
      10       -3.056202 
      10       -3.001080 
      10       -2.999252 
      10       -2.987651 
      10       -2.995668 
      10       -3.042746 
      10       -3.043561 
      10       -3.007378 
      10       -2.961559 
      10       -2.939270 
      10       -2.943204 
      10       -2.992150 
      10       -3.065074 
      10       -3.090266 
      10       -3.054333 
      10       -3.008277 
      10       -2.962015 
      10       -2.944213 
      10       -2.961586 
      10       -3.003362 
      10       -3.036905 
      10       -3.092110 
      10       -3.170003 
      10       -3.208635 
      10       -3.165075 
      10       -3.073795 
      10       -3.027950 
      10       -3.059897 
      10       -3.098295 
      10       -3.118119 
      10       -3.090725 
      10       -3.093480 
      10       -3.133804 
      10       -3.184426 
      10       -3.241859 
      10       -3.243991 
      10       -3.213247 
      10       -3.192041 
      10       -3.214119 
      10       -3.254333 
      10       -3.284425 
      10       -3.235048 
      10       -3.123063 
      10       -3.058972 
      11       -3.077283 
      11       -3.091664 
      11       -3.060646 
      11       -3.043273 
      11       -3.050304 
      11       -3.048198 
      11       -3.015339 
      11       -3.013233 
      11       -3.020238 
      11       -3.002019 
      11       -2.961546 
      11       -2.944213 
      11       -2.962002 
      11       -3.007847 
      11       -3.049377 
      11       -3.040754 
      11       -2.988503 
      11       -2.918380 
      11       -2.854460 
      11       -2.854898 
      11       -2.906504 
      11       -2.894815 
      11       -2.790441 
      11       -2.736802 
      11       -2.737840 
      11       -2.731277 
      11       -2.703131 
      11       -2.643673 
      11       -2.617294 
      11       -2.623078 
      11       -2.678907 
      11       -2.733305 
      11       -2.724156 
      11       -2.696503 
      11       -2.581638 
      11       -2.433910 
      11       -2.396636 
      11       -2.437431 
      11       -2.451636 
      11       -2.398300 
      11       -2.336112 
      11       -2.308870 
      11       -2.298074 
      11       -2.283672 
      11       -2.270883 
      11       -2.301125 
      11       -2.293489 
      11       -2.240078 
      11       -2.182115 
      11       -2.170503 
      11       -2.163474 
      11       -2.124489 
      12       -2.084704 
      12       -2.060652 
      12       -2.124463 
      12       -2.206902 
      12       -2.186669 
      12       -2.062765 
      12       -1.974271 
      12       -1.951829 
      12       -1.923044 
      12       -1.920166 
      12       -1.921888 
      12       -1.914992 
      12       -1.943479 
      12       -1.976665 
      12       -1.973455 
      12       -1.894616 
      12       -1.863773 
      12       -1.840625 
      12       -1.756150 
      12       -1.704003 
      12       -1.721920 
      12       -1.773548 
      12       -1.754349 
      12       -1.669491 
      12       -1.599020 
      12       -1.550686 
      12       -1.503196 
      12       -1.502839 
      12       -1.512560 
      12       -1.472659 
      12       -1.442405 
      12       -1.450126 
      12       -1.429898 
      12       -1.428494 
      12       -1.475823 
      12       -1.473961 
      12       -1.453494 
      12       -1.461078 
      12       -1.430115 
      12       -1.382050 
      12       -1.364720 
      12       -1.362076 
      12       -1.341439 
      12       -1.271591 
      12       -1.218572 
      12       -1.204111 
      12       -1.225382 
      12       -1.229493 
      12       -1.195970 
      13       -1.200827 
      13       -1.227902 
      13       -1.242235 
      13       -1.248466 
      13       -1.228856 
      13       -1.236602 
      13       -1.248973 
      13       -1.205976 
      13       -1.150353 
      13       -1.111876 
      13       -1.083780 
      13       -1.099268 
      13       -1.137775 
      13       -1.145211 
      13       -1.086565 
      13       -1.060376 
      13       -1.076181 
      13       -1.091345 
      13       -1.082477 
      13       -1.070019 
      13       -1.037449 
      13       -1.009476 
      13       -0.993450 
      13       -0.988995 
      13       -0.991358 
      13       -0.979360 
      13       -0.931756 
      13       -0.898128 
      13       -0.877075 
      13       -0.910991 
      13       -0.960781 
      13       -0.921942 
      13       -0.849728 
      13       -0.846546 
      13       -0.861554 
      13       -0.822830 
      13       -0.776383 
      13       -0.765576 
      13       -0.779600 
      13       -0.812671 
      13       -0.826224 
      13       -0.814918 
      13       -0.768550 
      13       -0.730796 
      13       -0.748238 
      13       -0.760790 
      13       -0.746031 
      13       -0.756399 
      13       -0.766472 
      13       -0.770018 
      13       -0.779078 
      14       -0.778426 
      14       -0.715606 
      14       -0.650345 
      14       -0.630520 
      14       -0.621541 
      14       -0.617561 
      14       -0.619774 
      14       -0.652233 
      14       -0.675806 
      14       -0.644763 
      14       -0.624491 
      14       -0.659604 
      14       -0.717253 
      14       -0.771819 
      14       -0.770240 
      14       -0.735526 
      14       -0.660253 
      14       -0.574248 
      14       -0.536123 
      14       -0.523167 
      14       -0.519746 
      14       -0.522950 
      14       -0.557215 
      14       -0.591112 
      14       -0.592765 
      14       -0.579300 
      14       -0.534876 
      14       -0.499432 
      14       -0.518749 
      14       -0.528277 
      14       -0.492738 
      14       -0.475944 
      14       -0.501661 
      14       -0.528711 
      14       -0.490906 
      14       -0.450201 
      14       -0.434462 
      14       -0.430690 
      14       -0.424933 
      14       -0.422108 
      14       -0.416463 
      14       -0.413722 
      14       -0.408161 
      14       -0.405503 
      14       -0.400024 
      15       -0.397448 
      15       -0.392049 
      15       -0.389553 
      15       -0.384233 
      15       -0.381815 
      15       -0.376573 
      15       -0.374231 
      15       -0.369065 
      15       -0.366812 
      15       -0.362158 
      15       -0.365306 
      15       -0.384184 
      15       -0.421261 
      15       -0.439579 
      15       -0.441927 
      15       -0.435684 
      15       -0.423351 
      15       -0.384555 
      15       -0.360702 
      15       -0.374871 
      15       -0.399953 
      15       -0.443399 
      15       -0.428344 
      15       -0.392980 
      15       -0.393532 
      15       -0.369558 
      15       -0.345980 
      15       -0.325143 
      15       -0.337006 
      15       -0.349151 
      15       -0.332789 
      15       -0.324146 
      15       -0.308022 
      15       -0.320043 
      15       -0.327464 
      15       -0.292683 
      15       -0.268063 
      15       -0.258640 
      15       -0.257039 
      15       -0.253031 
      15       -0.251938 
      15       -0.248420 
      15       -0.252266 
      15       -0.266930 
      15       -0.281238 
      15       -0.261887 
      16       -0.246988 
      16       -0.256798 
      16       -0.270768 
      16       -0.251084 
      16       -0.231387 
      16       -0.222769 
      16       -0.222378 
      16       -0.228117 
      16       -0.259986 
      16       -0.272939 
      16       -0.239568 
      16       -0.220838 
      16       -0.235842 
      16       -0.273964 
      16       -0.293729 
      16       -0.297149 
      16       -0.288711 
      16       -0.273531 
      16       -0.271604 
      16       -0.291979 
      16       -0.257566 
      16       -0.221266 
      16       -0.231962 
      16       -0.254405 
      16       -0.294552 
      16       -0.311449 
      16       -0.301769 
      16       -0.239249 
      16       -0.178764 
      16       -0.168549 
      16       -0.182772 
      16       -0.197882 
      16       -0.179365 
      16       -0.165291 
      16       -0.175918 
      16       -0.190697 
      16       -0.171813 
      16       -0.152909 
      16       -0.145049 
      16       -0.144597 
      16       -0.141714 
      16       -0.141721 
      16       -0.138880 
      17       -0.138915 
      17       -0.136102 
      17       -0.136165 
      17       -0.133379 
      17       -0.133483 
      17       -0.131149 
      17       -0.136169 
      17       -0.152019 
      17       -0.168301 
      17       -0.159054 
      17       -0.173004 
      17       -0.181907 
      17       -0.148582 
      17       -0.125404 
      17       -0.117433 
      17       -0.118082 
      17       -0.124878 
      17       -0.158218 
      17       -0.177521 
      17       -0.168607 
      17       -0.184311 
      17       -0.194774 
      17       -0.180547 
      17       -0.162189 
      17       -0.177106 
      17       -0.187176 
      17       -0.167679 
      17       -0.125509 
      17       -0.101749 
      17       -0.094401 
      17       -0.099788 
      17       -0.121307 
      17       -0.160987 
      17       -0.181057 
      17       -0.176177 
      17       -0.135358 
      17       -0.094523 
      17       -0.085163 
      17       -0.082036 
      17       -0.082627 
      17       -0.080802 
      17       -0.086324 
      17       -0.102647 
      17       -0.118584 
      18       -0.100434 
      18       -0.082244 
      18       -0.075091 
      18       -0.075339 
      18       -0.073148 
      18       -0.073841 
      18       -0.071718 
      18       -0.073688 
      18       -0.085834 
      18       -0.137736 
      18       -0.167452 
      18       -0.119582 
      18       -0.083003 
      18       -0.089134 
      18       -0.104343 
      18       -0.086309 
      18       -0.068259 
      18       -0.061246 
      18       -0.061632 
      18       -0.059579 
      18       -0.060407 
      18       -0.058405 
      18       -0.060083 
      18       -0.067459 
      18       -0.100934 
      18       -0.115465 
      18       -0.083230 
      18       -0.060718 
      18       -0.053368 
      18       -0.053820 
      18       -0.051844 
      18       -0.052750 
      18       -0.050798 
      18       -0.051714 
      18       -0.049773 
      19       -0.050699 
      19       -0.048768 
      19       -0.049705 
      19       -0.047784 
      19       -0.048730 
      19       -0.046819 
      19       -0.047774 
      19       -0.045873 
      19       -0.046838 
      19       -0.044946 
      19       -0.045933 
      19       -0.044475 
      19       -0.050361 
      19       -0.067043 
      19       -0.083337 
      19       -0.065540 
      19       -0.047698 
      19       -0.040891 
      19       -0.041480 
      19       -0.039629 
      19       -0.040656 
      19       -0.038852 
      19       -0.040725 
      19       -0.048294 
      19       -0.081962 
      19       -0.096682 
      19       -0.064635 
      19       -0.042309 
      20       -0.035143 
      20       -0.035777 
      20       -0.033982 
      20       -0.035066 
      20       -0.033291 
      20       -0.034382 
      20       -0.032615 
      20       -0.033712 
      20       -0.031951 
      20       -0.033056 
      20       -0.031301 
      20       -0.032412 
      20       -0.030664 
      20       -0.031781 
      20       -0.030040 
      20       -0.031163 
      20       -0.029428 
      20       -0.030557 
