

 time    ||    gripping force   ||   raspberry measurement 

      0       0.080000       -794.941667 
      0       0.090000       -794.941667 
      0       3.100000       -794.941667 
      0       1.300000       -794.941667 
      0       0.320000       -794.941667 
      0       0.360000       -794.941667 
      0       0.140000       -794.941667 
      0       0.090000       -794.941667 
      0       0.070000       -794.941667 
      0       0.030000       -794.941662 
      0       0.200000       -794.940483 
      0       0.030000       -794.834369 
      1       0.360000       -791.320330 
      1       0.260000       -748.510019 
      1       0.040000       -556.641090 
      1       0.450000       -240.277191 
      1       31.560000       -48.367981 
      1       40.330000       -5.569271 
      1       77.300000       -2.089271 
      1       107.010000       -1.989468 
      1       129.040000       -1.970307 
      2       121.360000       -1.888299 
      2       100.670000       -1.802752 
      2       104.260000       -1.824194 
      2       104.270000       -1.876198 
      2       103.910000       -1.884268 
      2       103.700000       -1.869473 
      2       103.320000       -1.867137 
      2       103.140000       -1.937094 
      2       103.050000       -1.957344 
      3       102.930000       -1.708149 
      3       102.850000       -1.230175 
      3       102.720000       -0.671631 
      3       102.590000       0.023569 
      3       102.150000       0.648838 
      3       101.640000       0.889145 
      3       100.960000       0.719108 
      3       99.770000       0.389696 
      3       99.090000       0.238447 
      3       98.970000       0.265536 
      3       98.920000       0.348173 
      3       98.910000       0.390952 
      4       98.900000       0.389761 
      4       96.950000       0.396366 
      4       96.900000       0.436783 
      4       96.210000       0.400376 
      4       95.530000       0.269149 
      4       95.180000       0.166036 
      5       95.130000       0.165536 
      5       94.580000       0.197829 
      5       94.040000       0.195491 
      5       92.880000       0.154794 
      5       92.790000       0.098233 
      5       92.290000       0.096545 
      5       91.790000       0.131842 
      6       90.470000       0.167749 
      6       90.370000       0.152469 
      6       90.270000       0.117986 
      6       90.030000       0.109930 
      6       89.810000       0.107645 
      7       88.990000       0.109057 
      7       88.970000       0.107618 
      7       88.640000       0.109030 
      7       88.550000       0.106732 
      8       88.020000       0.098232 
      8       87.950000       0.058338 
      8       87.810000       0.018443 
      8       87.710000       0.009944 
      8       87.640000       0.007672 
      8       87.590000       0.009930 
      8       87.400000       0.017987 
      8       87.300000       0.052482 
      9       85.710000       0.068179 
      9       85.510000       0.036785 
      9       84.920000       0.014886 
      10       84.860000       0.008102 
      10       84.800000       0.009957 
      10       84.810000       0.018417 
      10       84.790000       0.057451 
      10       84.780000       0.087407 
      11       84.790000       0.057451 
      11       84.790000       0.018417 
      11       84.740000       0.009943 
      11       84.690000       0.007645 
      11       84.700000       0.009057 
      11       84.670000       0.007618 
      11       84.690000       0.009057 
      11       84.630000       0.007618 
      12       84.630000       0.009057 
      12       84.620000       0.007645 
      12       84.620000       0.009943 
      12       84.550000       0.018417 
      12       84.500000       0.057451 
      13       84.510000       0.087407 
      13       84.450000       0.057451 
      13       84.440000       0.018417 
      13       84.420000       0.009943 
      13       84.380000       0.007645 
      13       84.140000       0.009071 
      13       83.950000       0.008075 
      14       83.900000       0.014886 
      14       83.950000       0.036785 
      14       83.410000       0.068179 
      14       83.360000       0.052482 
      14       83.360000       0.017987 
      14       83.270000       0.009930 
      14       82.960000       0.007645 
      14       82.510000       0.009057 
      15       82.540000       0.007645 
      15       82.360000       0.009943 
      15       82.200000       0.018417 
      16       82.140000       0.057451 
      16       82.150000       0.087407 
      16       82.160000       0.057451 
      16       82.080000       0.018417 
      16       82.000000       0.009943 
      16       82.030000       0.007645 
      17       81.910000       0.008967 
      17       81.880000       0.007453 
      18       81.900000       0.008802 
      18       81.880000       0.007290 
      18       81.790000       0.008641 
      18       81.880000       0.007131 
      18       81.800000       0.008483 
      18       80.040000       0.006975 
      19       78.270000       0.008329 
      19       77.860000       0.006822 
      19       77.640000       0.008177 
      19       77.590000       0.006672 
      19       77.630000       0.008029 
      19       77.580000       0.006511 
      19       77.570000       0.007432 
      19       77.610000       0.000614 
      19       77.710000       -0.021072 
      19       77.710000       -0.051941 
      19       77.740000       -0.035855 
      19       77.750000       -0.000509 
      19       77.810000       0.016873 
      20       77.790000       0.051692 
      20       77.870000       0.066715 
      20       77.800000       0.034117 
      20       77.800000       0.002283 
      20       77.870000       -0.041702 
      20       77.780000       -0.071380 
      20       77.860000       -0.041023 
      20       77.840000       -0.001969 
      21       77.790000       0.006439 
      21       77.820000       0.008623 
      21       77.850000       0.006288 
      21       77.820000       -0.002163 
      22       77.860000       -0.040786 
      22       77.860000       -0.070060 
      22       77.860000       -0.040541 
      22       77.850000       -0.010892 
      22       77.880000       -0.035147 
      22       77.760000       -0.050336 
      22       77.820000       -0.028539 
      22       77.820000       -0.043806 
      22       77.870000       -0.068131 
      23       77.820000       -0.042262 
      23       77.900000       -0.021792 
      23       77.830000       -0.028725 
      23       77.840000       -0.010623 
      23       77.850000       0.006696 
      23       77.890000       0.012959 
      23       77.880000       0.011831 
      24       77.840000       0.013150 
      24       77.870000       0.011595 
      24       77.800000       0.012903 
      24       77.850000       0.011337 
      24       77.850000       0.012222 
      24       77.840000       0.005769 
      25       77.850000       -0.011475 
      25       77.840000       -0.028324 
      25       77.820000       -0.011077 
      25       77.850000       0.006220 
      25       77.870000       0.012488 
      26       77.830000       0.011365 
      26       77.770000       0.012688 
      26       77.860000       0.011138 
      26       77.840000       0.012450 
      26       77.840000       0.010902 
      26       77.790000       0.012190 
      26       77.820000       0.009807 
      26       77.810000       0.001732 
      27       77.770000       -0.032435 
      27       77.820000       -0.047664 
      27       77.810000       -0.016546 
      27       77.770000       -0.000020 
      27       77.780000       -0.016380 
      27       77.780000       -0.046858 
      27       77.840000       -0.030836 
      27       77.800000       0.003622 
      28       77.810000       0.011562 
      28       77.800000       0.013709 
      28       77.770000       0.012174 
      28       77.820000       0.013476 
      28       77.950000       0.011917 
      28       78.150000       0.013222 
      28       78.260000       0.011653 
      28       78.280000       0.012522 
      28       78.250000       0.005654 
      29       78.730000       -0.016083 
      29       79.010000       -0.047002 
      29       79.110000       -0.030992 
      29       79.100000       0.003468 
      30       79.070000       0.011410 
      30       79.150000       0.013557 
      30       79.140000       0.012011 
      30       79.090000       0.012876 
      30       79.100000       0.006005 
      30       79.060000       -0.015735 
      31       79.120000       -0.046658 
      31       79.150000       -0.030651 
      31       79.160000       0.003805 
      31       79.240000       0.011743 
      32       79.380000       0.013888 
      32       79.430000       0.012351 
      32       79.450000       0.013652 
      32       79.470000       0.012091 
      33       79.510000       0.013394 
      33       79.550000       0.011837 
      33       79.580000       0.013142 
      33       79.670000       0.011587 
      34       79.590000       0.012895 
      34       79.660000       0.011342 
      34       79.640000       0.012652 
      34       79.630000       0.011102 
      34       79.620000       0.012415 
      34       79.630000       0.010867 
      34       79.600000       0.012182 
      34       79.630000       0.010636 
      35       79.570000       0.011954 
      35       79.660000       0.010410 
      35       79.680000       0.011730 
      35       79.630000       0.010189 
      35       79.650000       0.011511 
      35       79.600000       0.009972 
      35       79.610000       0.011296 
      35       79.630000       0.009759 
      36       79.540000       0.011086 
      36       79.560000       0.009551 
      36       79.590000       0.010879 
      36       79.630000       0.009347 
      36       79.620000       0.010677 
      37       79.610000       0.009146 
      37       79.630000       0.010479 
      37       79.550000       0.008950 
      37       79.520000       0.010285 
      37       79.620000       0.008758 
      38       79.600000       0.010094 
      38       79.570000       0.008569 
      38       79.590000       0.009908 
      38       79.570000       0.008384 
      39       79.570000       0.009724 
      39       79.560000       0.008190 
      39       79.590000       0.009107 
      39       79.650000       0.002685 
      39       79.620000       -0.014528 
      39       79.630000       -0.031347 
      39       79.600000       -0.014095 
      39       79.630000       0.002394 
      40       80.520000       -0.000700 
      40       80.680000       -0.034418 
      40       80.710000       -0.049614 
      40       80.740000       -0.018476 
      40       80.730000       -0.001930 
      40       80.750000       -0.018272 
      40       80.690000       -0.048731 
      40       80.750000       -0.032690 
      40       80.740000       0.001787 
      40       80.720000       0.009745 
      41       80.710000       0.011910 
      41       80.690000       0.010393 
      41       80.710000       0.011713 
      41       80.690000       0.010172 
      41       80.660000       0.011494 
      41       80.690000       0.009955 
      43       80.630000       0.011280 
      43       80.680000       0.009743 
      43       80.630000       0.011070 
      43       80.650000       0.009535 
      43       80.710000       0.010864 
      43       80.660000       0.009331 
      43       80.650000       0.010662 
      44       80.600000       0.009131 
      44       80.670000       0.010464 
      44       80.670000       0.008935 
      44       80.630000       0.010270 
      44       80.610000       0.008743 
      44       80.620000       0.010079 
      44       80.640000       0.008541 
      44       80.690000       0.009442 
      45       80.640000       0.002604 
      45       80.630000       -0.019102 
      45       80.620000       -0.049991 
      45       80.630000       -0.033951 
      45       80.610000       0.000539 
      45       80.610000       0.008510 
      45       80.660000       0.010687 
      45       80.660000       0.009182 
      46       80.600000       0.010514 
      46       80.610000       0.008985 
      46       80.590000       0.010319 
      46       80.620000       0.008792 
      47       80.630000       0.010128 
      47       80.590000       0.008603 
      47       80.630000       0.009941 
      47       80.620000       0.008417 
      47       80.580000       0.009757 
      47       80.600000       0.008236 
      47       80.590000       0.009577 
      47       80.600000       0.008058 
      48       80.610000       0.009401 
      48       80.610000       0.007883 
      48       80.620000       0.009228 
      48       80.580000       0.007712 
      48       80.600000       0.009059 
      49       80.630000       0.007544 
      49       80.610000       0.008866 
      49       80.620000       0.006516 
      49       80.570000       -0.001526 
      49       80.580000       -0.035661 
      49       80.570000       -0.050844 
      49       80.540000       -0.019255 
      49       80.550000       0.002617 
      49       80.620000       0.009334 
      50       80.580000       0.008255 
      50       80.540000       0.009610 
      50       80.560000       0.008090 
      50       80.590000       0.009433 
      50       80.590000       0.007914 
      50       80.560000       0.009259 
      50       80.580000       0.007743 
      50       80.530000       0.009089 
      50       80.600000       0.007561 
      50       80.590000       0.008471 
      51       80.560000       0.001643 
      51       80.480000       -0.020053 
      51       80.580000       -0.050933 
      51       80.590000       -0.034883 
      51       80.550000       -0.000384 
      51       80.580000       0.007596 
      52       80.540000       0.009782 
      52       80.540000       0.008286 
      52       80.520000       0.009627 
      52       80.610000       0.008107 
      52       80.520000       0.009450 
      52       80.500000       0.007932 
      52       80.520000       0.009276 
      53       80.540000       0.007760 
      53       80.600000       0.009106 
      53       80.550000       0.007591 
      53       80.590000       0.008939 
      53       80.540000       0.007426 
      53       80.540000       0.008775 
      53       80.510000       0.007250 
      53       80.560000       0.008176 
      53       80.540000       0.001764 
      53       80.510000       -0.015439 
      53       80.540000       -0.032249 
      54       80.520000       -0.014963 
      54       80.550000       0.002373 
      54       80.620000       0.008680 
      54       80.490000       0.007594 
      54       80.580000       0.008916 
      54       80.490000       0.006139 
      55       80.520000       -0.006805 
      55       80.510000       -0.059496 
      55       80.590000       -0.089956 
      55       80.520000       -0.041611 
      55       80.580000       0.008070 
      55       80.480000       0.047458 
      55       80.570000       0.044778 
      55       80.490000       -0.002264 
      56       80.510000       -0.008381 
      56       80.540000       0.003570 
      56       80.540000       0.009426 
      56       80.470000       0.008320 
      56       80.540000       0.009647 
      56       80.540000       0.007276 
      56       80.530000       -0.001186 
      56       80.520000       -0.039831 
      57       80.530000       -0.069514 
      57       80.520000       -0.044069 
      57       80.520000       -0.023594 
      57       80.540000       -0.030510 
      57       80.480000       -0.012390 
      58       80.500000       0.004946 
      58       80.510000       0.011228 
      58       80.450000       0.010117 
      58       80.470000       0.011453 
      58       80.510000       0.009914 
      58       80.500000       0.011239 
      58       80.510000       0.009703 
      59       80.530000       0.011030 
      59       80.490000       0.009495 
      59       80.460000       0.010825 
      59       80.490000       0.009292 
      60       80.500000       0.010623 
      60       80.490000       0.009093 
      60       80.500000       0.010426 
      60       80.490000       0.008898 
      60       80.480000       0.010233 
      60       80.420000       0.008693 
      60       80.470000       0.009605 
