

 time    ||    gripping force   ||   raspberry measurement 

      0       0.130000       -794.733333 
      0       0.280000       -794.733333 
      0       0.170000       -794.733333 
      0       0.090000       -794.733333 
      0       0.210000       -794.733333 
      1       0.240000       -786.786000 
      1       0.240000       -778.918140 
      1       0.460000       -771.128959 
      2       0.690000       -763.417669 
      2       40.080000       -755.783488 
      2       57.180000       -748.224485 
      2       80.390000       -740.637175 
      2       133.730000       -737.122732 
      2       182.050000       -694.308326 
      2       215.770000       -502.430510 
      2       210.290000       -186.088510 
      2       184.380000       5.773608 
      2       182.460000       48.584914 
      3       182.030000       52.097502 
      3       181.850000       52.205054 
      3       180.620000       52.204823 
      3       177.040000       52.207261 
      3       174.160000       52.220275 
      3       159.400000       52.317008 
      3       156.270000       52.637593 
      3       154.300000       53.269820 
      3       153.200000       54.141664 
      4       150.360000       55.125617 
      4       145.190000       55.898856 
      4       144.010000       56.219996 
      4       143.890000       56.225677 
      4       143.840000       56.169723 
      4       140.330000       56.152831 
      4       138.280000       56.128042 
      4       137.490000       56.091773 
      5       137.070000       55.984918 
      5       136.720000       55.735320 
      5       136.630000       55.423351 
      5       135.800000       55.246274 
      5       135.140000       55.209449 
      5       134.530000       55.204894 
      5       133.400000       55.206239 
      5       131.220000       55.204799 
      5       130.300000       55.206183 
      5       128.990000       55.202959 
      5       128.110000       55.182358 
      5       126.810000       55.078732 
      6       124.600000       54.896423 
      6       117.160000       54.759161 
      6       115.300000       54.724678 
      6       115.320000       54.752361 
      6       115.270000       54.769386 
      6       115.300000       54.674719 
      7       114.980000       54.566360 
      7       114.740000       54.550576 
      7       114.480000       54.525879 
      7       113.810000       54.425550 
      7       107.450000       54.375703 
      7       107.280000       54.387826 
      7       107.300000       54.353247 
      7       107.300000       54.317010 
      8       107.120000       54.304799 
      8       107.000000       54.295440 
      8       106.880000       54.255519 
      8       106.860000       54.215624 
      8       106.770000       54.207124 
      8       106.720000       54.204826 
      8       106.700000       54.206238 
      8       106.710000       54.204786 
      8       106.600000       54.205781 
      8       106.270000       54.198970 
      8       105.930000       54.177045 
      9       105.710000       54.144778 
      9       104.750000       54.150146 
      9       103.140000       54.142493 
      9       102.720000       54.104453 
      9       101.990000       54.131321 
      9       101.660000       54.161290 
      9       101.520000       54.143918 
      9       101.470000       54.155935 
      9       101.480000       54.171645 
      9       101.390000       54.163146 
      9       101.370000       54.171216 
      9       101.210000       54.151005 
      10       101.140000       54.125966 
      10       101.120000       54.155061 
      10       101.080000       54.179161 
      10       101.050000       54.128609 
      10       101.020000       54.052347 
      10       101.040000       53.964931 
      10       101.010000       53.846634 
      10       100.970000       53.850163 
      10       101.070000       53.904755 
      10       100.990000       53.811106 
      10       101.040000       53.660064 
      10       101.030000       53.598670 
      11       101.070000       53.669455 
      11       101.040000       53.716923 
      11       101.030000       53.658703 
      11       100.990000       53.677975 
      11       101.060000       53.760887 
      11       100.990000       53.793128 
      11       100.980000       53.791886 
      11       101.010000       53.807430 
      11       100.960000       53.831790 
      11       101.010000       53.778344 
      11       100.990000       53.729607 
      11       100.980000       53.751506 
      11       100.980000       53.838434 
      12       100.990000       53.874745 
      12       100.970000       53.811956 
      12       101.030000       53.763176 
      12       100.990000       53.729479 
      12       100.960000       53.701309 
      12       100.940000       53.661791 
      12       100.960000       53.644817 
      12       100.980000       53.666690 
      12       101.010000       53.655129 
      12       100.950000       53.640735 
      12       100.970000       53.664532 
      12       100.900000       53.717798 
      13       100.960000       53.803482 
      13       100.920000       53.792600 
      13       100.910000       53.677545 
      13       100.870000       53.621967 
      13       100.910000       53.686011 
      13       100.870000       53.706611 
      13       100.900000       53.663203 
      13       100.910000       53.701672 
      13       100.860000       53.730821 
      13       100.880000       53.693199 
      13       100.920000       53.687843 
      13       100.810000       53.699856 
      13       100.810000       53.705768 
      13       100.830000       53.703470 
      14       100.810000       53.690470 
      14       100.820000       53.637178 
      14       100.820000       53.605810 
      14       100.810000       53.653788 
      14       100.850000       53.705282 
      14       100.850000       53.765404 
      14       100.860000       53.843337 
      14       100.870000       53.878275 
      14       100.800000       53.829548 
      14       100.810000       53.765738 
      14       100.810000       53.743545 
      14       100.830000       53.745979 
      15       100.810000       53.734519 
      15       100.770000       53.651906 
      15       100.830000       53.639959 
      15       100.820000       53.658165 
      15       100.790000       53.703164 
      15       100.780000       53.800742 
      15       100.770000       53.815096 
      15       100.760000       53.790101 
      15       100.720000       53.849622 
      15       100.750000       53.889083 
      15       100.770000       53.809299 
      16       100.780000       53.736751 
      16       100.780000       53.745593 
      16       100.750000       53.735321 
      16       100.710000       53.662690 
      16       100.740000       53.601752 
      16       100.760000       53.533995 
      16       100.770000       53.496964 
      16       100.750000       53.576116 
      16       100.750000       53.657303 
      16       100.750000       53.670759 
      16       100.720000       53.716912 
      17       100.790000       53.720496 
      17       100.740000       53.698584 
      17       100.760000       53.722339 
      17       100.760000       53.718251 
      17       100.770000       53.687883 
      17       100.700000       53.676106 
      17       100.770000       53.729562 
      17       100.730000       53.768390 
      17       100.720000       53.705768 
      17       100.670000       53.634963 
      17       100.720000       53.649678 
      17       100.690000       53.666344 
      17       100.750000       53.711553 
      18       100.720000       53.767561 
      18       100.670000       53.712439 
      18       100.720000       53.677115 
      18       100.670000       53.697199 
      18       100.710000       53.704423 
      18       100.700000       53.712067 
      18       100.670000       53.734852 
      18       100.750000       53.776158 
      18       100.660000       53.798070 
      18       100.730000       53.795372 
      18       100.670000       53.760018 
      18       100.740000       53.729023 
      18       100.680000       53.698624 
      18       100.650000       53.649235 
      19       100.710000       53.663256 
      19       100.690000       53.694861 
      19       100.680000       53.709891 
      19       100.700000       53.718615 
      19       100.680000       53.703110 
      19       100.630000       53.672532 
      19       100.720000       53.692795 
      19       100.660000       53.676063 
      19       100.660000       53.659672 
      19       100.640000       53.709658 
      19       100.660000       53.705308 
      19       100.660000       53.624151 
      19       100.690000       53.600414 
      19       100.700000       53.639848 
      20       100.640000       53.708382 
      20       100.620000       53.710667 
      20       100.640000       53.648778 
      20       100.650000       53.645291 
      20       100.650000       53.683703 
      20       100.510000       53.739403 
      20       100.310000       53.733412 
      20       100.350000       53.665470 
      20       100.290000       53.617384 
      20       100.220000       53.618433 
      20       100.240000       53.659989 
      20       100.270000       53.727737 
      20       100.310000       53.781420 
      20       100.300000       53.827665 
      21       100.270000       53.773763 
      21       100.320000       53.631419 
      21       100.280000       53.558746 
      21       100.260000       53.585211 
      21       100.280000       53.645731 
      21       100.240000       53.755021 
      21       100.280000       53.858081 
      21       100.290000       53.878743 
      21       100.310000       53.800714 
      21       100.270000       53.638550 
      22       100.260000       53.576714 
      22       100.240000       53.653288 
      22       100.230000       53.663585 
      22       100.180000       53.631352 
      22       100.270000       53.666679 
      22       100.240000       53.731705 
      22       100.240000       53.718640 
      22       100.220000       53.595927 
      22       100.260000       53.512096 
      22       100.240000       53.530504 
      22       100.220000       53.565402 
      22       100.230000       53.640764 
      22       100.140000       53.732526 
      23       100.250000       53.753244 
      23       100.280000       53.685934 
      23       100.170000       53.636334 
      23       100.200000       53.664431 
      23       100.230000       53.657760 
      23       100.250000       53.588300 
      23       100.210000       53.607084 
      23       100.170000       53.630808 
      23       100.210000       53.587383 
      23       100.180000       53.558664 
      24       100.180000       53.540305 
      24       100.210000       53.556002 
      24       100.180000       53.577488 
      24       100.170000       53.593198 
      24       100.140000       53.641123 
      24       100.150000       53.643820 
      24       100.150000       53.609325 
      24       100.140000       53.582900 
      24       100.160000       53.564932 
      24       100.190000       53.582081 
      24       100.130000       53.600730 
      24       100.140000       53.621965 
      24       100.140000       53.676491 
      25       100.070000       53.715095 
      25       100.170000       53.628124 
      25       100.110000       53.532345 
      25       100.050000       53.516539 
      25       100.000000       53.562344 
      25       100.010000       53.702127 
      25       99.890000       53.817239 
      25       99.850000       53.743323 
      25       99.710000       53.625996 
      25       99.450000       53.627212 
      26       99.370000       53.630055 
      26       99.330000       53.560876 
      26       99.240000       53.526993 
      26       99.230000       53.621799 
      26       99.120000       53.769828 
      26       99.120000       53.724398 
      26       99.110000       53.587457 
      26       99.030000       53.528652 
      26       98.860000       53.551972 
      26       98.510000       53.582042 
      26       97.030000       53.612440 
      26       96.570000       53.662689 
      26       96.510000       53.658592 
      27       96.280000       53.664960 
      27       96.190000       53.684601 
      27       96.150000       53.644773 
      27       96.140000       53.578848 
      27       96.070000       53.585172 
      27       96.050000       53.667571 
      27       96.050000       53.641562 
      27       96.050000       53.511212 
      27       96.050000       53.537623 
      27       96.000000       53.654035 
      27       96.030000       53.625004 
      27       96.080000       53.491361 
      28       96.020000       53.390156 
      28       95.960000       53.395481 
      28       96.010000       53.457787 
      28       95.960000       53.458163 
      28       95.980000       53.464947 
      28       95.960000       53.484588 
      28       96.020000       53.444317 
      28       95.990000       53.373046 
      28       96.000000       53.356945 
      28       96.020000       53.420980 
      28       96.000000       53.465400 
      28       96.060000       53.464018 
      28       95.960000       53.487816 
      29       95.990000       53.528109 
      29       96.010000       53.559061 
      29       96.020000       53.519570 
      29       96.000000       53.444334 
      29       96.030000       53.402182 
      29       96.030000       53.357332 
      29       96.080000       53.331889 
      29       96.010000       53.381502 
      29       96.030000       53.446549 
      29       95.930000       53.481030 
      29       96.060000       53.505227 
      29       96.000000       53.450106 
      30       96.030000       53.380726 
      30       96.000000       53.384687 
      30       96.030000       53.415638 
      30       96.050000       53.478400 
      30       96.070000       53.524912 
      30       96.050000       53.484241 
      30       96.030000       53.445651 
      30       96.000000       53.453344 
      30       96.030000       53.459976 
      30       96.030000       53.492356 
      30       96.040000       53.546895 
      30       96.060000       53.574798 
      30       96.070000       53.505229 
      30       96.040000       53.442660 
      31       96.020000       53.481918 
      31       96.070000       53.540316 
      31       96.070000       53.546895 
      31       96.070000       53.526850 
      31       96.090000       53.483676 
      31       96.090000       53.456957 
      31       96.030000       53.424524 
      31       96.080000       53.388340 
      31       96.060000       53.375730 
      31       96.100000       53.425936 
      31       96.060000       53.465817 
      31       96.040000       53.463561 
      32       96.120000       53.481517 
      32       96.160000       53.492684 
      32       96.180000       53.465816 
      32       96.250000       53.396786 
      32       96.260000       53.374843 
      32       96.280000       53.406598 
      32       96.420000       53.373927 
      32       96.450000       53.321467 
      32       96.590000       53.318809 
      32       96.610000       53.359076 
      32       96.560000       53.415623 
      32       96.560000       53.417325 
      32       96.540000       53.382471 
      33       96.570000       53.351963 
      33       96.560000       53.391481 
      33       96.590000       53.467160 
      33       96.590000       53.514711 
      33       96.570000       53.583758 
      33       96.630000       53.649122 
      33       96.580000       53.624539 
      33       97.070000       53.573917 
      34       97.240000       53.566730 
      34       97.210000       53.527332 
      34       97.260000       53.493270 
      34       97.410000       53.577532 
      34       97.420000       53.720880 
      34       97.490000       53.757634 
      34       97.410000       53.643850 
      34       97.460000       53.557335 
      34       97.480000       53.553801 
      34       97.420000       53.554147 
      34       97.500000       53.562344 
      34       97.430000       53.578317 
      34       97.450000       53.598154 
      35       97.400000       53.593615 
      35       97.390000       53.625022 
      35       97.410000       53.636194 
      35       97.570000       53.593642 
      35       97.720000       53.587884 
      35       97.890000       53.600770 
      35       97.910000       53.617479 
      35       97.890000       53.663549 
      35       97.940000       53.729491 
      35       97.950000       53.715070 
      35       97.980000       53.660544 
      35       98.040000       53.680992 
      35       98.060000       53.710304 
      35       98.040000       53.673348 
      36       98.120000       53.630590 
      36       98.110000       53.647809 
      36       98.210000       53.734518 
      36       98.270000       53.750022 
      36       98.400000       53.751075 
      36       98.480000       53.726769 
      36       98.460000       53.699524 
      36       98.520000       53.728664 
      36       98.520000       53.754119 
      36       98.520000       53.786487 
      36       98.500000       53.821797 
      37       98.550000       53.824052 
      37       98.520000       53.730878 
      37       98.490000       53.636292 
      37       98.510000       53.640805 
      37       98.520000       53.683314 
      37       98.550000       53.740303 
      37       98.540000       53.745096 
      37       98.500000       53.724636 
      37       98.540000       53.744707 
      37       98.500000       53.736704 
      37       98.540000       53.681586 
      38       98.800000       53.708041 
      38       99.190000       53.814184 
      38       99.300000       53.871157 
      38       99.310000       53.814225 
      38       99.400000       53.709437 
      38       99.400000       53.700025 
      38       99.580000       53.837137 
      38       99.540000       53.994884 
      38       99.620000       54.030252 
      38       99.560000       53.906600 
      38       99.560000       53.782072 
      38       99.550000       53.808467 
      38       99.600000       53.855032 
      38       99.590000       53.832247 
      39       99.680000       53.802558 
      39       99.660000       53.772629 
      39       99.640000       53.794111 
      39       99.680000       53.857734 
      39       99.680000       53.857759 
      39       99.600000       53.860878 
      39       99.680000       53.876615 
      39       99.690000       53.877901 
      39       99.670000       53.879384 
      40       99.720000       53.874318 
      40       99.680000       53.938562 
      40       99.680000       54.017245 
      40       99.710000       54.056845 
      40       99.680000       54.003386 
      40       99.660000       53.873085 
      40       99.660000       53.799113 
      40       99.700000       53.861858 
      40       99.660000       53.949163 
      40       99.620000       53.947903 
      40       99.650000       53.910158 
      40       99.630000       53.887829 
      40       99.630000       53.882387 
      40       99.670000       53.881098 
      40       99.660000       53.805740 
      41       99.720000       53.744030 
      41       99.700000       53.799016 
      41       99.670000       53.924189 
      41       99.680000       54.021741 
      41       99.710000       54.020968 
      41       99.680000       53.977460 
      41       99.660000       53.993185 
      41       99.660000       53.974786 
      41       99.640000       53.944777 
      41       99.660000       53.952377 
      41       99.690000       53.947324 
      41       99.690000       53.919720 
      41       99.630000       53.838379 
      42       99.670000       53.727433 
      42       99.680000       53.686100 
      42       99.660000       53.817422 
      42       99.690000       53.912811 
      42       99.650000       53.880560 
      42       99.660000       53.832666 
      42       99.640000       53.779217 
      42       99.650000       53.739087 
      42       99.700000       53.720552 
      42       99.700000       53.764573 
      42       99.640000       53.839365 
      42       99.680000       53.937548 
      42       99.630000       53.976034 
      43       99.670000       53.927723 
      43       99.650000       53.930811 
      43       99.670000       53.930364 
      43       99.630000       53.858203 
      43       99.620000       53.793686 
      43       99.720000       53.764959 
      43       99.680000       53.772196 
      43       99.660000       53.763134 
      43       99.710000       53.790625 
      43       99.670000       53.909684 
      43       99.660000       53.975188 
      43       99.670000       53.946065 
      44       99.610000       53.946535 
      44       99.660000       53.915983 
      44       99.660000       53.855199 
      44       99.680000       53.857238 
      44       99.710000       53.875742 
      44       99.860000       53.871172 
      44       100.100000       53.839392 
      44       100.090000       53.765889 
      44       100.170000       53.802266 
      44       100.090000       53.902112 
      44       100.100000       53.933562 
      44       100.110000       53.971192 
      45       100.120000       54.043297 
      45       100.130000       54.071170 
      45       100.150000       53.985487 
      45       100.150000       53.849335 
      45       100.130000       53.840805 
      45       100.080000       53.936217 
      45       100.100000       53.915125 
      45       100.100000       53.855660 
      45       100.110000       53.927668 
      45       100.140000       54.006167 
      45       100.110000       54.016053 
      45       100.150000       54.041136 
      45       100.110000       54.021369 
      45       100.120000       53.984782 
      46       100.130000       54.021369 
      46       100.150000       54.041163 
      46       100.130000       54.016966 
      46       100.180000       54.017825 
      46       100.110000       53.986028 
      46       100.130000       53.974830 
      46       100.160000       54.016966 
      46       100.150000       54.018211 
      46       100.160000       53.991953 
      46       100.140000       53.984589 
      46       100.110000       54.003580 
      46       100.100000       54.012896 
      46       100.120000       54.047018 
      46       100.130000       54.055921 
      46       100.130000       54.068074 
      47       100.120000       54.105228 
      47       100.130000       54.063088 
      47       100.220000       53.972200 
      47       100.160000       53.928652 
      47       100.100000       53.967230 
      47       100.160000       54.043391 
      47       100.150000       54.078302 
      47       100.070000       54.030408 
      48       100.130000       53.975730 
      48       100.130000       53.983813 
      48       100.150000       54.010225 
      48       100.140000       54.054162 
      48       100.160000       54.083701 
      48       100.100000       54.044237 
      48       100.130000       53.971300 
      48       100.170000       53.936208 
      48       100.130000       53.934076 
      48       100.130000       53.942466 
      48       100.090000       53.985584 
      48       100.180000       53.958576 
      48       100.110000       53.878055 
      49       100.170000       53.863607 
      49       100.100000       53.954645 
      49       100.130000       54.037035 
      49       100.160000       53.989557 
      49       100.160000       53.891927 
      49       100.180000       53.898612 
      49       100.130000       53.972115 
      49       100.140000       54.026754 
      49       100.120000       54.057705 
      49       100.130000       54.003829 
      50       100.110000       53.877599 
      50       100.090000       53.812539 
      50       100.100000       53.854244 
      50       100.140000       53.904357 
      50       100.140000       53.952859 
      50       100.130000       53.974206 
      50       100.170000       53.911650 
      50       100.130000       53.860450 
      50       100.140000       53.904037 
      50       100.150000       53.942879 
      51       100.120000       53.956514 
      51       100.120000       53.959922 
      51       100.140000       53.987426 
      51       100.140000       54.028553 
      51       100.100000       54.064917 
      51       100.180000       54.049663 
      51       100.060000       54.015611 
      51       100.120000       54.012510 
      51       100.110000       54.029050 
      51       100.150000       54.046992 
      51       100.120000       54.038921 
      51       100.120000       54.049663 
      51       100.150000       54.041606 
      52       100.190000       53.994112 
      52       100.120000       53.988757 
      52       100.140000       54.010682 
      52       100.170000       54.055089 
      52       100.120000       54.095373 
      52       100.130000       54.103039 
      52       100.110000       54.095829 
      52       100.150000       54.060931 
      52       100.180000       54.040278 
      52       100.140000       54.052874 
      52       100.170000       54.059076 
      53       100.090000       54.081544 
      53       100.100000       54.098043 
      53       100.200000       54.089100 
      53       100.140000       54.025023 
      53       100.130000       53.940735 
      53       100.140000       53.894652 
      53       100.090000       53.895884 
      53       100.070000       53.957374 
      53       100.180000       54.016855 
      53       100.150000       54.034447 
      53       100.120000       53.981032 
      53       100.140000       53.937677 
      53       100.120000       53.985975 
      53       100.180000       54.053272 
      53       100.110000       54.033452 
      54       100.180000       53.952918 
      54       100.120000       53.930840 
      54       100.040000       53.992352 
      54       100.100000       54.012396 
      54       100.090000       53.987387 
      54       100.130000       53.974830 
      54       100.130000       54.015580 
      54       100.100000       54.022795 
      54       100.100000       54.007098 
      54       100.100000       54.062702 
      54       100.120000       54.064404 
      54       100.120000       54.030479 
      54       100.150000       54.055465 
      54       100.170000       54.078772 
      55       100.130000       54.024593 
      55       100.170000       53.946134 
      55       100.150000       53.919709 
      55       100.150000       53.945731 
      55       100.080000       54.020524 
      55       100.090000       54.070759 
      55       100.090000       54.087719 
      55       100.160000       54.120551 
      55       100.090000       54.106929 
      55       100.120000       54.032290 
      56       100.090000       53.949678 
      56       100.160000       53.934976 
      56       100.090000       53.940305 
      56       100.130000       53.979716 
      56       100.110000       54.016040 
      56       100.130000       54.001211 
      56       100.080000       53.974387 
      56       100.110000       53.930437 
      56       100.170000       53.966827 
      56       100.160000       54.037537 
      56       100.090000       54.068544 
      56       100.090000       54.129898 
      56       100.140000       54.177872 
      56       100.140000       54.138878 
      57       100.120000       54.053791 
      57       100.120000       54.035835 
      57       100.100000       54.112010 
      57       100.110000       54.138005 
      57       100.190000       54.109312 
      57       100.080000       54.088259 
      57       100.110000       54.088255 
      57       100.110000       54.111567 
      57       100.140000       54.080172 
      58       100.110000       54.050606 
      58       100.100000       54.076561 
      58       100.150000       54.086413 
      58       100.190000       54.035804 
      58       100.140000       53.928652 
      58       100.110000       53.903666 
      58       100.110000       54.021410 
      58       100.100000       54.123622 
      58       100.090000       54.126284 
      59       100.120000       54.099912 
      59       100.130000       54.046493 
      59       100.080000       53.983467 
      59       100.160000       54.000787 
      59       100.140000       54.086027 
      59       100.070000       54.105654 
      59       100.150000       54.052418 
      59       100.080000       53.987858 
      59       100.150000       54.027335 
      59       100.110000       54.135724 
      59       100.070000       54.185043 
      59       100.090000       54.159061 
      59       100.090000       54.062677 
      60       100.110000       53.997783 
      60       100.130000       54.055989 
      60       100.160000       54.119607 
      60       100.130000       54.085128 
      60       100.100000       54.061821 
      60       100.110000       54.125452 
      60       100.110000       54.172903 
      60       100.160000       54.123680 
      60       100.140000       54.040278 
      60       100.100000       53.990113 
      60       100.110000       53.981626 
      60       100.160000       54.055962 
      61       100.120000       54.134851 
