Human trial picking the raspberry twin 

 time    ||     output     ||     loadcell

      0.000000       -797.815625       0.010000 
      0.016956       -797.815625       0.030000 
      0.031806       -797.815625       0.050000 
      0.047043       -797.815625       0.020000 
      0.062439       -797.815625       0.070000 
      0.077240       -797.815625       0.060000 
      0.091408       -797.815625       0.080000 
      0.107799       -797.815625       0.010000 
      0.123077       -797.815625       0.070000 
      0.138480       -797.815620       0.100000 
      0.154147       -797.814434       0.020000 
      0.168804       -797.707637       0.040000 
      0.184690       -794.171036       0.050000 
      0.201646       -751.086674       0.010000 
      0.215343       -557.999019       0.010000 
      0.231975       -239.662804       0.020000 
      0.246557       -46.597977       0.020000 
      0.262622       -3.561584       0.010000 
      0.279237       -0.151432       0.050000 
      0.294051       -0.163708       0.090000 
      0.309387       -0.129496       0.040000 
      0.326097       -0.048361       0.070000 
      0.341037       -0.054186       0.040000 
      0.357569       -0.035332       0.020000 
      0.373305       -0.009433       0.070000 
      0.387951       -0.027208       0.050000 
      0.404180       -0.015204       0.020000 
      0.419225       0.000546       0.070000 
      0.434856       -0.006638       0.010000 
      0.450069       0.017133       0.110000 
      0.466386       0.062369       0.010000 
      0.481261       0.112118       0.070000 
      0.497527       0.088325       0.030000 
      0.512946       -0.002568       0.030000 
      0.527361       -0.062242       0.050000 
      0.543653       -0.097584       0.040000 
      0.558421       -0.071225       0.040000 
      0.575359       0.014458       0.130000 
      0.590570       0.030445       0.110000 
      0.606028       -0.026735       0.000000 
      0.620803       -0.051041       0.000000 
      0.636831       0.045839       0.080000 
      0.652105       0.102207       0.040000 
      0.668635       0.066452       0.090000 
      0.698521       0.035891       0.030000 
      0.729397       0.008616       0.010000 
      0.745199       -0.020536       0.050000 
      0.760545       -0.057702       0.010000 
      0.777367       -0.064900       0.020000 
      0.792511       0.011345       0.020000 
      0.807557       0.092352       0.110000 
      0.824067       0.127899       0.140000 
      0.839172       0.127750       0.020000 
      0.853980       0.109948       0.080000 
      0.869474       0.081194       0.010000 
      0.885153       0.040884       0.000000 
      0.901580       -0.049229       0.010000 
      0.916393       -0.085041       0.040000 
      0.930987       -0.034476       0.000000 
      0.948256       -0.032261       0.050000 
      0.962842       -0.076086       0.020000 
      0.977370       -0.089678       0.030000 
      0.993111       -0.089099       0.100000 
      1.009866       -0.088309       0.040000 
      1.024921       -0.078800       0.060000 
      1.041118       -0.111190       0.040000 
      1.056175       -0.118624       0.000000 
      1.070058       -0.070826       0.030000 
      1.085604       -0.024107       0.050000 
      1.101121       -0.002165       0.050000 
      1.116526       0.054299       0.030000 
      1.132558       0.094207       0.040000 
      1.148098       0.086580       0.050000 
      1.162803       0.080808       0.050000 
      1.178634       0.058313       0.130000 
      1.194409       0.040484       0.030000 
      1.210099       0.033203       0.030000 
      1.225946       0.023817       0.020000 
      1.241021       -0.021933       0.000000 
      1.257511       -0.091383       0.050000 
      1.272470       -0.162645       0.010000 
      1.288931       -0.212824       0.030000 
      1.303945       -0.168000       0.000000 
      1.318131       -0.051086       0.010000 
      1.334969       0.035899       0.040000 
      1.350791       0.042588       0.080000 
      1.367035       -0.004877       0.010000 
      1.396932       -0.026362       0.020000 
      1.413191       -0.010265       0.030000 
      1.428622       -0.045177       0.070000 
      1.443907       -0.089580       0.010000 
      1.459351       -0.053230       0.020000 
      1.474780       0.016616       0.050000 
      1.489951       0.039957       0.020000 
      1.506514       0.003207       0.000000 
      1.522500       0.013962       0.020000 
      1.536723       0.035042       0.050000 
      1.551678       -0.012036       0.030000 
      1.567716       -0.041962       0.080000 
      1.582774       -0.005348       0.060000 
      1.597911       0.074549       0.010000 
      1.614869       0.115650       0.040000 
      1.629826       0.098720       0.060000 
      1.646738       0.039033       0.100000 
      1.661688       -0.004756       0.020000 
      1.676728       -0.018777       0.060000 
      1.692683       -0.023150       0.040000 
      1.708676       0.022489       0.060000 
      1.724705       0.104505       0.040000 
      1.739710       0.096891       0.040000 
      1.755220       0.049387       0.000000 
      1.771210       0.040928       0.030000 
      1.785717       0.047555       0.000000 
      1.802236       0.032414       0.030000 
      1.816778       0.006765       0.070000 
      1.832716       0.044967       0.020000 
      1.848286       0.034060       0.060000 
      1.863881       -0.034322       0.030000 
      1.878008       -0.019230       0.020000 
      1.894085       0.064181       0.060000 
      1.925062       0.085194       0.000000 
      1.940964       0.029189       0.010000 
      1.955833       -0.050129       0.010000 
      1.971845       -0.084628       0.010000 
      1.987920       -0.092684       0.040000 
      2.003924       -0.094926       0.030000 
      2.019822       -0.028603       0.090000 
      2.035729       0.072224       0.080000 
      2.051682       0.130917       0.020000 
      2.066640       0.099136       0.020000 
      2.082612       0.028331       0.030000 
      2.098316       0.012204       0.040000 
      2.114687       0.009046       0.040000 
      2.129762       0.008133       0.080000 
      2.144668       -0.000393       0.030000 
      2.161341       -0.042532       0.060000 
      2.175596       -0.087755       0.050000 
      2.190519       -0.118693       0.050000 
      2.207300       -0.073857       0.020000 
      2.222757       0.024247       0.040000 
      2.238735       0.090136       0.030000 
      2.254704       0.087895       0.060000 
      2.269695       0.014418       0.040000 
      2.285972       -0.043817       0.040000 
      2.301693       -0.033492       0.060000 
      2.315890       0.004077       0.020000 
      2.332859       0.034172       0.060000 
      2.348223       0.051128       0.010000 
      2.364102       0.040427       0.000000 
      2.379834       -0.025006       0.080000 
      2.395093       -0.038418       0.140000 
      2.410280       0.030572       0.020000 
      2.426197       0.091479       0.010000 
      2.442014       0.098290       0.030000 
      2.457433       0.058260       0.010000 
      2.472892       0.021243       0.060000 
      2.488907       0.007178       0.000000 
      2.504178       -0.002984       0.060000 
      2.520187       -0.051527       0.130000 
      2.536350       -0.048247       0.060000 
      2.551898       -0.001349       0.080000 
      2.567515       0.023400       0.020000 
      2.582600       0.008107       0.050000 
      2.597278       -0.015634       0.030000 
      2.613873       -0.039818       0.030000 
      2.629421       -0.060914       0.010000 
      2.644796       -0.064472       0.020000 
      2.659297       -0.066783       0.010000 
      2.675521       -0.070757       0.020000 
      2.691076       -0.096353       0.100000 
      2.706554       -0.133519       0.020000 
      2.721565       -0.144273       0.010000 
      2.736934       -0.091370       0.000000 
      2.752341       -0.039888       0.050000 
      2.767766       -0.051043       0.040000 
      2.782923       -0.027289       0.030000 
      2.798492       0.023733       0.010000 
      2.813858       -0.027748       0.050000 
      2.829134       -0.120479       0.010000 
      2.844677       -0.155916       0.070000 
      2.859818       -0.142877       0.070000 
      2.874764       -0.050559       0.060000 
      2.889439       0.082495       0.060000 
      2.905059       0.130433       0.000000 
      2.920174       0.082096       0.000000 
      2.935359       0.009019       0.000000 
      2.950040       -0.062645       0.010000 
      2.966671       -0.113307       0.040000 
      2.982060       -0.074743       0.020000 
      2.997257       0.008063       0.010000 
      3.012608       0.017571       0.010000 
      3.027738       -0.030915       0.010000 
      3.041939       -0.047858       0.030000 
      3.057631       -0.018322       0.040000 
      3.073090       0.005405       0.050000 
      3.089192       -0.051016       0.090000 
      3.105190       -0.071669       0.040000 
      3.120190       -0.037576       0.030000 
      3.135270       -0.063185       0.020000 
      3.149634       -0.072887       0.070000 
      3.166473       -0.040357       0.090000 
      3.180544       0.010458       0.050000 
      3.196738       0.056957       0.040000 
      3.212176       0.093750       0.060000 
      3.227107       0.078040       0.040000 
      3.241896       0.037716       0.080000 
      3.256740       0.000090       0.070000 
      3.270958       -0.065400       0.020000 
      3.288047       -0.117281       0.060000 
      3.303862       -0.099936       0.010000 
      3.318686       -0.025034       0.040000 
      3.334028       0.014803       0.030000 
      3.348209       -0.011205       0.000000 
      3.363846       -0.098967       0.010000 
      3.380162       -0.140247       0.040000 
      3.395782       -0.096296       0.140000 
      3.411952       -0.064555       0.040000 
      3.426751       -0.031749       0.010000 
      3.443717       -0.061011       0.050000 
      3.458512       -0.139278       0.030000 
      3.475189       -0.143387       0.000000 
      3.490792       -0.074786       0.010000 
      3.505764       -0.026848       0.080000 
      3.521337       -0.010678       0.110000 
      3.536567       0.014405       0.100000 
      3.552789       0.054325       0.010000 
      3.568202       0.078470       0.050000 
      3.583997       0.082136       0.030000 
      3.599120       0.062326       0.110000 
      3.614102       -0.017849       0.010000 
      3.629273       -0.100751       0.050000 
      3.645119       -0.069427       0.090000 
      3.659846       -0.046147       0.000000 
      3.674855       -0.107537       0.110000 
      3.690424       -0.147414       0.060000 
      3.706763       -0.136247       0.030000 
      3.722335       -0.105309       0.060000 
      3.737548       -0.116090       0.080000 
      3.752741       -0.132191       0.050000 
      3.768350       -0.128674       0.000000 
      3.783544       -0.156388       0.030000 
      3.799532       -0.161344       0.010000 
      3.815260       -0.152830       0.040000 
      3.829581       -0.171199       0.020000 
      3.846373       -0.129462       0.090000 
      3.861175       -0.061441       0.020000 
      3.876772       -0.046560       0.060000 
      3.892587       -0.056455       0.070000 
      3.907649       -0.045687       0.130000 
      3.923858       -0.051032       0.060000 
      3.939249       -0.084655       0.030000 
      3.955380       -0.092708       0.050000 
      3.971271       -0.032245       0.010000 
      3.986531       0.046197       0.010000 
      4.002101       0.002180       0.050000 
      4.017867       -0.134804       0.050000 
      4.033739       -0.194039       0.020000 
      4.048761       -0.175631       0.050000 
      4.063878       -0.165342       0.040000 
      4.079031       -0.076112       0.020000 
      4.094775       0.042531       0.000000 
      4.110095       0.041741       0.030000 
      4.125710       -0.021003       0.000000 
      4.140574       -0.033533       0.110000 
      4.156204       -0.020120       0.050000 
      4.171444       -0.011094       0.130000 
      4.186883       0.003164       0.150000 
      4.202319       0.000076       0.010000 
      4.218144       -0.031332       0.090000 
      4.232203       -0.034889       0.020000 
      4.249309       -0.026849       0.010000 
      4.265253       -0.050602       0.010000 
      4.281211       -0.098510       0.010000 
      4.297171       -0.094993       0.020000 
      4.312918       -0.025034       0.030000 
      4.326816       0.009847       0.010000 
      4.342766       -0.030419       0.010000 
      4.358750       -0.119163       0.060000 
      4.373802       -0.137505       0.070000 
      4.389783       -0.063572       0.040000 
      4.405871       0.021089       0.030000 
      4.420830       0.062798       0.050000 
      4.434794       0.026931       0.010000 
      4.451750       -0.033533       0.050000 
      4.466011       -0.068027       0.000000 
      4.481969       -0.031278       0.030000 
      4.498004       0.035015       0.010000 
      4.514157       0.032317       0.050000 
      4.529240       0.018461       0.000000 
      4.560539       0.019304       0.100000 
      4.575590       -0.020993       0.120000 
      4.590549       -0.074299       0.000000 
      4.605508       -0.078799       0.000000 
      4.622463       -0.038905       0.110000 
      4.637440       0.013962       0.130000 
      4.651252       0.077180       0.050000 
      4.666976       0.107566       0.070000 
      4.684282       0.058409       0.090000 
      4.698528       -0.005778       0.050000 
      4.715233       -0.030778       0.090000 
      4.730142       -0.022362       0.020000 
      4.746131       0.044470       0.010000 
      4.760408       0.055973       0.020000 
      4.775741       -0.017850       0.000000 
      4.792942       -0.114747       0.010000 
      4.809674       -0.202969       0.010000 
      4.824641       -0.242876       0.060000 
      4.840901       -0.203452       0.030000 
      4.868660       -0.121449       0.040000 
      4.885074       -0.057371       0.080000 
      4.900514       -0.046117       0.080000 
      4.916148       -0.055112       0.000000 
      4.931735       -0.029476       0.140000 
      4.945689       0.021975       0.120000 
      4.960360       0.039514       0.090000 
      4.976494       -0.007564       0.030000 
      4.992365       -0.033989       0.010000 
      5.007930       -0.039401       0.050000 
      5.024014       -0.038020       0.010000 
      5.039556       -0.034932       0.120000 
      5.054912       -0.085112       0.030000 
      5.070936       -0.114691       0.020000 
      5.086830       -0.070327       0.030000 
      5.102504       -0.043476       0.010000 
      5.117201       -0.094054       0.010000 
      5.132559       -0.153699       0.100000 
      5.148628       -0.098953       0.100000 
      5.163640       0.002677       0.090000 
      5.179716       0.017572       0.060000 
      5.194134       -0.025516       0.040000 
      5.210880       -0.023205       0.070000 
      5.225952       0.027388       0.100000 
      5.240465       0.058352       0.020000 
      5.256001       0.008993       0.090000 
      5.271411       -0.039748       0.010000 
      5.287829       -0.019690       0.060000 
      5.303788       0.000117       0.040000 
      5.318766       -0.007121       0.010000 
      5.335688       0.010861       0.040000 
      5.350646       0.027804       0.070000 
      5.366883       0.028813       0.000000 
      5.380867       0.004037       0.080000 
      5.396916       -0.029436       0.040000 
      5.412180       -0.035831       0.020000 
      5.428159       -0.018721       0.070000 
      5.444449       -0.012950       0.020000 
      5.459677       0.000077       0.090000 
      5.474935       -0.015178       0.060000 
      5.489203       -0.025919       0.030000 
      5.505317       0.005449       0.090000 
      5.521589       0.021518       0.100000 
      5.535880       -0.001266       0.070000 
      5.552791       -0.066313       0.010000 
      5.567888       -0.127650       0.060000 
      5.582852       -0.143347       0.010000 
      5.598226       -0.085125       0.020000 
      5.614448       -0.006692       0.020000 
      5.629621       0.014790       0.010000 
      5.645173       -0.030003       0.040000 
      5.660213       -0.119620       0.070000 
      5.675180       -0.143777       0.070000 
      5.692203       -0.098124       0.010000 
      5.706664       -0.061787       0.110000 
      5.722833       -0.016574       0.100000 
      5.738070       0.017491       0.010000 
      5.752419       -0.008938       0.000000 
      5.768424       -0.093195       0.020000 
      5.783683       -0.178312       0.030000 
      5.799882       -0.149632       0.080000 
      5.815364       -0.069901       0.010000 
      5.831529       -0.067213       0.040000 
      5.847173       -0.070297       0.070000 
      5.861608       -0.026446       0.000000 
      5.876781       -0.011166       0.000000 
      5.893214       -0.056441       0.050000 
      5.908260       -0.080612       0.040000 
      5.923943       -0.079769       0.050000 
      5.939053       -0.109738       0.080000 
      5.954828       -0.120090       0.060000 
      5.970068       -0.070327       0.130000 
      5.986035       -0.038117       0.020000 
      6.001659       -0.070757       0.060000 
      6.016854       -0.125059       0.010000 
      6.032285       -0.129006       0.060000 
      6.048392       -0.101752       0.090000 
      6.064706       -0.099897       0.060000 
      6.079734       -0.125476       0.010000 
      6.094926       -0.104406       0.060000 
      6.109885       -0.051986       0.020000 
      6.126210       -0.038990       0.090000 
      6.140635       -0.099480       0.010000 
      6.157105       -0.183725       0.040000 
      6.172309       -0.168457       0.020000 
      6.187080       -0.086041       0.110000 
      6.203807       -0.056928       0.040000 
      6.219810       -0.076139       0.030000 
      6.234329       -0.066757       0.050000 
      6.249528       -0.058243       0.140000 
      6.266144       -0.090896       0.010000 
      6.281965       -0.055972       0.010000 
      6.297120       0.005405       0.060000 
      6.312372       -0.013406       0.050000 
      6.328294       -0.029919       0.020000 
      6.344332       -0.025090       0.030000 
      6.358588       -0.034419       0.080000 
      6.375327       -0.026818       0.020000 
      6.390743       0.013475       0.100000 
      6.405424       -0.005363       0.090000 
      6.420303       -0.067586       0.100000 
      6.435091       -0.074410       0.070000 
      6.450512       -0.099427       0.040000 
      6.466282       -0.146531       0.070000 
      6.480616       -0.131221       0.020000 
      6.497540       -0.086993       0.020000 
      6.513549       -0.020938       0.010000 
      6.528455       0.011083       0.060000 
      6.544044       -0.021394       0.010000 
      6.559466       -0.092835       0.070000 
      6.575011       -0.160777       0.060000 
      6.590252       -0.209293       0.060000 
      6.605744       -0.147348       0.030000 
      6.620804       -0.032315       0.050000 
      6.636983       0.034973       2.750000 
      6.651327       0.011636       1.640000 
      6.666776       -0.090968       0.680000 
      6.682070       -0.191768       12.530000 
      6.697521       -0.213294       20.410000 
      6.713669       -0.145217       29.160000 
      6.728029       -0.087881       51.550000 
      6.743975       -0.104035       65.120000 
      6.760222       -0.170314       96.700000 
      6.775822       -0.253689       113.050000 
      6.791079       -0.285885       129.430000 
      6.806069       -0.219136       161.210000 
      6.822719       -0.081071       175.670000 
      6.838253       0.013476       203.770000 
      6.854266       0.049011       218.110000 
      6.868751       0.121175       244.870000 
      6.884735       0.236939       255.880000 
      6.899783       0.370079       271.500000 
      6.916461       0.547227       276.220000 
      6.931890       0.762786       279.320000 
      6.946088       0.986538       284.480000 
      6.961866       1.124564       287.200000 
      6.977282       1.147101       293.530000 
      6.992945       1.120301       296.710000 
      7.008592       1.128414       298.500000 
      7.022995       1.214169       296.910000 
      7.038341       1.400576       293.800000 
      7.054923       1.651239       287.510000 
      7.070204       1.875312       287.030000 
      7.085756       2.068224       288.740000 
      7.101206       2.198181       292.860000 
      7.117124       2.300616       293.060000 
      7.131088       2.445788       288.310000 
      7.147996       2.635071       285.120000 
      7.163020       2.820591       284.740000 
      7.178312       2.956901       291.390000 
      7.193511       2.995427       293.850000 
      7.209702       2.976253       293.180000 
      7.224985       2.913891       290.760000 
      7.240212       2.796117       287.910000 
      7.257132       2.716746       281.950000 
      7.272168       2.742284       278.320000 
      7.286104       2.797308       268.410000 
      7.303108       2.816148       264.210000 
      7.319038       2.760486       262.620000 
      7.334904       2.624287       269.080000 
      7.349873       2.457124       276.140000 
      7.365909       2.369305       291.830000 
      7.382285       2.403761       299.070000 
      7.398294       2.514043       315.270000 
      7.412709       2.637190       324.330000 
      7.427865       2.692434       340.780000 
      7.444291       2.682054       346.340000 
      7.459405       2.668309       350.440000 
      7.473988       2.678042       354.080000 
      7.490036       2.749480       354.200000 
      7.505960       2.776598       352.410000 
      7.520882       2.721257       350.850000 
      7.537363       2.689324       350.630000 
      7.551634       2.752622       351.030000 
      7.568352       2.804548       350.560000 
      7.583918       2.854424       347.050000 
      7.599924       2.955187       345.350000 
      7.615866       3.048537       345.620000 
      7.630927       3.109449       346.930000 
      7.647194       3.175910       349.530000 
      7.662344       3.281637       355.520000 
      7.677498       3.380295       355.800000 
      7.692831       3.392007       354.420000 
      7.708133       3.420315       355.200000 
      7.723533       3.483964       358.770000 
      7.738892       3.564253       367.500000 
      7.754600       3.734145       369.240000 
      7.770135       3.890038       369.280000 
      7.785779       3.911218       361.720000 
      7.801885       3.849360       355.690000 
      7.816603       3.825686       350.910000 
      7.832968       3.850297       352.030000 
      7.848047       3.860195       352.550000 
      7.862922       3.873585       354.190000 
      7.879452       3.922944       357.230000 
      7.894878       3.927331       364.700000 
      7.911209       3.846823       370.990000 
      7.926378       3.801438       382.630000 
      7.942016       3.892077       382.450000 
      7.957050       3.999063       203.280000 
      7.972010       4.003619       95.460000 
      7.987411       3.909493       23.930000 
      8.041278       3.885819       4.010000 
      8.049425       3.942697       14.770000 
      8.066521       3.969166       4.940000 
      8.081929       4.029716       2.600000 
      8.097046       4.137618       0.750000 
      8.111709       4.181582       14.530000 
      8.127953       4.130500       11.530000 
      8.143641       4.048530       2.950000 
      8.158486       3.924163       1.870000 
      8.174074       3.669405       9.440000 
      8.188906       2.868829       9.540000 
      8.205118       1.213965       2.690000 
      8.220030       -0.169641       0.730000 
      8.235152       -0.308501       11.450000 
      8.252023       -0.002017       13.270000 
      8.267260       0.135233       3.740000 
      8.282602       0.147250       3.580000 
      8.298167       0.105336       7.390000 
      8.313878       0.024120       12.970000 
      8.329891       -0.177167       7.530000 
      8.344907       -0.490454       4.170000 
      8.361876       -0.731690       7.940000 
      8.375839       -0.863142       10.860000 
      8.391947       -0.979757       5.940000 
      8.407648       -1.147059       2.660000 
      8.422076       -1.408865       7.450000 
      8.437815       -1.642363       10.730000 
      8.452867       -1.726266       5.050000 
      8.468146       -1.749205       2.730000 
      8.483597       -1.780571       7.960000 
      8.500712       -1.785567       10.450000 
      8.515577       -1.774827       8.260000 
      8.532093       -1.786024       3.490000 
      8.547192       -1.786468       5.510000 
      8.563326       -1.780682       10.520000 
      8.578025       -1.815607       7.810000 
      8.594872       -1.850102       4.330000 
      8.610093       -1.838945       6.860000 
      8.626258       -1.816051       10.100000 
      8.641819       -1.797266       7.810000 
      8.657330       -1.799937       4.990000 
      8.672664       -1.831318       5.170000 
      8.688139       -1.834405       10.440000 
      8.703114       -1.820120       10.050000 
      8.718281       -1.810208       4.840000 
      8.733280       -1.786011       5.220000 
      8.748847       -1.750630       7.660000 
      8.764268       -1.740288       8.630000 
      8.779355       -1.732231       5.830000 
      8.793967       -1.705766       5.280000 
      8.810484       -1.725976       7.610000 
      8.826161       -1.769357       9.080000 
      8.840685       -1.755085       5.260000 
      8.856009       -1.705323       4.550000 
      8.872388       -1.697723       8.100000 
      8.887254       -1.716534       8.790000 
      8.902465       -1.745230       7.270000 
      8.917942       -1.785098       5.430000 
      8.934228       -1.803922       6.960000 
      8.948198       -1.785554       8.980000 
      8.965075       -1.751059       7.290000 
      8.980962       -1.745687       6.150000 
      8.996447       -1.756428       7.560000 
      9.011884       -1.745687       9.010000 
      9.027616       -1.751086       7.280000 
      9.042690       -1.786454       6.150000 
      9.057844       -1.815164       7.590000 
      9.072716       -1.838891       8.630000 
      9.088377       -1.849216       8.170000 
      9.103722       -1.804822       5.910000 
      9.118133       -1.732731       6.120000 
      9.133810       -1.712078       7.220000 
      9.149729       -1.761827       7.680000 
      9.166155       -1.803923       6.540000 
      9.182112       -1.808892       6.090000 
      9.198090       -1.786427       7.250000 
      9.212402       -1.756485       7.510000 
      9.228223       -1.770301       6.330000 
      9.243267       -1.800835       5.800000 
      9.258314       -1.783270       7.580000 
      9.273900       -1.747515       8.190000 
      9.289127       -1.724994       7.620000 
      9.305191       -1.736314       6.150000 
      9.321151       -1.729893       6.940000 
      9.336070       -1.701362       8.440000 
      9.352628       -1.695411       7.560000 
      9.368585       -1.712976       6.290000 
      9.383714       -1.724134       7.240000 
      9.398957       -1.760927       8.230000 
      9.416088       -1.780585       7.240000 
      9.430541       -1.774396       6.330000 
      9.446167       -1.785971       7.210000 
      9.461941       -1.785125       8.040000 
      9.478921       -1.764042       6.760000 
      9.492687       -1.737604       6.030000 
      9.506853       -1.705779       6.340000 
      9.522115       -1.721034       7.900000 
      9.537632       -1.750573       7.460000 
      9.552870       -1.739844       6.100000 
      9.568634       -1.726836       6.490000 
      9.584082       -1.745217       7.310000 
      9.599002       -1.774340       7.400000 
      9.615803       -1.755945       6.650000 
      9.631234       -1.710265       6.850000 
      9.646813       -1.715621       7.740000 
      9.660632       -1.720990       7.980000 
      9.676329       -1.675740       6.620000 
      9.691672       -1.662314       6.590000 
      9.706210       -1.710665       7.060000 
      9.722467       -1.749686       7.950000 
      9.737227       -1.739348       7.150000 
      9.751944       -1.720577       6.470000 
      9.767754       -1.711108       7.140000 
      9.784711       -1.696850       7.670000 
      9.800295       -1.700367       6.920000 
      9.815473       -1.736717       6.440000 
      9.831096       -1.758616       7.210000 
      9.847094       -1.760484       7.580000 
      9.861589       -1.740704       6.740000 
      9.877226       -1.726889       6.470000 
      9.891977       -1.746090       6.760000 
      9.907337       -1.784695       7.670000 
      9.924359       -1.798953       7.440000 
      9.939440       -1.766313       6.720000 
      9.954353       -1.729949       7.070000 
      9.969241       -1.736717       7.560000 
      9.985207       -1.729046       7.320000 
      10.000287       -1.691424       6.900000 
      10.016142       -1.656915       6.780000 
      10.030210       -1.670354       7.660000 
      10.045140       -1.702179       7.610000 
      10.061197       -1.699937       6.750000 
      10.076588       -1.726419       6.780000 
      10.092043       -1.780598       7.200000 
      10.107759       -1.809321       7.490000 
      10.122728       -1.814694       7.140000 
      10.137651       -1.809738       6.790000 
      10.153098       -1.785138       7.190000 
      10.168784       -1.740718       7.480000 
      10.184469       -1.702678       6.900000 
      10.199868       -1.700367       6.630000 
      10.214273       -1.730888       7.190000 
      10.230144       -1.729006       7.510000 
      10.246162       -1.695923       7.420000 
      10.262069       -1.670301       6.730000 
      10.277170       -1.661398       6.930000 
      10.293939       -1.640732       7.560000 
      10.310046       -1.626903       7.340000 
      10.324803       -1.646560       6.850000 
      10.340322       -1.690953       6.950000 
      10.356237       -1.733062       7.500000 
      10.371196       -1.743804       7.270000 
      10.385942       -1.685581       6.890000 
      10.402505       -1.612092       7.050000 
      10.417493       -1.609421       7.310000 
      10.432035       -1.670341       7.400000 
      10.447362       -1.749230       6.820000 
      10.463603       -1.773856       6.780000 
      10.478959       -1.745190       7.180000 
      10.495045       -1.726392       7.180000 
      10.510449       -1.734445       6.970000 
      10.526379       -1.726376       6.760000 
      10.540521       -1.681139       7.120000 
      10.556763       -1.681582       7.320000 
      10.572217       -1.732231       7.050000 
      10.587801       -1.764458       6.840000 
      10.602644       -1.795010       7.050000 
      10.618785       -1.823137       7.300000 
      10.637114       -1.800862       7.040000 
      10.648321       -1.731306       6.840000 
      10.665170       -1.719319       7.020000 
      10.680130       -1.789098       7.420000 
      10.694970       -1.858641       7.300000 
      10.710255       -1.822707       6.840000 
      10.726379       -1.732261       6.950000 
      10.742329       -1.687854       7.360000 
      10.757473       -1.716104       7.200000 
      10.773064       -1.750130       6.930000 
      10.788480       -1.739388       6.990000 
      10.803682       -1.721463       7.270000 
      10.819767       -1.721866       7.170000 
      10.835386       -1.743914       7.050000 
      10.851383       -1.763958       6.960000 
      10.866646       -1.712507       7.210000 
      10.882656       -1.649288       7.330000 
      10.898399       -1.683380       6.980000 
      10.914183       -1.700310       6.980000 
      10.929560       -1.684765       7.050000 
      10.944605       -1.710612       7.390000 
      10.959064       -1.725502       7.210000 
      10.975212       -1.694538       6.910000 
      10.990882       -1.678428       7.120000 
      11.006275       -1.699493       7.350000 
      11.021672       -1.744703       7.120000 
      11.037138       -1.730391       6.830000 
      11.052372       -1.677484       7.160000 
      11.068210       -1.653314       7.440000 
      11.083180       -1.595908       7.360000 
      11.098485       -1.568224       6.920000 
      11.114358       -1.622779       6.990000 
      11.129712       -1.708892       7.320000 
      11.145705       -1.767557       7.240000 
      11.161660       -1.749619       7.070000 
      11.177429       -1.680199       7.010000 
      11.191989       -1.645700       7.250000 
      11.208857       -1.627732       7.140000 
      11.224614       -1.586995       6.940000 
      11.239377       -1.610722       7.140000 
      11.254977       -1.690480       7.270000 
      11.270541       -1.698967       7.200000 
      11.287050       -1.660998       7.020000 
      11.301233       -1.671643       6.950000 
      11.316615       -1.712976       7.170000 
      11.333131       -1.747875       7.130000 
      11.348104       -1.800378       6.980000 
      11.364891       -1.799813       7.000000 
      11.379887       -1.760527       7.290000 
      11.395976       -1.764418       7.200000 
      11.411968       -1.765410       7.080000 
      11.425926       -1.689569       7.040000 
      11.441200       -1.618876       7.160000 
      11.457795       -1.625464       7.200000 
      11.471986       -1.671279       7.060000 
      11.487458       -1.659489       6.890000 
      11.502851       -1.636344       7.130000 
      11.518100       -1.659932       7.310000 
      11.533696       -1.676651       7.180000 
      11.549886       -1.648748       6.950000 
      11.565230       -1.647099       7.050000 
      11.580565       -1.654989       7.200000 
      11.595913       -1.647086       7.150000 
      11.610456       -1.648332       7.010000 
      11.626313       -1.672139       7.090000 
      11.642190       -1.646574       7.190000 
      11.658432       -1.646187       7.140000 
      11.674555       -1.731721       7.050000 
      11.690445       -1.792224       7.060000 
      11.704482       -1.778369       7.270000 
      11.719752       -1.716024       7.230000 
      11.735066       -1.656942       7.050000 
      11.750669       -1.646586       7.060000 
      11.766948       -1.661787       7.220000 
      11.782445       -1.668085       7.160000 
      11.797616       -1.668484       7.120000 
      11.813403       -1.602608       7.130000 
      11.828521       -1.506777       7.190000 
      11.844127       -1.534075       7.180000 
      11.858322       -1.626832       7.090000 
      11.874555       -1.687339       7.030000 
      11.889136       -1.729935       7.230000 
      11.906084       -1.728979       7.260000 
      11.921767       -1.695949       7.010000 
      11.936909       -1.671173       6.890000 
      11.952902       -1.671739       7.020000 
      11.967937       -1.683270       7.120000 
      11.983987       -1.676638       7.190000 
      11.999538       -1.625007       7.140000 
      12.014099       -1.607621       7.080000 
      12.030241       -1.634875       7.190000 
      12.045780       -1.650116       7.030000 
      12.061736       -1.620134       7.020000 
      12.075438       -1.594981       7.100000 
      12.091719       -1.589209       7.170000 
      12.107221       -1.584240       7.150000 
      12.121787       -1.636274       6.990000 
      12.137008       -1.669330       7.080000 
      12.152770       -1.643914       7.130000 
      12.183996       -1.616494       7.010000 
      12.200288       -1.597736       7.100000 
      12.215873       -1.605793       7.210000 
      12.232045       -1.661344       7.190000 
      12.246673       -1.703479       7.170000 
      12.260810       -1.703896       7.150000 
      12.276364       -1.666287       7.220000 
      12.291639       -1.624148       7.280000 
      12.307830       -1.608048       7.140000 
      12.322175       -1.577083       7.050000 
      12.338526       -1.591937       7.150000 
      12.353766       -1.680156       7.090000 
      12.368996       -1.738431       7.020000 
      12.383175       -1.714694       7.030000 
      12.399130       -1.680615       7.100000 
      12.415131       -1.685151       7.120000 
      12.430719       -1.670244       7.110000 
      12.446153       -1.606762       7.040000 
      12.462293       -1.579714       7.110000 
      12.476692       -1.604463       7.110000 
      12.493300       -1.597223       7.150000 
      12.508568       -1.612533       7.130000 
      12.523931       -1.616910       7.150000 
      12.539494       -1.633642       7.050000 
      12.554980       -1.691300       7.150000 
      12.571011       -1.684681       7.170000 
      12.586212       -1.653287       7.030000 
      12.601803       -1.653744       7.160000 
      12.617444       -1.625047       7.120000 
      12.632661       -1.631859       7.130000 
      12.647969       -1.681485       7.110000 
      12.662997       -1.714748       7.170000 
      12.679033       -1.739361       7.190000 
      12.694420       -1.755931       7.080000 
      12.709408       -1.744747       6.990000 
      12.725063       -1.738918       7.080000 
      12.739227       -1.720506       7.090000 
      12.755360       -1.645701       7.130000 
      12.769747       -1.587438       7.010000 
      12.785937       -1.598193       7.100000 
      12.801294       -1.640731       7.130000 
      12.815817       -1.690067       7.030000 
      12.832196       -1.728080       7.030000 
      12.847487       -1.724576       7.050000 
      12.862550       -1.664941       7.050000 
      12.877666       -1.609407       7.110000 
      12.894443       -1.617034       7.060000 
      12.910125       -1.704379       7.080000 
      12.925989       -1.759501       7.110000 
      12.941768       -1.717392       7.150000 
      12.956727       -1.673028       7.000000 
      12.972387       -1.651959       7.090000 
      12.988034       -1.669441       7.140000 
      13.002998       -1.695410       7.160000 
      13.018419       -1.658642       7.140000 
      13.034510       -1.602652       7.090000 
      13.049632       -1.581609       7.190000 
      13.065224       -1.611592       7.200000 
      13.080326       -1.642586       7.150000 
      13.095896       -1.678357       7.110000 
      13.111570       -1.751501       7.030000 
      13.126575       -1.772000       7.130000 
      13.140249       -1.741176       7.190000 
      13.157473       -1.699024       7.150000 
      13.171656       -1.675696       7.110000 
      13.187235       -1.619262       7.150000 
      13.203833       -1.579354       7.160000 
      13.217558       -1.652844       7.090000 
      13.232973       -1.687712       7.190000 
      13.249903       -1.643485       7.190000 
      13.265164       -1.593170       7.120000 
      13.281359       -1.563254       7.080000 
      13.295980       -1.605807       7.060000 
      13.311978       -1.696323       7.070000 
      13.328615       -1.733975       7.130000 
      13.343934       -1.750092       7.120000 
      13.359300       -1.783755       7.080000 
      13.374725       -1.782326       7.070000 
      13.390680       -1.688296       7.110000 
      13.404867       -1.585170       7.120000 
      13.420074       -1.612963       7.070000 
      13.436124       -1.633946       7.100000 
      13.451310       -1.569025       7.190000 
      13.466866       -1.508938       7.110000 
      13.482093       -1.506706       7.130000 
      13.498835       -1.561855       7.190000 
      13.513813       -1.610222       7.240000 
      13.530088       -1.644760       7.230000 
      13.544798       -1.685084       7.180000 
      13.560998       -1.703909       7.150000 
      13.578141       -1.685084       7.250000 
      13.592822       -1.644774       7.270000 
      13.608734       -1.610692       7.160000 
      13.623778       -1.568126       7.190000 
      13.639726       -1.541232       7.300000 
      13.654247       -1.590981       7.150000 
      13.670612       -1.639318       7.120000 
      13.685803       -1.614748       7.060000 
      13.701707       -1.581569       7.160000 
      13.717005       -1.598179       7.170000 
      13.732023       -1.646117       7.070000 
      13.747469       -1.714291       6.980000 
      13.764431       -1.768873       7.050000 
      13.778846       -1.759974       7.070000 
      13.794289       -1.722764       7.040000 
      13.811275       -1.696336       7.080000 
      13.826833       -1.617420       7.070000 
      13.842625       -1.557456       7.020000 
      13.857118       -1.616534       7.090000 
      13.872879       -1.685497       7.240000 
      13.888582       -1.673041       7.150000 
      13.903805       -1.664002       7.120000 
      13.934863       -1.648358       7.220000 
      13.951122       -1.590096       7.200000 
      13.966335       -1.607635       7.110000 
      13.981957       -1.670257       7.110000 
      13.997199       -1.684695       7.150000 
      14.012509       -1.674800       7.130000 
      14.027624       -1.686011       7.130000 
      14.043450       -1.686011       7.120000 
      14.059439       -1.674840       7.150000 
      14.074893       -1.686024       7.140000 
      14.090513       -1.686454       7.090000 
      14.106684       -1.680212       7.070000 
      14.121835       -1.709282       7.120000 
      14.136249       -1.713804       7.130000 
      14.152719       -1.635305       7.150000 
      14.167646       -1.548942       7.080000 
      14.182853       -1.555987       7.040000 
      14.199130       -1.623288       7.180000 
      14.214717       -1.642476       7.050000 
      14.230825       -1.665414       6.930000 
      14.244825       -1.675199       7.150000 
      14.259617       -1.645700       7.250000 
      14.276536       -1.632678       6.970000 
      14.292555       -1.669440       6.830000 
      14.307642       -1.714650       7.130000 
      14.323696       -1.684655       7.220000 
      14.339556       -1.629077       6.990000 
      14.355582       -1.608007       7.020000 
      14.371536       -1.570798       7.330000 
      14.387027       -1.556526       7.150000 
      14.402971       -1.587341       6.900000 
      14.418275       -1.620590       7.250000 
      14.434700       -1.663559       7.270000 
      14.450617       -1.695409       7.240000 
      14.464583       -1.664471       6.890000 
      14.479571       -1.632248       7.090000 
      14.496567       -1.645660       7.200000 
      14.511605       -1.674339       7.080000 
      14.528531       -1.655488       7.060000 
      14.544533       -1.604436       7.210000 
      14.559526       -1.586468       7.320000 
      14.576556       -1.562284       7.060000 
      14.592515       -1.535402       7.040000 
      14.606429       -1.567200       7.240000 
      14.622399       -1.604379       7.210000 
      14.637030       -1.609335       7.230000 
      14.653058       -1.591384       7.000000 
      14.669056       -1.575283       7.090000 
      14.685171       -1.586051       7.160000 
      14.701572       -1.586898       7.150000 
      14.717324       -1.585665       7.010000 
      14.731478       -1.635252       7.040000 
      14.747901       -1.675281       7.080000 
      14.762070       -1.655861       7.180000 
      14.777847       -1.608989       7.130000 
      14.793948       -1.535320       7.010000 
      14.809027       -1.540469       7.140000 
      14.824956       -1.614639       7.250000 
      14.840064       -1.699505       7.190000 
      14.855461       -1.722667       7.010000 
      14.872229       -1.690067       7.120000 
      14.886774       -1.646103       7.150000 
      14.902521       -1.621932       7.170000 
      14.917560       -1.621437       6.970000 
      14.934137       -1.638529       6.960000 
      14.948245       -1.640217       7.250000 
      14.964289       -1.578441       7.170000 
      14.980321       -1.554244       7.010000 
      14.994707       -1.636647       7.160000 
      15.010591       -1.638888       7.290000 
      15.026313       -1.564099       7.090000 
      15.041527       -1.549261       6.960000 
      15.056709       -1.564941       7.020000 
      15.072568       -1.584695       7.170000 
      15.087926       -1.580142       7.210000 
      15.102765       -1.545230       7.030000 
      15.118994       -1.521477       7.040000 
      15.133797       -1.516521       7.200000 
      15.149682       -1.521047       7.190000 
      15.164025       -1.540301       6.980000 
      15.180964       -1.562244       7.010000 
      15.196025       -1.580226       7.190000 
      15.211294       -1.633962       7.300000 
      15.227358       -1.665799       7.120000 
      15.242941       -1.623677       6.970000 
      15.257587       -1.602208       7.090000 
      15.273203       -1.611108       7.100000 
      15.289467       -1.615218       7.080000 
      15.304946       -1.616037       7.060000 
      15.321111       -1.620550       7.130000 
      15.336161       -1.633519       7.190000 
      15.351658       -1.620063       7.090000 
      15.366215       -1.545687       7.070000 
      15.381993       -1.487452       7.100000 
      15.399066       -1.498623       7.040000 
      15.413495       -1.545727       7.090000 
      15.429542       -1.610222       7.070000 
      15.444060       -1.660874       7.080000 
      15.460222       -1.692698       7.130000 
      15.474755       -1.719176       7.150000 
      15.491241       -1.675656       7.160000 
      15.506746       -1.597779       7.070000 
      15.522688       -1.611595       7.210000 
      15.537107       -1.690024       7.220000 
      15.552530       -1.692252       7.000000 
      15.569003       -1.621020       7.040000 
      15.584767       -1.563657       7.100000 
      15.599672       -1.582065       7.160000 
      15.616692       -1.656402       7.140000 
      15.631160       -1.708422       7.120000 
      15.646640       -1.727663       7.140000 
      15.662962       -1.701695       7.170000 
      15.677335       -1.635832       7.130000 
      15.693741       -1.632731       7.090000 
      15.707787       -1.681069       7.090000 
      15.724873       -1.709362       7.120000 
      15.740088       -1.715594       7.120000 
      15.770082       -1.720993       7.100000 
      15.785042       -1.739374       7.160000 
      15.801637       -1.750102       7.120000 
      15.816723       -1.715164       7.070000 
      15.833533       -1.675270       7.090000 
      15.849126       -1.661827       7.240000 
      15.863641       -1.640744       7.120000 
      15.880597       -1.626876       7.010000 
      15.895557       -1.645647       7.110000 
      15.911173       -1.679283       7.130000 
      15.926800       -1.674340       7.030000 
      15.943009       -1.621906       7.080000 
      15.958924       -1.592354       7.110000 
      15.974138       -1.639831       7.170000 
      15.990194       -1.684611       7.110000 
      16.004318       -1.638932       7.060000 
      16.020468       -1.581112       7.140000 
      16.036300       -1.568126       7.220000 
      16.052404       -1.570811       7.190000 
      16.068745       -1.596836       7.110000 
      16.083859       -1.640234       7.090000 
      16.099900       -1.684225       7.020000 
      16.114753       -1.698523       7.090000 
      16.130740       -1.661800       7.090000 
      16.145695       -1.616564       7.070000 
      16.160059       -1.645674       7.110000 
      16.177963       -1.690493       7.180000 
      16.192809       -1.664458       7.030000 
      16.207607       -1.636747       7.020000 
      16.222554       -1.659073       7.120000 
      16.239097       -1.666323       7.190000 
      16.254633       -1.606653       7.100000 
      16.269113       -1.602749       7.120000 
      16.284693       -1.700296       7.170000 
      16.300360       -1.764913       7.140000 
      16.315823       -1.746505       7.070000 
      16.331782       -1.730834       7.130000 
      16.346742       -1.681082       7.100000 
      16.361909       -1.611662       7.140000 
      16.377944       -1.608965       7.160000 
      16.394309       -1.664955       7.050000 
      16.409914       -1.725489       7.030000 
      16.424872       -1.739778       7.160000 
      16.441765       -1.749716       7.220000 
      16.456167       -1.774756       7.120000 
      16.471680       -1.755971       7.010000 
      16.488528       -1.710708       7.080000 
      16.503868       -1.721006       7.070000 
      16.519085       -1.744717       7.050000 
      16.534894       -1.709349       7.080000 
      16.550081       -1.651516       7.170000 
      16.565799       -1.627775       7.130000 
      16.580731       -1.646144       7.030000 
      16.595798       -1.685568       7.030000 
      16.610327       -1.709295       7.180000 
      16.626548       -1.708838       7.210000 
      16.641877       -1.679282       7.140000 
      16.657201       -1.611108       6.890000 
      16.671884       -1.538171       7.000000 
      16.688027       -1.531763       7.170000 
      16.703696       -1.587893       7.180000 
      16.720659       -1.631664       7.110000 
      16.734134       -1.651058       7.070000 
      16.752087       -1.613283       7.170000 
      16.765166       -1.571806       7.180000 
      16.780935       -1.543391       7.140000 
      16.796893       -1.548969       7.080000 
      16.813847       -1.648735       7.150000 
      16.828807       -1.774338       7.210000 
      16.844764       -1.766119       7.050000 
      16.861156       -1.687010       7.000000 
      16.875276       -1.650077       7.150000 
      16.891541       -1.652911       7.180000 
      16.906999       -1.619192       7.130000 
      16.922739       -1.602249       7.070000 
      16.936933       -1.616951       7.120000 
      16.954166       -1.645257       7.150000 
      16.969662       -1.685528       7.050000 
      16.984904       -1.708851       7.120000 
      17.000540       -1.703452       7.160000 
      17.014806       -1.655502       7.170000 
      17.031399       -1.575740       7.020000 
      17.045989       -1.527789       7.040000 
      17.062588       -1.522363       7.250000 
      17.078060       -1.544815       7.150000 
      17.094093       -1.574797       7.040000 
      17.109639       -1.562284       7.120000 
      17.124808       -1.547060       7.160000 
      17.140754       -1.626378       7.070000 
      17.156717       -1.732105       7.030000 
      17.172494       -1.731676       7.250000 
      17.186849       -1.621006       7.130000 
      17.202718       -1.523763       7.050000 
      17.218176       -1.533658       7.190000 
      17.234759       -1.605320       7.250000 
      17.249916       -1.655529       7.140000 
      17.266492       -1.674813       7.080000 
      17.282035       -1.715580       7.150000 
      17.296672       -1.755058       7.160000 
      17.313434       -1.758159       7.160000 
      17.328120       -1.736260       7.120000 
      17.343319       -1.694968       7.170000 
      17.358675       -1.672639       7.220000 
      17.375107       -1.670757       7.110000 
      17.390079       -1.690510       7.050000 
      17.405117       -1.703466       7.200000 
      17.421717       -1.674340       7.240000 
      17.437787       -1.597736       7.030000 
      17.452717       -1.547974       7.050000 
      17.468924       -1.602692       7.080000 
      17.484154       -1.693527       7.190000 
      17.498206       -1.722763       7.170000 
      17.513862       -1.676487       7.180000 
      17.529029       -1.582937       7.170000 
      17.545151       -1.467698       7.160000 
      17.560565       -1.450312       7.220000 
      17.574994       -1.541162       7.260000 
      17.590960       -1.642984       7.120000 
      17.606816       -1.668860       7.190000 
      17.622369       -1.630905       7.100000 
      17.637628       -1.624564       7.000000 
      17.651965       -1.647915       7.020000 
      17.668069       -1.624121       7.280000 
      17.683946       -1.625519       7.160000 
      17.699378       -1.645120       6.990000 
      17.714632       -1.608892       7.080000 
      17.729352       -1.545231       7.120000 
      17.746142       -1.492807       7.170000 
      17.760906       -1.458755       7.050000 
      17.776175       -1.492864       7.130000 
      17.791737       -1.610638       7.160000 
      17.808231       -1.718290       7.240000 
      17.823407       -1.746877       7.090000 
      17.839016       -1.716992       7.110000 
      17.854424       -1.679217       7.140000 
      17.870637       -1.687007       7.160000 
      17.885596       -1.673385       7.080000 
      17.900287       -1.623801       7.020000 
      17.916027       -1.596328       7.170000 
      17.932223       -1.665896       7.180000 
      17.946990       -1.728036       7.000000 
      17.961950       -1.683808       7.010000 
      17.977895       -1.606183       7.100000 
      17.994852       -1.578938       7.080000 
      18.008811       -1.595438       7.140000 
      18.023772       -1.636314       7.120000 
      18.039730       -1.659462       7.120000 
      18.055687       -1.670396       7.160000 
      18.071645       -1.678260       7.170000 
      18.087051       -1.656954       7.050000 
      18.103796       -1.598539       7.080000 
      18.117789       -1.575850       7.050000 
      18.134665       -1.585986       7.060000 
      18.149885       -1.670423       7.020000 
      18.165843       -1.752663       7.100000 
      18.179832       -1.729531       7.160000 
      18.194943       -1.659559       7.060000 
      18.211678       -1.643902       7.050000 
      18.225834       -1.646143       7.030000 
      18.241728       -1.669428       7.170000 
      18.257055       -1.700809       7.150000 
      18.273068       -1.683269       7.090000 
      18.289304       -1.647475       7.050000 
      18.304451       -1.623651       7.070000 
      18.319305       -1.619660       7.190000 
      18.334129       -1.551459       7.180000 
      18.349761       -1.452043       7.110000 
      18.380500       -1.457372       7.270000 
      18.397548       -1.515591       7.130000 
      18.411509       -1.509349       7.080000 
      18.428501       -1.480643       7.190000 
      18.444590       -1.491437       7.250000 
      18.459827       -1.505749       7.130000 
      18.474138       -1.502692       7.120000 
      18.490567       -1.535792       7.280000 
      18.505259       -1.630431       7.150000 
      18.521810       -1.687658       7.090000 
      18.537219       -1.664057       7.100000 
      18.553128       -1.612866       7.210000 
      18.569232       -1.554214       7.280000 
      18.583576       -1.471754       7.070000 
      18.599504       -1.486995       7.120000 
      18.615208       -1.566713       7.280000 
      18.630297       -1.582410       7.230000 
      18.645993       -1.571699       7.130000 
      18.661661       -1.570743       7.110000 
      18.677317       -1.590980       7.140000 
      18.693711       -1.609738       7.170000 
      18.707669       -1.608879       7.130000 
      18.723729       -1.580182       7.140000 
      18.739331       -1.522350       7.110000 
      18.754522       -1.491951       7.150000 
      18.768947       -1.535332       7.100000 
      18.800693       -1.571655       7.200000 
      18.816650       -1.552831       7.110000 
      18.832607       -1.560914       7.080000 
      18.848567       -1.551446       7.080000 
      18.862923       -1.510359       7.210000 
      18.878002       -1.523249       7.200000 
      18.893608       -1.573055       7.170000 
      18.909058       -1.647001       7.130000 
      18.925743       -1.729851       7.060000 
      18.940029       -1.703036       7.070000 
      18.955929       -1.629963       7.060000 
      18.970210       -1.600424       7.050000 
      18.986968       -1.603091       7.060000 
      19.001687       -1.647485       7.130000 
      19.018468       -1.640678       7.130000 
      19.034490       -1.639028       7.160000 
      19.049926       -1.691729       7.200000 
      19.065010       -1.684251       7.180000 
      19.079874       -1.647875       7.140000 
      19.095205       -1.629103       7.170000 
      19.110404       -1.579713       7.140000 
      19.125289       -1.582095       7.190000 
      19.140279       -1.618664       7.120000 
      19.157370       -1.601265       7.160000 
      19.172244       -1.539862       7.130000 
      19.187601       -1.540261       7.210000 
      19.202665       -1.542073       7.150000 
      19.219647       -1.478451       7.090000 
      19.233988       -1.455131       7.180000 
      19.249962       -1.481582       7.150000 
      19.266164       -1.558186       7.110000 
      19.280305       -1.610663       7.020000 
      19.297220       -1.567559       7.100000 
      19.312329       -1.534116       7.130000 
      19.327711       -1.544705       7.090000 
      19.343760       -1.582050       7.080000 
      19.359279       -1.588629       7.130000 
      19.373717       -1.589624       7.180000 
      19.388886       -1.574757       7.120000 
      19.404958       -1.516117       7.160000 
      19.420820       -1.463671       7.110000 
      19.436717       -1.487425       7.190000 
      19.451665       -1.579739       7.160000 
      19.467654       -1.638378       7.090000 
      19.483866       -1.613378       7.070000 
      19.499932       -1.564901       7.120000 
      19.515711       -1.519262       7.180000 
      19.531668       -1.490109       7.080000 
      19.547683       -1.537161       7.080000 
      19.563197       -1.574327       7.160000 
      19.578716       -1.563598       7.120000 
      19.593460       -1.542976       7.040000 
      19.609912       -1.529949       7.070000 
      19.625206       -1.560054       7.080000 
      19.639733       -1.564388       7.110000 
      19.656485       -1.501376       7.090000 
      19.672023       -1.461346       7.060000 
      19.687132       -1.494192       7.110000 
      19.703628       -1.537963       7.170000 
      19.718751       -1.580695       7.160000 
      19.733771       -1.578300       7.170000 
      19.749828       -1.547985       7.160000 
      19.764936       -1.536262       7.160000 
      19.781496       -1.591410       7.150000 
      19.796390       -1.649189       7.160000 
      19.811212       -1.651417       7.050000 
      19.827414       -1.600782       7.150000 
      19.843599       -1.500380       7.160000 
      19.859279       -1.433188       7.150000 
      19.873811       -1.422377       7.110000 
      19.890073       -1.439899       7.120000 
      19.905380       -1.456885       7.170000 
      19.920674       -1.457371       7.190000 
      19.936091       -1.510668       7.130000 
      19.951662       -1.618250       7.150000 
      19.967358       -1.645518       7.170000 
      19.982838       -1.536274       7.180000 
      19.998492       -1.408079       7.120000 
      20.013973       -1.415733       7.190000 
      20.029147       -1.510678       7.170000 
      20.044860       -1.596737       7.180000 
      20.059794       -1.613267       7.150000 
      20.075748       -1.539361       7.170000 
      20.091705       -1.457358       7.110000 
      20.107322       -1.427735       7.190000 
      20.123371       -1.438972       7.260000 
      20.139369       -1.439358       7.250000 
      20.155368       -1.368113       7.180000 
      20.170759       -1.312149       7.100000 
      20.185867       -1.392297       7.120000 
      20.200557       -1.484208       7.150000 
      20.230793       -1.482343       7.170000 
      20.245878       -1.452015       7.200000 
      20.262491       -1.439292       7.190000 
      20.277178       -1.439056       7.200000 
      20.294339       -1.428135       7.130000 
      20.308952       -1.463682       7.210000 
      20.324140       -1.489542       7.120000 
      20.340128       -1.519703       7.120000 
      20.356107       -1.550506       7.140000 
      20.371126       -1.538958       7.100000 
      20.386595       -1.516064       7.220000 
      20.403814       -1.497696       7.160000 
      20.419648       -1.504933       7.050000 
      20.433819       -1.551459       7.060000 
      20.450774       -1.566743       7.140000 
      20.465888       -1.582413       7.100000 
      20.481786       -1.635277       7.140000 
      20.496889       -1.593124       7.190000 
      20.513848       -1.486081       7.220000 
      20.529031       -1.433578       7.170000 
      20.557975       -1.440341       7.240000 
      20.573203       -1.451030       7.140000 
      20.588629       -1.426432       7.100000 
      20.604590       -1.429936       7.080000 
      20.621573       -1.476168       7.090000 
      20.637559       -1.472028       7.060000 
      20.652519       -1.417490       7.040000 
      20.668693       -1.361360       7.090000 
      20.684701       -1.378548       7.140000 
      20.698666       -1.436662       7.130000 
      20.715065       -1.501322       7.150000 
      20.729268       -1.587299       7.150000 
      20.744968       -1.654101       7.170000 
      20.760323       -1.609711       7.070000 
      20.776488       -1.544844       7.130000 
      20.791037       -1.551888       7.170000 
      20.806638       -1.531775       7.080000 
      20.824148       -1.488323       7.060000 
      20.852351       -1.502581       7.150000 
      20.869265       -1.486011       7.180000 
      20.882951       -1.458257       7.110000 
      20.897708       -1.472099       7.150000 
      20.913706       -1.435332       7.170000 
      20.927409       -1.391521       7.120000 
      20.943637       -1.417394       7.080000 
      20.958756       -1.461384       7.100000 
      20.975140       -1.493195       7.220000 
      20.992078       -1.525879       7.190000 
      21.005829       -1.515164       7.190000 
