

 time    ||    gripping force   ||   raspberry measurement 

      0       30.230000       -794.030769 
      0       29.430000       -794.030769 
      0       27.730000       -794.030769 
      0       24.870000       -794.030769 
      0       24.940000       -794.030769 
      0       21.560000       -794.030769 
      0       19.050000       -794.030769 
      0       17.040000       -794.030769 
      1       15.920000       -786.090462 
      1       13.830000       -778.229552 
      1       13.470000       -770.446088 
      1       12.880000       -762.636441 
      1       12.710000       -759.117944 
      2       11.220000       -716.252783 
      2       11.200000       -524.131971 
      2       11.180000       -207.331533 
      2       11.150000       -15.148932 
      3       11.230000       27.673233 
      3       11.280000       31.129928 
      3       11.290000       31.255817 
      3       11.330000       31.285274 
      4       11.370000       31.256130 
      4       11.340000       31.227007 
      5       11.440000       31.256129 
      5       11.380000       31.285225 
      5       11.340000       31.255243 
      5       11.320000       31.216208 
      5       11.140000       31.207735 
      5       10.920000       31.205464 
      6       10.990000       31.207735 
      6       10.870000       31.216208 
      6       12.030000       31.255243 
      6       12.550000       31.285199 
      7       16.960000       31.255243 
      7       18.180000       31.216235 
      7       20.430000       31.208621 
      7       21.050000       31.216235 
      8       21.000000       31.255243 
      8       20.930000       31.285199 
      8       21.500000       31.255243 
      8       21.880000       31.216235 
      9       22.620000       31.208622 
      9       22.830000       31.216262 
      9       23.280000       31.256130 
      9       23.670000       31.296024 
      9       24.230000       31.304524 
      9       26.600000       31.306822 
      9       27.050000       31.305410 
      10       28.750000       31.306849 
      10       29.280000       31.305410 
      10       29.230000       31.306849 
      10       29.230000       31.305410 
      10       29.240000       31.306849 
      11       29.160000       31.305410 
      11       29.130000       31.306822 
      11       29.110000       31.304537 
      11       29.150000       31.296480 
      11       29.180000       31.261958 
      11       29.170000       31.245402 
      11       29.170000       31.266884 
      11       29.330000       31.251187 
      11       29.320000       31.226617 
      12       29.310000       31.257446 
      12       29.310000       31.301449 
      12       29.360000       31.328721 
      12       29.450000       31.346716 
      12       29.500000       31.329607 
      12       29.470000       31.312221 
      12       29.430000       31.304994 
      13       29.440000       31.296950 
      13       29.420000       31.267814 
      13       29.420000       31.275428 
      13       29.370000       31.335918 
      13       29.460000       31.333646 
      13       29.350000       31.266928 
      13       29.400000       31.227920 
      14       29.410000       31.257043 
      14       29.390000       31.296051 
      14       29.420000       31.304524 
      14       29.390000       31.306822 
      14       29.380000       31.305410 
      14       29.360000       31.306849 
      14       29.360000       31.305410 
      15       29.370000       31.306849 
      15       29.380000       31.305410 
      15       29.340000       31.306862 
      15       29.400000       31.305854 
      15       29.330000       31.312261 
      15       29.350000       31.330050 
      15       29.360000       31.352142 
      16       29.360000       31.353791 
      16       29.320000       31.351685 
      16       29.400000       31.324221 
      16       29.320000       31.283095 
      16       29.290000       31.246731 
      16       29.310000       31.261998 
      16       29.360000       31.296454 
      16       29.310000       31.303651 
      16       29.330000       31.296024 
      16       29.330000       31.257016 
      16       29.310000       31.227060 
      17       29.280000       31.257016 
      17       29.330000       31.296050 
      17       29.310000       31.304524 
      17       29.300000       31.306822 
      17       29.260000       31.305410 
      18       29.290000       31.306849 
      18       29.290000       31.305410 
      18       29.280000       31.306849 
      18       29.310000       31.305410 
      18       29.350000       31.306849 
      18       29.240000       31.305410 
      18       29.330000       31.306849 
      18       29.340000       31.305410 
      18       29.290000       31.306849 
      19       29.270000       31.305410 
      19       29.300000       31.306849 
      19       29.270000       31.305410 
      20       30.920000       31.306849 
      20       31.160000       31.305437 
      20       31.280000       31.307735 
      20       31.330000       31.316208 
      20       31.350000       31.355243 
      20       31.260000       31.385199 
      20       31.380000       31.355243 
      21       31.320000       31.316208 
      21       31.300000       31.307735 
      21       31.310000       31.305423 
      21       31.300000       31.306392 
      21       31.260000       31.299581 
      21       31.240000       31.277683 
      21       31.270000       31.246301 
      21       31.280000       31.262428 
      21       31.180000       31.301879 
      22       31.230000       31.328734 
      22       31.260000       31.346716 
      22       31.260000       31.329607 
      22       31.300000       31.312248 
      22       31.220000       31.305853 
      22       31.220000       31.306835 
      22       31.280000       31.304537 
      22       31.210000       31.296480 
      22       31.240000       31.261985 
      22       31.280000       31.246288 
      22       31.170000       31.277682 
      23       31.220000       31.299581 
      23       31.230000       31.306406 
      23       31.140000       31.305853 
      23       31.210000       31.312677 
      23       31.220000       31.334550 
      23       31.180000       31.365098 
      23       31.200000       31.339932 
      24       31.210000       31.273227 
      24       31.230000       31.257529 
      24       31.160000       31.321134 
      24       31.190000       31.360142 
      24       31.190000       31.334120 
      24       31.220000       31.312664 
      24       31.170000       31.305866 
      24       31.200000       31.306862 
      25       31.200000       31.305410 
      25       31.180000       31.306849 
      25       31.130000       31.305410 
      26       31.180000       31.306849 
      26       31.160000       31.305410 
      26       31.190000       31.306849 
      26       31.140000       31.305437 
      26       31.140000       31.307722 
      26       31.130000       31.315778 
      26       31.200000       31.350274 
      26       31.160000       31.365971 
      26       31.180000       31.334576 
      27       31.160000       31.312678 
      27       31.120000       31.305867 
      27       31.160000       31.306889 
      27       31.130000       31.306297 
      27       31.210000       31.317647 
      27       31.160000       31.353804 
      27       31.180000       31.386610 
      27       31.180000       31.352931 
      27       31.240000       31.307279 
      27       31.180000       31.262872 
      27       31.190000       31.246315 
      28       31.160000       31.277656 
      28       31.150000       31.298708 
      28       31.150000       31.296024 
      28       31.140000       31.261985 
      29       31.150000       31.246731 
      29       31.130000       31.283081 
      29       31.130000       31.323778 
      29       31.130000       31.346260 
      29       31.190000       31.328707 
      29       31.120000       31.301449 
      29       31.140000       31.257459 
      29       31.120000       31.227074 
      29       31.140000       31.257016 
      30       31.120000       31.296050 
      30       31.150000       31.304510 
      30       31.170000       31.306378 
      30       31.170000       31.299997 
      30       31.140000       31.282195 
      30       31.140000       31.259687 
      30       31.110000       31.253485 
      30       31.130000       31.240889 
      30       31.140000       31.261542 
      31       31.080000       31.296467 
      31       31.160000       31.304537 
      31       31.090000       31.306795 
      31       31.120000       31.304524 
      31       31.160000       31.296050 
      31       31.090000       31.257016 
      31       31.090000       31.227060 
      32       31.090000       31.257016 
      32       31.090000       31.296050 
      32       31.150000       31.304524 
      32       31.120000       31.306822 
      32       31.110000       31.305410 
      32       31.140000       31.306849 
      32       31.130000       31.305410 
      33       31.070000       31.306849 
      33       31.080000       31.305410 
      33       31.090000       31.306862 
      33       31.100000       31.305853 
      34       31.080000       31.312248 
      34       31.080000       31.329607 
      34       31.030000       31.346743 
      34       31.090000       31.329607 
      34       31.070000       31.312221 
      34       31.100000       31.304980 
      34       31.070000       31.296494 
      34       31.080000       31.261985 
      35       31.170000       31.246288 
      35       31.110000       31.277682 
      35       31.090000       31.299581 
      35       31.120000       31.306392 
      35       31.070000       31.305397 
      35       31.110000       31.306848 
      35       31.100000       31.305410 
      35       31.040000       31.306849 
      35       31.070000       31.305437 
      36       31.050000       31.307722 
      36       31.100000       31.315778 
      36       31.130000       31.350274 
      36       31.130000       31.365971 
      36       31.030000       31.334576 
      36       31.080000       31.312678 
      37       31.100000       31.305867 
      37       31.100000       31.306862 
      37       31.040000       31.305410 
      37       31.100000       31.306822 
      37       31.110000       31.304537 
      37       31.060000       31.296480 
      37       31.040000       31.261999 
      37       31.080000       31.246731 
      38       31.050000       31.283055 
      38       31.100000       31.322892 
      38       31.040000       31.335488 
      38       31.110000       31.281200 
      38       31.100000       31.232459 
      38       31.040000       31.257446 
      38       31.090000       31.295607 
      39       31.080000       31.298708 
      39       31.060000       31.278099 
      39       31.070000       31.251687 
      39       31.070000       31.286182 
      39       31.050000       31.336388 
      40       31.070000       31.329177 
      40       31.100000       31.317593 
      40       31.070000       31.329164 
      40       31.070000       31.335958 
      40       31.050000       31.281213 
      40       31.060000       31.232459 
      40       31.090000       31.257459 
      41       31.010000       31.296064 
      41       31.060000       31.304524 
      41       31.060000       31.306822 
      41       31.090000       31.305410 
      41       31.070000       31.306849 
      42       31.050000       31.305410 
      42       31.110000       31.306849 
      42       31.080000       31.305410 
      42       31.070000       31.306849 
      42       31.090000       31.305410 
      42       31.000000       31.306849 
      42       31.110000       31.305410 
      42       31.090000       31.306849 
      42       31.110000       31.305410 
      42       31.070000       31.306822 
      43       31.070000       31.304524 
      43       31.050000       31.296050 
      43       31.050000       31.257016 
      43       31.070000       31.227060 
      43       31.070000       31.257043 
      43       31.090000       31.296937 
      43       31.050000       31.315322 
      43       31.050000       31.355216 
      44       31.060000       31.385198 
      44       31.020000       31.355243 
      44       31.150000       31.316208 
      44       31.040000       31.307735 
      44       31.010000       31.305437 
      45       31.030000       31.306822 
      45       31.050000       31.304524 
      45       31.030000       31.296050 
      45       31.080000       31.257016 
      46       31.050000       31.227060 
      46       31.050000       31.257043 
      47       31.020000       31.296924 
      47       31.050000       31.314892 
      47       31.080000       31.350247 
      47       31.050000       31.365970 
      47       31.080000       31.334576 
      47       30.990000       31.312678 
      47       30.990000       31.305867 
      47       31.020000       31.306862 
      47       30.930000       31.305411 
      47       30.930000       31.306862 
      47       30.890000       31.305853 
      48       30.800000       31.312248 
      48       30.770000       31.329607 
      49       30.550000       31.346743 
      49       30.580000       31.329607 
      49       30.530000       31.312261 
      49       30.520000       31.306297 
      49       30.490000       31.312261 
      49       30.520000       31.329634 
      49       30.520000       31.347616 
      49       30.520000       31.339976 
      50       30.530000       31.355673 
      50       30.500000       31.366414 
      50       30.470000       31.334590 
      50       30.500000       31.312691 
      51       30.590000       31.306310 
      51       30.490000       31.312261 
      51       30.510000       31.329607 
      51       30.480000       31.346743 
      51       30.460000       31.329607 
      51       30.550000       31.312248 
      52       30.470000       31.305853 
      52       30.580000       31.306862 
      52       30.500000       31.305410 
      52       30.470000       31.306849 
      52       30.510000       31.305410 
      52       30.500000       31.306849 
      53       30.460000       31.305410 
      53       30.510000       31.306822 
      53       30.500000       31.304524 
      53       30.470000       31.296050 
      53       30.530000       31.257016 
      53       30.550000       31.227060 
      53       30.500000       31.257016 
      53       30.500000       31.296050 
      54       30.510000       31.304524 
      54       30.450000       31.306822 
      54       30.520000       31.305410 
      54       30.540000       31.306849 
      54       30.510000       31.305410 
      54       30.490000       31.306849 
      54       30.470000       31.305410 
      54       30.500000       31.306822 
      54       30.500000       31.304524 
      55       30.520000       31.296050 
      55       30.520000       31.257016 
      55       30.540000       31.227060 
      55       30.500000       31.257043 
      55       30.540000       31.296924 
      56       30.560000       31.314892 
      56       30.540000       31.350247 
      56       30.500000       31.365970 
      56       30.510000       31.334576 
      56       30.580000       31.312678 
      57       30.480000       31.305867 
      57       30.540000       31.306862 
      57       30.480000       31.305411 
      57       30.530000       31.306862 
      58       30.460000       31.305854 
      58       30.560000       31.312261 
      58       30.530000       31.330050 
      58       30.540000       31.352142 
      59       30.480000       31.353804 
      59       30.510000       31.352142 
      59       30.550000       31.330050 
      59       30.540000       31.312261 
      59       30.490000       31.305854 
      59       30.510000       31.306862 
      59       30.480000       31.305410 
      59       30.480000       31.306849 
      59       30.530000       31.305410 
      60       30.530000       31.306849 
      60       30.500000       31.305410 
      60       30.500000       31.306849 
      60       30.520000       31.305410 
      60       30.520000       31.306849 
