

 time    ||    gripping force   ||   raspberry measurement 

      0       0.090000       -795.000000 
      0       0.030000       -795.000000 
      0       0.360000       -795.000000 
      0       0.000000       -795.000000 
      0       0.100000       -795.000000 
      1       16.140000       -787.050000 
      1       52.000000       -779.179500 
      1       74.690000       -771.387705 
      1       111.020000       -763.673828 
      1       142.770000       -756.037085 
      1       153.040000       -748.475547 
      1       143.850000       -740.885725 
      1       111.320000       -737.371256 
      1       96.490000       -694.555963 
      2       98.320000       -502.667350 
      2       113.160000       -186.276980 
      2       126.740000       5.664174 
      2       112.530000       48.517509 
      2       105.430000       52.046640 
      2       107.010000       52.322257 
      2       112.190000       52.735991 
      2       112.070000       53.284669 
      2       111.870000       54.008243 
      2       111.850000       54.700611 
      3       111.710000       55.040949 
      3       111.570000       55.045607 
      3       111.530000       54.871348 
      3       111.400000       54.578366 
      3       111.300000       54.307304 
      3       111.110000       54.364131 
      3       110.910000       54.679582 
      3       110.550000       54.836776 
      3       109.790000       54.707400 
      3       109.600000       54.559508 
      3       108.820000       54.641601 
      3       108.520000       54.766503 
      4       108.260000       54.787256 
      4       107.090000       54.794759 
      4       107.040000       54.758462 
      4       107.050000       54.661301 
      4       106.970000       54.642850 
      4       106.750000       54.658100 
      4       106.400000       54.610525 
      4       106.270000       54.579203 
      4       105.430000       54.597900 
      4       104.900000       54.585357 
      4       104.620000       54.430776 
      4       104.610000       54.270300 
      4       104.600000       54.240291 
      5       104.540000       54.324035 
      5       104.620000       54.460287 
      5       103.970000       54.449006 
      5       103.860000       54.342893 
      5       103.610000       54.335266 
      5       103.280000       54.409608 
      5       102.110000       54.426678 
      5       102.130000       54.350423 
      5       102.140000       54.322681 
      5       102.100000       54.330664 
      5       102.070000       54.265700 
      6       102.010000       54.153676 
      6       100.950000       54.103909 
      6       100.400000       54.130334 
      6       100.360000       54.166657 
      6       100.450000       54.230682 
      6       100.090000       54.285830 
      6       99.690000       54.267875 
      7       99.530000       54.203907 
      7       99.470000       54.129838 
      8       99.090000       54.145675 
      8       98.960000       54.268331 
      8       99.030000       54.349891 
      8       98.930000       54.259431 
      8       98.840000       54.163020 
      8       98.770000       54.161744 
      8       98.770000       54.177758 
      8       98.790000       54.188182 
      8       98.790000       54.129726 
      8       98.780000       54.073911 
      8       98.750000       54.057579 
      8       98.620000       54.057741 
      9       98.580000       54.056705 
      9       98.510000       54.063516 
      9       98.360000       54.085415 
      9       98.350000       54.116809 
      9       97.290000       54.101112 
      9       97.100000       54.066643 
      9       96.870000       54.059433 
      9       96.760000       54.066644 
      10       96.510000       54.101139 
      10       96.470000       54.117696 
      10       95.650000       54.096213 
      11       95.460000       54.111910 
      11       95.070000       54.136493 
      11       95.050000       54.106095 
      11       94.510000       54.067047 
      11       94.400000       54.058573 
      12       94.160000       54.056275 
      12       94.170000       54.057687 
      12       94.060000       54.056249 
      12       94.070000       54.057687 
      12       94.030000       54.056249 
      13       94.020000       54.057687 
      13       94.020000       54.056249 
      13       93.990000       54.057687 
      13       93.270000       54.056249 
      13       93.170000       54.057687 
      14       93.050000       54.056248 
      14       93.070000       54.057660 
      14       93.030000       54.055362 
      14       92.940000       54.046862 
      14       92.970000       54.006968 
      14       92.930000       53.967074 
      15       92.670000       53.958574 
      15       92.640000       53.956275 
      15       92.660000       53.957687 
      15       92.570000       53.956249 
      15       92.580000       53.957687 
      15       92.490000       53.956275 
      15       92.500000       53.958573 
      15       92.500000       53.967047 
      15       92.470000       54.006081 
      16       92.420000       54.036037 
      16       91.710000       54.006081 
      16       88.990000       53.967073 
      16       88.830000       53.959446 
      17       88.590000       53.966617 
      17       88.440000       54.000239 
      17       88.050000       54.006441 
      17       88.000000       53.941990 
      18       87.970000       53.902983 
      18       88.020000       53.929890 
      19       88.270000       53.962131 
      19       88.260000       54.016853 
      19       88.210000       54.089387 
      19       88.210000       54.105097 
      19       88.220000       54.036107 
      19       88.250000       53.972902 
      19       88.260000       53.959030 
      19       88.240000       53.956289 
      19       88.290000       53.957687 
      20       88.270000       53.956249 
      20       88.280000       53.957687 
      20       88.250000       53.956249 
      20       88.250000       53.957687 
      20       88.260000       53.956249 
      20       88.230000       53.957687 
      20       88.240000       53.956248 
      21       88.180000       53.957660 
      21       88.270000       53.955375 
      21       88.210000       53.947319 
      21       88.240000       53.912824 
      21       88.200000       53.897126 
      21       88.260000       53.928521 
      21       88.170000       53.950420 
      21       88.230000       53.957231 
      21       88.190000       53.956235 
      22       88.190000       53.957687 
      22       88.260000       53.956249 
      22       88.190000       53.957687 
      22       88.180000       53.956249 
      22       88.150000       53.957687 
      22       88.200000       53.956248 
      23       88.250000       53.957660 
      23       88.210000       53.955375 
      23       88.210000       53.947319 
      23       88.130000       53.912824 
      23       88.240000       53.897126 
      24       88.190000       53.928521 
      24       88.210000       53.950420 
      25       88.200000       53.957231 
      25       88.110000       53.956235 
      25       88.180000       53.957687 
      25       88.160000       53.956249 
      26       88.070000       53.957687 
      26       88.170000       53.956249 
      27       88.120000       53.957687 
      27       88.080000       53.956249 
      27       88.060000       53.957687 
      27       88.070000       53.956249 
      27       88.090000       53.957687 
      27       88.090000       53.956249 
      27       88.120000       53.957687 
      27       88.050000       53.956249 
      28       88.030000       53.957687 
      28       88.100000       53.956249 
      28       88.070000       53.957687 
      29       88.050000       53.956249 
      29       88.050000       53.957687 
      29       88.100000       53.956249 
      29       88.260000       53.957687 
      29       88.650000       53.956249 
      30       88.990000       53.957687 
      30       88.910000       53.956249 
      30       88.990000       53.957687 
      30       88.960000       53.956249 
      31       89.150000       53.957687 
      31       89.190000       53.956249 
      32       89.270000       53.957687 
      32       89.180000       53.956275 
      32       89.330000       53.958573 
      32       89.450000       53.967047 
      33       89.100000       54.006081 
      33       90.160000       54.036037 
      33       90.070000       54.006081 
      33       89.920000       53.967047 
      33       90.000000       53.958573 
      34       90.010000       53.956275 
      34       89.980000       53.957688 
      34       90.080000       53.956275 
      34       90.180000       53.958573 
      34       89.830000       53.967047 
      35       90.220000       54.006081 
      35       90.150000       54.036037 
      36       90.400000       54.006081 
      36       90.360000       53.967047 
      36       90.330000       53.958573 
      36       90.280000       53.956275 
      37       90.300000       53.957687 
      37       90.260000       53.956249 
      37       90.330000       53.957687 
      38       90.260000       53.956249 
      38       90.250000       53.957687 
      38       90.270000       53.956249 
      38       90.250000       53.957687 
      39       90.190000       53.956235 
      39       90.250000       53.957244 
      39       90.260000       53.950850 
      39       90.260000       53.933490 
      39       90.230000       53.916381 
      39       90.160000       53.934350 
      40       90.140000       53.960775 
      40       90.340000       53.995270 
      40       90.270000       53.992599 
      40       90.200000       53.945547 
      40       90.300000       53.940205 
      40       90.300000       53.962104 
      40       90.230000       54.005651 
      41       90.180000       54.036024 
      41       90.240000       54.006081 
      41       90.230000       53.967047 
      41       90.250000       53.958573 
      41       90.180000       53.956275 
      42       90.180000       53.957687 
      42       90.260000       53.956249 
      42       90.240000       53.957701 
      42       90.210000       53.956705 
      42       90.190000       53.963516 
      43       90.190000       53.985415 
      43       90.200000       54.016836 
      43       90.220000       54.001999 
      43       90.210000       53.977442 
      44       90.220000       54.007841 
      44       90.120000       54.046862 
      44       90.190000       54.054476 
      44       90.180000       54.046835 
      44       90.160000       54.006967 
      44       90.140000       53.967074 
      44       90.150000       53.958574 
      45       90.110000       53.956302 
      45       90.170000       53.958573 
      45       90.120000       53.967033 
      45       90.100000       54.005638 
      46       90.180000       54.030638 
      46       90.120000       53.981884 
      46       90.160000       53.927153 
      46       90.110000       53.934376 
      46       90.170000       53.950876 
      46       90.100000       53.957244 
      46       90.120000       53.956235 
      46       90.140000       53.957687 
      46       90.130000       53.956249 
      46       90.090000       53.957687 
      47       90.090000       53.956249 
      47       90.100000       53.957687 
      47       90.110000       53.956249 
      47       90.060000       53.957687 
      48       90.130000       53.956249 
      48       90.140000       53.957701 
      48       90.020000       53.956705 
      48       90.070000       53.963516 
      48       90.120000       53.985415 
      48       90.070000       54.016809 
      49       90.100000       54.001112 
      49       90.000000       53.966617 
      49       90.060000       53.958560 
      49       90.050000       53.956275 
      50       90.040000       53.957687 
      50       90.060000       53.956249 
      50       90.070000       53.957687 
      50       90.070000       53.956275 
      51       90.050000       53.958573 
      52       90.040000       53.967047 
      52       90.070000       54.006081 
      52       90.080000       54.036037 
      52       90.070000       54.006081 
      52       90.000000       53.967047 
      52       90.060000       53.958573 
      52       90.000000       53.956275 
      53       90.060000       53.957687 
      53       90.040000       53.956249 
      54       89.950000       53.957687 
      54       89.990000       53.956249 
      54       90.060000       53.957687 
      54       90.040000       53.956249 
      54       90.040000       53.957687 
      54       89.990000       53.956249 
      54       89.960000       53.957687 
      54       89.960000       53.956249 
      55       89.970000       53.957687 
      55       90.030000       53.956275 
      55       90.010000       53.958573 
      55       90.020000       53.967047 
      56       90.030000       54.006081 
      56       90.050000       54.036037 
      56       90.000000       54.006081 
      56       90.000000       53.967047 
      56       89.990000       53.958574 
      56       89.960000       53.956302 
      57       90.000000       53.958574 
      57       90.050000       53.967047 
      57       89.940000       54.006081 
      58       90.000000       54.036037 
      58       90.000000       54.006081 
      58       89.950000       53.967047 
      58       90.020000       53.958573 
      59       90.000000       53.956262 
      59       90.010000       53.957244 
      59       90.020000       53.950850 
      59       89.970000       53.933490 
      59       89.970000       53.916354 
      60       90.020000       53.933490 
      60       89.960000       53.950850 
