Human trial picking the raspberry twin 

 time    ||     output     ||     loadcell

      0.000000       -798.996774       0.020000 
      0.017401       -798.996774       0.080000 
      0.044730       -798.996774       0.030000 
      0.061172       -798.996774       0.000000 
      0.076661       -798.996774       0.060000 
      0.091074       -798.996774       0.050000 
      0.107222       -798.996774       0.040000 
      0.122465       -798.996774       0.060000 
      0.138934       -798.996774       0.030000 
      0.152921       -798.996769       0.040000 
      0.168484       -798.995581       0.050000 
      0.186343       -798.888651       0.120000 
      0.201258       -795.347604       0.050000 
      0.215800       -752.208822       0.170000 
      0.231792       -558.874213       0.060000 
      0.246913       -240.119331       0.030000 
      0.262401       -46.784722       0.040000 
      0.278566       -3.645940       0.010000 
      0.293575       -0.104893       0.060000 
      0.309503       0.002037       0.070000 
      0.323640       0.003225       0.040000 
      0.339484       0.003230       0.000000 
      0.369101       0.003230       0.040000 
      0.400542       0.003230       0.100000 
      0.432502       0.003230       0.010000 
      0.449193       0.003230       0.020000 
      0.465234       0.003230       0.060000 
      0.494794       0.003230       0.040000 
      0.512018       0.003230       0.010000 
      0.525481       0.003230       0.030000 
      0.541756       0.003230       0.010000 
      0.558134       0.003230       0.050000 
      0.573668       0.003230       0.020000 
      0.603021       0.003230       0.050000 
      0.618844       0.003230       0.000000 
      0.635899       0.003230       0.020000 
      0.651455       0.003230       0.040000 
      0.666656       0.003230       0.010000 
      0.682690       0.003230       0.020000 
      0.698008       0.003230       0.040000 
      0.713350       0.003230       0.020000 
      0.743946       0.003230       0.000000 
      0.761011       0.003230       0.010000 
      0.776424       0.003230       0.040000 
      0.792222       0.003230       0.120000 
      0.806301       0.003230       0.010000 
      0.821774       0.003230       0.040000 
      0.838259       0.003230       0.000000 
      0.853415       0.003230       0.050000 
      0.869673       0.003230       0.010000 
      0.884176       0.003230       0.080000 
      0.899308       0.003230       0.050000 
      0.929289       0.003230       0.020000 
      0.945551       0.003230       0.110000 
      0.960269       0.003230       0.100000 
      0.975507       0.003230       0.060000 
      0.992045       0.003230       0.050000 
      1.007484       0.003230       0.060000 
      1.022349       0.003230       0.070000 
      1.039169       0.003230       0.090000 
      1.054521       0.003230       0.070000 
      1.068348       0.003230       0.050000 
      1.083931       0.003230       0.030000 
      1.100218       0.003230       0.020000 
      1.114229       0.003230       0.040000 
      1.130432       0.003230       0.040000 
      1.146230       0.003230       0.060000 
      1.160498       0.003230       0.030000 
      1.176209       0.003230       0.080000 
      1.191517       0.003230       0.040000 
      1.207747       0.003230       0.050000 
      1.223723       0.003230       0.090000 
      1.238562       0.003230       0.070000 
      1.254724       0.003230       0.010000 
      1.269951       0.003230       0.040000 
      1.284958       0.003230       0.090000 
      1.300922       0.003230       0.010000 
      1.316283       0.003230       0.080000 
      1.331003       0.003230       0.060000 
      1.345628       0.003230       0.050000 
      1.361385       0.003230       0.020000 
      1.377230       0.003230       0.090000 
      1.392220       0.003230       0.060000 
      1.408419       0.003230       0.080000 
      1.423739       0.003230       0.100000 
      1.439433       0.003230       0.010000 
      1.454521       0.003230       0.070000 
      1.470751       0.003230       0.010000 
      1.486205       0.003230       0.020000 
      1.501416       0.003230       0.130000 
      1.517182       0.003230       0.020000 
      1.532678       0.003230       0.120000 
      1.547887       0.003230       0.160000 
      1.563008       0.003230       0.010000 
      1.578136       0.003230       0.070000 
      1.594094       0.003230       0.120000 
      1.607908       0.003230       0.020000 
      1.624179       0.003230       0.000000 
      1.638860       0.003230       0.020000 
      1.655047       0.003230       0.030000 
      1.669791       0.003230       0.070000 
      1.684744       0.003230       0.000000 
      1.701182       0.003230       0.050000 
      1.716996       0.003230       0.100000 
      1.732893       0.003230       0.030000 
      1.747304       0.003230       0.000000 
      1.764021       0.003230       0.000000 
      1.778994       0.003230       0.020000 
      1.793028       0.003230       0.080000 
      1.808404       0.003230       0.010000 
      1.824675       0.003230       0.030000 
      1.839817       0.003230       0.050000 
      1.856797       0.003230       0.040000 
      1.870940       0.003230       0.050000 
      1.886897       0.003230       0.060000 
      1.903423       0.003230       0.100000 
      1.918931       0.003230       0.020000 
      1.934901       0.003230       0.050000 
      1.950630       0.003230       0.030000 
      1.965670       0.003230       0.020000 
      1.982626       0.003230       0.000000 
      1.998492       0.003230       0.010000 
      2.013378       0.003230       0.020000 
      2.029727       0.003230       0.030000 
      2.044687       0.003230       0.010000 
      2.073343       0.003230       0.030000 
      2.090314       0.003230       0.070000 
      2.107172       0.003230       0.120000 
      2.121143       0.003230       0.050000 
      2.136100       0.003230       0.080000 
      2.152048       0.003230       0.020000 
      2.168009       0.003230       0.040000 
      2.183969       0.003230       0.030000 
      2.199927       0.003230       0.090000 
      2.215885       0.003230       0.070000 
      2.231460       0.003230       0.070000 
      2.247584       0.003230       0.110000 
      2.262800       0.003230       0.040000 
      2.278978       0.003230       0.030000 
      2.293889       0.003230       0.120000 
      2.323516       0.003230       0.040000 
      2.340130       0.003230       0.020000 
      2.355674       0.003230       0.000000 
      2.369825       0.003230       0.110000 
      2.385191       0.003230       0.030000 
      2.401879       0.003230       0.030000 
      2.417222       0.003230       0.070000 
      2.431774       0.003230       0.110000 
      2.448172       0.003230       0.050000 
      2.464130       0.003230       0.020000 
      2.479332       0.003230       0.080000 
      2.494622       0.003230       0.030000 
      2.510574       0.003230       0.020000 
      2.526084       0.003230       0.070000 
      2.541585       0.003230       0.050000 
      2.558264       0.003230       0.010000 
      2.572415       0.003230       0.000000 
      2.587617       0.003230       0.150000 
      2.603317       0.003230       0.070000 
      2.618377       0.003230       0.030000 
      2.633975       0.003230       0.050000 
      2.649310       0.003230       0.010000 
      2.663786       0.003230       0.050000 
      2.680181       0.003230       0.060000 
      2.695252       0.003230       0.000000 
      2.710374       0.003230       0.010000 
      2.725740       0.003230       0.030000 
      2.741151       0.003230       0.020000 
      2.755676       0.003230       0.040000 
      2.786473       0.003230       0.080000 
      2.802320       0.003230       0.000000 
      2.818134       0.003230       0.030000 
      2.832405       0.003230       0.010000 
      2.848638       0.003230       0.020000 
      2.864711       0.003230       0.030000 
      2.879769       0.003230       0.070000 
      2.896885       0.003230       0.090000 
      2.912883       0.003230       0.030000 
      2.927943       0.003230       0.150000 
      2.944901       0.003230       0.090000 
      2.960459       0.003230       0.010000 
      3.005912       0.003230       0.020000 
      3.022466       0.003230       0.030000 
      3.036413       0.003230       0.020000 
      3.052489       0.003230       0.010000 
      3.068392       0.003230       0.010000 
      3.083287       0.003230       0.060000 
      3.099303       0.003230       0.010000 
      3.114521       0.003230       0.090000 
      3.130184       0.003230       0.000000 
      3.146188       0.003230       0.060000 
      3.160997       0.003230       0.110000 
      3.175957       0.003230       0.160000 
      3.191690       0.003230       0.030000 
      3.207991       0.003230       0.010000 
      3.224242       0.003230       0.040000 
      3.240500       0.003230       0.140000 
      3.255537       0.003230       0.060000 
      3.270966       0.003230       0.030000 
      3.286886       0.003230       0.050000 
      3.301405       0.003230       0.140000 
      3.318169       0.003230       0.020000 
      3.333531       0.003230       0.020000 
      3.349226       0.003230       0.070000 
      3.364295       0.003230       0.020000 
      3.379077       0.003230       0.040000 
      3.394419       0.003230       0.030000 
      3.409195       0.003230       0.020000 
      3.424494       0.003230       0.000000 
      3.455436       0.003230       0.090000 
      3.472285       0.003230       0.070000 
      3.487140       0.003230       0.030000 
      3.501388       0.003230       0.000000 
      3.517127       0.003230       0.040000 
      3.532886       0.003230       0.120000 
      3.549008       0.003230       0.110000 
      3.564510       0.003230       0.040000 
      3.579278       0.003230       0.020000 
      3.595060       0.003230       0.030000 
      3.611188       0.003230       0.050000 
      3.627152       0.003230       0.020000 
      3.641875       0.003230       0.030000 
      3.656840       0.003230       0.080000 
      3.672629       0.003230       0.070000 
      3.686805       0.003230       0.020000 
      3.702989       0.003230       0.110000 
      3.717976       0.003230       0.020000 
      3.734260       0.003230       0.050000 
      3.748687       0.003230       0.100000 
      3.764714       0.003230       0.070000 
      3.781501       0.003230       0.010000 
      3.796830       0.003230       0.020000 
      3.811485       0.003230       0.080000 
      3.827586       0.003230       0.100000 
      3.844230       0.003230       0.000000 
      3.860286       0.003230       0.080000 
      3.874483       0.003230       0.000000 
      3.891136       0.003230       0.010000 
      3.905721       0.003230       0.030000 
      3.921880       0.003230       0.080000 
      3.937595       0.003230       0.040000 
      3.952177       0.003230       0.010000 
      3.967360       0.003230       0.040000 
      3.983162       0.003230       0.060000 
      3.999860       0.003230       0.010000 
      4.015557       0.003230       0.020000 
      4.031387       0.003230       0.050000 
      4.062484       0.003230       0.070000 
      4.079193       0.003230       0.020000 
      4.096210       0.003230       0.000000 
      4.111242       0.003230       0.030000 
      4.127228       0.003230       0.010000 
      4.141640       0.003230       0.040000 
      4.158128       0.003230       0.030000 
      4.172150       0.003230       0.060000 
      4.188109       0.003230       0.010000 
      4.205067       0.003230       0.030000 
      4.221148       0.003230       0.050000 
      4.236283       0.003230       0.010000 
      4.266838       0.003230       0.020000 
      4.281961       0.003230       0.050000 
      4.298563       0.003230       0.040000 
      4.313055       0.003230       0.010000 
      4.328881       0.003230       0.040000 
      4.345530       0.003230       0.110000 
      4.360368       0.003230       0.050000 
      4.376307       0.003230       0.060000 
      4.391649       0.003230       0.050000 
      4.421486       0.003230       0.060000 
      4.438304       0.003230       0.040000 
      4.453980       0.003230       0.030000 
      4.469778       0.003230       0.030000 
      4.484427       0.003230       0.040000 
      4.501192       0.003230       0.020000 
      4.516183       0.003230       0.000000 
      4.531260       0.003230       0.040000 
      4.546606       0.003230       0.020000 
      4.578805       0.003230       0.090000 
      4.593982       0.003230       0.010000 
      4.610727       0.003230       0.060000 
      4.641135       0.003230       0.090000 
      4.657417       0.003230       0.010000 
      4.672414       0.003230       0.050000 
      4.687334       0.003230       0.040000 
      4.702591       0.003230       0.080000 
      4.717519       0.003230       0.050000 
      4.732576       0.003230       0.080000 
      4.747611       0.003230       0.000000 
      4.763543       0.003230       0.050000 
      4.778992       0.003230       0.010000 
      4.794948       0.003230       0.000000 
      4.809526       0.003230       0.050000 
      4.825944       0.003230       0.050000 
      4.841354       0.003230       0.060000 
      4.857245       0.003230       0.070000 
      4.886543       0.003230       0.110000 
      4.902961       0.003230       0.000000 
      4.918904       0.003230       0.090000 
      4.934739       0.003230       0.060000 
      4.950174       0.003230       0.040000 
      4.965189       0.003230       0.020000 
      4.995404       0.003230       0.010000 
      5.025903       0.003230       0.030000 
      5.042061       0.003230       0.110000 
      5.057427       0.003230       0.060000 
      5.071674       0.003230       0.080000 
      5.087503       0.003230       0.030000 
      5.101836       0.003230       0.070000 
      5.118496       0.003230       0.030000 
      5.133294       0.003230       0.050000 
      5.149579       0.003230       0.030000 
      5.165153       0.003230       0.100000 
      5.179396       0.003230       0.020000 
      5.195717       0.003230       0.060000 
      5.211545       0.003230       0.080000 
      5.226696       0.003230       0.060000 
      5.242678       0.003230       0.040000 
      5.259272       0.003230       0.030000 
      5.273309       0.003230       0.050000 
      5.288962       0.003230       0.010000 
      5.304493       0.003230       0.070000 
      5.318977       0.003230       0.060000 
      5.335086       0.003230       0.090000 
      5.350907       0.003230       0.070000 
      5.367132       0.003230       0.000000 
      5.382122       0.003230       0.010000 
      5.398746       0.003230       0.050000 
      5.412903       0.003230       0.030000 
      5.427691       0.003230       0.060000 
      5.444709       0.003230       0.020000 
      5.460016       0.003230       0.070000 
      5.476043       0.003230       0.060000 
      5.491852       0.003230       0.040000 
      5.522294       0.003230       0.010000 
      5.537409       0.003230       0.050000 
      5.553123       0.003230       0.000000 
      5.569368       0.003230       0.030000 
      5.583393       0.003230       0.070000 
      5.599174       0.003230       0.050000 
      5.615241       0.003230       0.020000 
      5.629551       0.003230       0.060000 
      5.645167       0.003230       0.060000 
      5.661506       0.003230       0.000000 
      5.676298       0.003230       0.030000 
      5.691646       0.003230       0.000000 
      5.723176       0.003230       0.000000 
      5.740920       0.003230       0.030000 
      5.755155       0.003230       0.050000 
      5.769071       0.003230       0.010000 
      5.784460       0.003230       0.010000 
      5.799876       0.003230       0.040000 
      5.816218       0.003230       0.070000 
      5.830742       0.003230       0.030000 
      5.847298       0.003230       0.040000 
      5.862503       0.003230       0.010000 
      5.892779       0.003230       0.030000 
      5.908889       0.003230       0.000000 
      5.924718       0.003230       0.030000 
      5.939905       0.003230       0.050000 
      5.955861       0.003230       0.070000 
      5.971819       0.003230       0.050000 
      5.986779       0.003230       0.140000 
      6.002737       0.003230       0.050000 
      6.017488       0.003230       0.030000 
      6.031496       0.003230       0.040000 
      6.048558       0.003230       0.040000 
      6.063598       0.003230       0.100000 
      6.078320       0.003230       0.050000 
      6.094377       0.003230       0.020000 
      6.124589       0.003230       0.030000 
      6.140843       0.003230       0.050000 
      6.155489       0.003230       0.080000 
      6.170886       0.003230       0.030000 
      6.186879       0.003230       0.010000 
      6.201991       0.003230       0.070000 
      6.218054       0.003230       0.040000 
      6.234180       0.003230       0.040000 
      6.249458       0.003230       0.000000 
      6.265029       0.003230       0.040000 
      6.280282       0.003230       0.030000 
      6.296623       0.003230       0.000000 
      6.311738       0.003230       0.050000 
      6.327566       0.003230       0.030000 
      6.341749       0.003230       0.060000 
      6.357198       0.003230       0.020000 
      6.372273       0.003230       0.030000 
      6.388671       0.003230       0.010000 
      6.404159       0.003230       0.010000 
      6.433831       0.003230       0.070000 
      6.465326       0.003230       0.040000 
      6.480326       0.003230       0.110000 
      6.495214       0.003230       0.080000 
      6.511146       0.003230       0.010000 
      6.526797       0.003230       0.120000 
      6.542134       0.003230       0.090000 
      6.557112       0.003230       0.030000 
      6.573475       0.003230       0.020000 
      6.588856       0.003230       0.050000 
      6.604439       0.003230       0.000000 
      6.620702       0.003230       0.020000 
      6.635763       0.003230       0.010000 
      6.651374       0.003230       0.060000 
      6.668139       0.003230       0.010000 
      6.682316       0.003230       0.100000 
      6.698261       0.003230       0.010000 
      6.714191       0.003230       0.060000 
      6.731201       0.003230       0.040000 
      6.746254       0.003230       0.140000 
      6.761641       0.003230       0.080000 
      6.776568       0.003230       0.090000 
      6.805848       0.003230       0.040000 
      6.821974       0.003230       0.030000 
      6.837244       0.003230       0.050000 
      6.852303       0.003230       0.040000 
      6.868047       0.003230       0.030000 
      6.884171       0.003230       0.010000 
      6.898917       0.003230       0.080000 
      6.914436       0.003230       0.050000 
      6.930794       0.003230       0.010000 
      6.945948       0.003230       0.040000 
      6.975411       0.003230       0.000000 
      7.021623       0.003230       0.000000 
      7.038699       0.003230       0.020000 
      7.054440       0.003230       0.110000 
      7.069496       0.003230       0.150000 
      7.086214       0.003230       0.090000 
      7.102469       0.003230       0.040000 
      7.115640       0.003230       0.030000 
      7.131676       0.003230       0.040000 
      7.147058       0.003230       0.020000 
      7.162944       0.003230       0.090000 
      7.179148       0.003230       0.030000 
      7.194265       0.003230       0.010000 
      7.209820       0.003230       0.080000 
      7.226013       0.003230       0.060000 
      7.240262       0.003230       0.070000 
      7.271139       0.003230       0.010000 
      7.286279       0.003230       0.050000 
      7.302302       0.003230       0.010000 
      7.318913       0.003230       0.000000 
      7.334214       0.003230       0.070000 
      7.349409       0.003230       0.000000 
      7.364803       0.003230       0.160000 
      7.380747       0.003230       0.070000 
      7.396394       0.003230       0.060000 
      7.412150       0.003230       0.010000 
      7.428306       0.003230       0.040000 
      7.444093       0.003230       0.090000 
      7.459210       0.003230       0.080000 
      7.474292       0.003230       0.040000 
      7.489399       0.003230       0.050000 
      7.505150       0.003230       0.040000 
      7.520200       0.003230       0.000000 
      7.534698       0.003230       0.000000 
      7.550865       0.003230       0.070000 
      7.565985       0.003230       0.020000 
      7.580853       0.003230       0.040000 
      7.596802       0.003230       0.010000 
      7.612346       0.003230       0.040000 
      7.628224       0.003230       0.010000 
      7.643789       0.003230       0.040000 
      7.659158       0.003230       0.050000 
      7.675058       0.003230       0.030000 
      7.690789       0.003230       0.100000 
      7.706133       0.003230       0.000000 
      7.721807       0.003230       0.030000 
      7.751699       0.003230       0.000000 
      7.768917       0.003230       0.010000 
      7.783289       0.003230       0.040000 
      7.799160       0.003230       0.050000 
      7.815961       0.003230       0.090000 
      7.831902       0.003230       0.030000 
      7.848202       0.003230       0.050000 
      7.863177       0.003230       0.040000 
      7.878442       0.003230       0.020000 
      7.893664       0.003230       0.010000 
      7.909059       0.003230       0.010000 
      7.924454       0.003230       0.070000 
      7.940372       0.003230       0.080000 
      7.955556       0.003230       0.050000 
      7.971653       0.003230       0.100000 
      7.987202       0.003230       0.070000 
      8.002410       0.003230       0.040000 
      8.018467       0.003230       0.020000 
      8.032775       0.003230       0.050000 
      8.063955       0.003230       0.080000 
      8.079206       0.003230       0.040000 
      8.096102       0.003230       0.000000 
      8.111747       0.003230       0.090000 
      8.125709       0.003230       0.010000 
      8.140668       0.003230       0.050000 
      8.156626       0.003230       0.090000 
      8.173582       0.003230       0.020000 
      8.189546       0.003230       0.020000 
      8.204498       0.003230       0.040000 
      8.218538       0.003230       0.100000 
      8.235415       0.003230       0.100000 
      8.265118       0.003230       0.060000 
      8.282100       0.003230       0.050000 
      8.297310       0.003230       0.010000 
      8.311355       0.003230       0.040000 
      8.327479       0.003217       0.060000 
      8.343574       0.002787       0.010000 
      8.357853       -0.002169       0.060000 
      8.373776       -0.020967       0.000000 
      8.388794       -0.036664       0.020000 
      8.403170       -0.020967       0.020000 
      8.419209       -0.002169       0.070000 
      8.434342       0.002787       0.080000 
      8.450457       0.003217       0.070000 
      8.464689       0.003230       0.010000 
      8.480717       0.003230       0.030000 
      8.495704       0.003230       0.020000 
      8.512732       0.003230       0.050000 
      8.528130       0.003230       0.000000 
      8.544192       0.003230       0.040000 
      8.573726       0.003230       0.060000 
      8.588859       0.003230       0.100000 
      8.604357       0.003230       0.080000 
      8.620012       0.003230       0.040000 
      8.636441       0.003230       0.080000 
      8.651709       0.003230       0.020000 
      8.666485       0.003230       0.000000 
      8.683485       0.003230       0.040000 
      8.699400       0.003230       0.030000 
      8.715295       0.003230       0.010000 
      8.731080       0.003230       0.050000 
      8.746504       0.003230       0.060000 
      8.762051       0.003230       0.080000 
      8.777453       0.003230       0.010000 
      8.793085       0.003230       0.050000 
      8.808857       0.003230       0.010000 
      8.838114       0.003230       0.030000 
      8.855293       0.003217       0.000000 
      8.870359       0.002787       0.100000 
      8.885921       -0.002169       0.150000 
      8.900979       -0.020967       0.050000 
      8.916574       -0.036664       0.050000 
      8.933240       -0.020967       0.060000 
      8.947279       -0.002169       0.040000 
      8.962511       0.002787       0.070000 
      8.979370       0.003217       0.010000 
      8.995500       0.003230       0.080000 
      9.011005       0.003230       0.010000 
      9.025525       0.003230       0.070000 
      9.041560       0.003217       0.030000 
      9.058893       0.002787       0.040000 
      9.074839       -0.002169       0.020000 
      9.090817       -0.020967       0.090000 
      9.106051       -0.036664       0.050000 
      9.120711       -0.020967       0.070000 
      9.135014       -0.002169       0.010000 
      9.150727       0.002787       0.110000 
      9.165764       0.003217       0.000000 
      9.181145       0.003230       0.190000 
      9.196891       0.003230       0.030000 
      9.211843       0.003230       0.040000 
      9.226805       0.003230       0.270000 
      9.243513       0.003230       0.130000 
      9.259372       0.003230       0.210000 
      9.274652       0.003230       0.030000 
      9.289339       0.003230       0.120000 
      9.305809       0.003230       0.100000 
      9.321249       0.003230       0.020000 
      9.335983       0.003230       0.110000 
      9.352550       0.003230       0.030000 
      9.367327       0.003230       0.010000 
      9.382853       0.003230       0.030000 
      9.397670       0.003230       0.080000 
      9.412765       0.003217       0.030000 
      9.428341       0.002787       0.010000 
      9.459077       -0.002169       0.060000 
      9.475885       -0.020980       0.070000 
      9.491104       -0.037107       0.070000 
      9.507197       -0.026366       0.080000 
      9.522162       -0.026366       0.140000 
      9.537291       -0.037107       0.150000 
      9.552141       -0.020980       0.190000 
      9.567192       -0.002169       0.210000 
      9.583545       0.002787       0.200000 
      9.599376       0.003217       0.330000 
      9.613690       0.003230       0.340000 
      9.630278       0.003230       0.720000 
      9.646165       0.003230       0.560000 
      9.661112       0.003230       0.620000 
      9.676326       0.003230       0.590000 
      9.692136       0.003230       0.450000 
      9.707634       0.003230       0.190000 
      9.721925       0.003230       0.480000 
      9.737744       0.003230       0.370000 
      9.753839       0.003230       0.230000 
      9.769229       0.003230       0.290000 
      9.785046       0.003230       0.120000 
      9.800731       0.003230       0.310000 
      9.815933       0.003230       0.220000 
      9.831242       0.003230       0.380000 
      9.847391       0.003230       0.190000 
      9.861904       0.003230       0.390000 
      9.877136       0.003230       0.110000 
      9.892837       0.003230       0.240000 
      9.908693       0.003230       0.110000 
      9.924535       0.003230       0.220000 
      9.940722       0.003230       0.140000 
      9.955975       0.003230       0.040000 
      9.971463       0.003230       0.240000 
      9.987339       0.003230       0.200000 
      10.002254       0.003230       0.030000 
      10.016450       0.003230       0.060000 
      10.031863       0.003230       0.020000 
      10.048498       0.003230       0.070000 
      10.064510       0.003230       0.050000 
      10.080357       0.003230       0.090000 
      10.096681       0.003230       0.040000 
      10.112201       0.003230       0.010000 
      10.126921       0.003230       0.090000 
      10.143339       0.003230       0.170000 
      10.158939       0.003230       0.070000 
      10.175037       0.003230       0.010000 
      10.189837       0.003230       0.030000 
      10.204726       0.003230       0.090000 
      10.220236       0.003230       0.040000 
      10.237287       0.003230       0.300000 
      10.251523       0.003230       0.150000 
      10.267277       0.003230       0.190000 
      10.283542       0.003230       0.040000 
      10.299138       0.003230       0.220000 
      10.314294       0.003230       0.110000 
      10.329289       0.003230       0.050000 
      10.344664       0.003230       0.220000 
      10.360418       0.003230       0.110000 
      10.375614       0.003230       0.150000 
      10.390153       0.003217       0.050000 
      10.407130       0.002787       0.040000 
      10.421576       -0.002169       0.000000 
      10.437904       -0.020967       0.090000 
      10.453537       -0.036691       0.010000 
      10.469047       -0.021853       0.020000 
      10.485105       -0.012967       0.080000 
      10.500944       -0.045607       0.190000 
      10.516136       -0.076572       0.060000 
      10.531167       -0.045164       0.080000 
      10.546352       -0.007568       0.060000 
      10.561867       0.002344       0.080000 
      10.578707       0.003203       0.060000 
      10.592832       0.003230       0.130000 
      10.608568       0.003230       0.110000 
      10.624134       0.003230       0.020000 
      10.640366       0.003230       0.170000 
      10.654800       0.003230       0.090000 
      10.669948       0.003230       0.170000 
      10.686269       0.003230       0.040000 
      10.700941       0.003230       0.120000 
      10.717131       0.003230       0.040000 
      10.732122       0.003230       0.170000 
      10.748627       0.003230       0.040000 
      10.763999       0.003230       0.010000 
      10.793749       0.003230       0.060000 
      10.810497       0.003230       0.010000 
      10.826454       0.003230       0.140000 
      10.841079       0.003230       0.030000 
      10.856389       0.003230       0.100000 
      10.871625       0.003230       0.020000 
      10.887569       0.003230       0.120000 
      10.904419       0.003230       0.190000 
      10.918758       0.003230       1.250000 
      10.935296       0.003230       2.280000 
      10.949359       0.003230       8.130000 
      10.965225       0.003230       10.010000 
      10.981110       0.003230       10.590000 
      10.996464       0.003230       9.120000 
      11.011753       0.003230       9.050000 
      11.027241       0.003230       9.590000 
      11.043001       0.003217       10.410000 
      11.059862       0.002787       9.440000 
      11.075718       -0.002169       5.560000 
      11.091387       -0.020967       4.190000 
      11.106217       -0.036664       1.080000 
      11.121114       -0.020967       2.200000 
      11.136075       -0.002182       7.520000 
      11.152141       0.002344       21.350000 
      11.167212       -0.002182       27.880000 
      11.183875       -0.020967       39.670000 
      11.198223       -0.036664       46.230000 
      11.214620       -0.020967       54.090000 
      11.230370       -0.002169       75.690000 
      11.245327       0.002787       89.870000 
      11.261285       0.003217       121.920000 
      11.278517       0.003244       137.520000 
      11.294494       0.003714       162.740000 
      11.309652       0.010041       173.020000 
      11.325223       0.046419       182.890000 
      11.341401       0.152678       203.410000 
      11.355815       0.350878       214.380000 
      11.371248       0.622110       235.530000 
      11.387064       0.879003       245.930000 
      11.402781       1.074578       270.680000 
      11.418674       1.333824       284.510000 
      11.434952       1.679889       298.180000 
      11.450907       1.973634       322.160000 
      11.466114       2.256611       332.350000 
      11.481637       2.607216       350.680000 
      11.498220       2.891931       358.290000 
      11.512805       3.079063       370.840000 
      11.528218       3.333703       375.230000 
      11.544366       3.671374       384.260000 
      11.559509       3.910756       389.280000 
      11.575119       4.036511       394.970000 
      11.590629       4.254384       405.140000 
      11.606791       4.623396       409.120000 
      11.621531       4.904028       414.410000 
      11.637429       5.043624       415.820000 
      11.652670       5.221647       417.590000 
      11.666920       5.527441       420.610000 
      11.682560       5.830550       420.720000 
      11.698243       5.992875       415.160000 
      11.714396       6.132055       411.640000 
      11.730299       6.423830       409.200000 
      11.744659       6.781175       406.760000 
      11.760186       6.991876       405.100000 
      11.776731       7.083022       401.780000 
      11.792221       7.175006       391.190000 
      11.806444       7.334639       385.710000 
      11.821219       7.524313       381.740000 
      11.837053       7.699091       380.050000 
      11.852629       7.851071       380.800000 
      11.868903       7.902552       382.990000 
      11.884313       7.858241       383.790000 
      11.899249       7.725046       385.900000 
      11.914409       7.497387       388.280000 
      11.930119       7.251307       394.500000 
      11.945753       7.082287       395.940000 
      11.960019       7.016353       376.490000 
      11.975439       7.004185       249.030000 
      11.991881       7.003258       159.440000 
      12.007839       7.003230       9.450000 
      12.022380       7.003230       12.000000 
      12.039244       7.003230       7.870000 
      12.053451       7.003230       2.470000 
      12.068642       7.003230       5.320000 
      12.084863       7.003244       8.750000 
      12.100459       7.003674       4.910000 
      12.114713       7.008732       2.500000 
      12.131819       7.030559       6.260000 
      12.146455       7.071942       9.230000 
      12.162010       7.022766       5.070000 
      12.178466       6.142675       2.910000 
      12.193535       3.717876       4.060000 
      12.208471       1.384371       9.130000 
      12.223363       1.012739       8.260000 
      12.239247       1.608933       5.810000 
      12.255202       1.936098       5.760000 
      12.269381       1.994276       8.370000 
      12.285904       1.949931       8.630000 
      12.301116       1.726761       6.750000 
      12.316354       1.339071       7.610000 
      12.331674       1.026848       9.930000 
      12.346817       0.702673       10.280000 
      12.362318       0.220601       6.680000 
      12.376439       -0.292656       6.410000 
      12.393237       -0.806626       8.930000 
      12.407291       -1.251202       8.840000 
      12.423213       -1.620827       6.750000 
      12.437784       -1.876297       5.060000 
      12.454601       -1.976890       6.570000 
      12.470570       -1.995332       7.790000 
      12.485859       -1.996715       6.040000 
      12.500821       -1.996326       4.700000 
      12.515562       -1.991371       6.700000 
      12.532273       -1.972559       7.940000 
      12.548518       -1.956432       5.890000 
      12.564692       -1.967160       4.940000 
      12.579564       -1.966730       7.410000 
      12.596086       -1.951007       8.350000 
      12.611217       -1.947462       7.530000 
      12.625951       -1.940194       5.740000 
      12.641214       -1.916966       6.770000 
      12.656293       -1.869804       8.430000 
      12.671689       -1.817866       8.250000 
      12.687159       -1.751477       6.820000 
      12.703490       -1.702666       7.490000 
      12.719422       -1.673930       8.740000 
      12.734503       -1.662745       9.090000 
      12.748532       -1.702183       6.510000 
      12.763877       -1.755932       6.200000 
      12.779356       -1.766730       7.910000 
      12.796090       -1.762208       7.870000 
      12.810852       -1.800812       5.680000 
      12.827152       -1.838795       5.630000 
      12.842758       -1.781541       6.530000 
      12.858227       -1.671648       7.320000 
      12.873708       -1.640859       6.310000 
      12.888737       -1.666675       5.810000 
      12.903835       -1.698196       6.730000 
      12.920040       -1.723625       7.570000 
      12.935413       -1.752831       6.510000 
      12.951022       -1.727723       6.060000 
      12.965413       -1.727792       7.550000 
      12.981542       -1.818685       8.120000 
      12.997158       -1.902016       7.770000 
      13.011175       -1.910555       6.640000 
      13.027710       -1.784504       7.100000 
      13.043017       -1.549332       8.390000 
      13.058600       -1.395098       7.810000 
      13.074031       -1.395980       6.860000 
      13.089485       -1.411137       7.150000 
      13.105698       -1.407166       7.850000 
      13.120645       -1.427669       7.960000 
      13.136286       -1.471699       6.420000 
      13.151583       -1.510142       6.240000 
      13.166526       -1.516980       7.410000 
      13.182101       -1.500300       7.530000 
      13.197514       -1.499068       6.170000 
      13.213074       -1.500327       6.150000 
      13.229138       -1.517880       6.750000 
      13.243967       -1.521397       7.280000 
      13.258879       -1.525922       6.640000 
      13.273838       -1.536624       6.340000 
      13.289590       -1.514641       7.000000 
      13.305048       -1.465388       7.630000 
      13.320258       -1.386885       6.840000 
      13.334949       -1.290637       6.530000 
      13.350662       -1.260090       7.540000 
      13.366726       -1.359671       8.150000 
      13.381145       -1.499384       7.820000 
      13.396054       -1.581071       6.700000 
      13.410994       -1.604706       7.040000 
      13.426287       -1.645218       7.630000 
      13.442729       -1.658452       7.510000 
      13.457994       -1.567726       6.950000 
      13.473260       -1.451451       6.890000 
      13.488804       -1.438188       7.340000 
      13.503794       -1.474302       7.450000 
      13.518259       -1.532717       6.490000 
      13.534505       -1.540611       6.370000 
      13.549513       -1.536291       7.340000 
      13.564903       -1.561721       7.300000 
      13.580975       -1.560874       6.860000 
      13.596930       -1.525937       6.470000 
      13.612138       -1.497656       6.930000 
      13.626444       -1.478415       7.380000 
      13.642350       -1.480643       6.950000 
      13.658240       -1.507095       6.660000 
      13.672410       -1.492244       7.170000 
      13.689232       -1.472200       7.590000 
      13.704700       -1.516468       7.070000 
      13.720285       -1.553302       6.740000 
      13.735947       -1.541192       7.240000 
      13.751147       -1.589160       7.570000 
      13.766309       -1.684615       7.360000 
      13.781975       -1.737895       6.720000 
      13.797629       -1.686444       6.870000 
      13.813236       -1.590029       7.450000 
      13.828567       -1.552017       7.180000 
      13.843975       -1.536733       6.800000 
      13.859283       -1.578442       6.840000 
      13.874667       -1.642454       7.150000 
      13.889903       -1.691839       7.290000 
      13.905753       -1.712357       6.650000 
      13.920898       -1.637621       6.590000 
      13.937459       -1.606240       7.310000 
      13.953344       -1.675231       7.380000 
      13.968096       -1.688226       6.720000 
      13.983284       -1.677059       6.810000 
      13.999360       -1.672976       7.050000 
      14.014295       -1.675270       7.340000 
      14.030422       -1.688727       7.080000 
      14.045704       -1.681986       6.890000 
      14.060949       -1.713410       7.180000 
      14.076204       -1.790887       7.360000 
      14.092095       -1.848746       7.140000 
      14.107138       -1.831198       6.820000 
      14.121524       -1.766317       7.210000 
      14.137271       -1.746050       7.370000 
      14.154124       -1.728621       6.900000 
      14.170236       -1.659601       6.670000 
      14.186315       -1.630921       7.170000 
      14.201713       -1.639407       7.270000 
      14.217432       -1.709809       7.070000 
      14.231996       -1.811014       6.670000 
      14.247199       -1.802983       6.850000 
      14.262425       -1.731752       7.240000 
      14.279489       -1.684660       7.110000 
      14.293841       -1.680683       6.990000 
      14.310012       -1.702113       6.950000 
      14.324462       -1.672130       7.250000 
      14.340458       -1.640749       7.160000 
      14.355910       -1.664987       6.920000 
      14.371104       -1.677057       6.800000 
      14.386423       -1.718837       7.370000 
      14.402831       -1.821370       7.350000 
      14.418547       -1.924066       7.010000 
      14.433524       -1.948680       6.880000 
      14.449375       -1.895856       7.110000 
      14.466240       -1.833095       7.110000 
      14.481354       -1.808481       7.000000 
      14.495345       -1.821424       6.860000 
      14.512071       -1.836262       7.110000 
      14.527129       -1.816468       7.260000 
      14.541892       -1.789213       6.970000 
      14.557090       -1.811112       6.940000 
      14.573839       -1.876585       7.060000 
      14.590425       -1.880103       7.120000 
      14.604671       -1.836735       7.110000 
      14.620279       -1.827696       6.980000 
      14.635796       -1.842963       6.960000 
      14.650329       -1.850134       7.160000 
      14.665844       -1.860875       7.150000 
      14.681686       -1.837564       6.920000 
      14.698077       -1.792314       6.940000 
      14.712100       -1.807568       7.120000 
      14.728129       -1.850520       7.220000 
      14.743100       -1.836248       7.100000 
      14.759127       -1.786915       6.960000 
      14.774412       -1.784244       7.120000 
      14.789478       -1.820981       7.120000 
      14.805470       -1.855046       7.070000 
      14.820851       -1.837107       6.930000 
      14.835454       -1.792314       6.980000 
      14.851402       -1.807998       7.200000 
      14.866945       -1.855489       7.240000 
      14.882908       -1.855449       6.940000 
      14.897921       -1.806696       6.910000 
      14.913410       -1.777030       7.170000 
      14.930331       -1.776228       7.100000 
      14.944909       -1.795442       7.000000 
      14.961387       -1.887343       7.050000 
      14.975682       -1.943737       7.160000 
      14.992189       -1.913795       7.080000 
      15.007474       -1.848792       6.910000 
      15.023227       -1.793697       6.970000 
      15.038782       -1.814350       7.300000 
      15.053907       -1.891774       7.260000 
      15.069460       -1.958618       6.960000 
      15.085544       -1.967478       6.920000 
      15.101233       -1.881944       7.360000 
      15.117287       -1.747021       7.260000 
      15.133243       -1.690167       6.980000 
      15.148851       -1.693641       7.030000 
      15.165642       -1.707622       7.140000 
      15.178860       -1.751007       7.040000 
      15.194767       -1.806611       6.900000 
      15.209775       -1.815111       7.140000 
      15.225666       -1.801726       7.250000 
      15.241457       -1.797643       7.040000 
      15.258525       -1.802195       6.960000 
      15.274317       -1.821397       7.020000 
      15.288608       -1.841620       7.070000 
      15.304970       -1.839792       6.990000 
      15.319396       -1.818753       7.060000 
      15.336138       -1.792328       7.130000 
      15.350875       -1.826823       7.100000 
      15.366395       -1.877002       7.030000 
      15.380825       -1.868918       7.090000 
      15.397357       -1.847006       7.090000 
      15.412817       -1.816441       7.040000 
      15.428057       -1.777542       7.050000 
      15.443309       -1.751477       7.160000 
      15.458660       -1.742990       7.110000 
      15.474211       -1.727293       7.030000 
      15.489498       -1.732679       7.090000 
      15.504847       -1.772559       7.130000 
      15.520652       -1.815098       7.050000 
      15.536598       -1.835308       6.990000 
      15.566956       -1.809699       7.230000 
      15.583555       -1.747946       7.140000 
      15.599222       -1.688285       7.080000 
      15.614915       -1.690140       7.160000 
      15.629943       -1.751490       7.180000 
      15.644900       -1.830822       7.150000 
      15.661621       -1.860378       7.130000 
      15.676264       -1.849650       7.220000 
      15.692401       -1.836664       7.160000 
      15.707029       -1.792257       7.070000 
      15.721959       -1.743020       7.040000 
      15.738936       -1.751020       7.110000 
      15.754169       -1.771643       7.170000 
      15.770460       -1.721424       7.150000 
      15.785063       -1.673086       7.070000 
      15.801550       -1.698086       7.160000 
      15.817582       -1.736234       7.110000 
      15.848097       -1.738879       6.980000 
      15.864301       -1.712467       6.980000 
      15.879680       -1.657749       7.010000 
      15.895104       -1.643060       7.110000 
      15.910179       -1.686845       7.170000 
      15.925920       -1.711580       7.160000 
      15.941584       -1.698918       7.140000 
      15.956408       -1.686497       7.110000 
      15.971497       -1.630793       7.060000 
      15.986287       -1.547158       7.030000 
      16.001672       -1.543465       7.120000 
      16.018724       -1.687853       7.160000 
      16.035078       -1.803303       7.120000 
      16.050466       -1.792727       6.990000 
      16.065396       -1.739671       7.100000 
      16.080659       -1.663655       7.090000 
      16.096068       -1.561763       7.060000 
      16.112030       -1.521175       7.040000 
      16.126477       -1.545096       7.140000 
      16.142137       -1.583410       7.120000 
      16.158740       -1.567507       7.140000 
      16.173563       -1.544429       7.200000 
      16.188665       -1.508386       7.220000 
      16.204259       -1.529648       7.120000 
      16.219538       -1.639752       7.120000 
      16.234998       -1.729462       6.940000 
      16.250806       -1.691331       7.040000 
      16.266591       -1.638094       7.060000 
      16.282557       -1.697186       7.190000 
      16.298310       -1.759958       7.150000 
      16.312470       -1.715125       7.060000 
      16.329098       -1.648862       7.110000 
      16.344415       -1.658192       7.180000 
      16.359159       -1.712064       7.110000 
      16.374558       -1.734380       7.050000 
      16.390753       -1.723279       7.160000 
      16.407052       -1.711972       7.100000 
      16.421818       -1.752445       7.100000 
      16.437135       -1.799357       7.050000 
      16.453216       -1.787383       7.020000 
      16.469105       -1.741138       7.130000 
      16.484288       -1.753292       7.040000 
      16.500517       -1.779713       7.080000 
      16.516020       -1.756349       7.020000 
      16.531624       -1.693713       7.050000 
      16.546884       -1.684617       7.080000 
      16.561644       -1.719691       7.060000 
      16.578334       -1.673832       7.090000 
      16.593149       -1.644862       7.080000 
      16.609339       -1.670704       7.050000 
      16.624535       -1.701266       7.110000 
      16.639077       -1.672547       7.090000 
      16.655110       -1.646161       7.100000 
      16.670383       -1.689586       7.180000 
      16.686709       -1.720993       7.060000 
      16.701152       -1.750106       7.060000 
      16.718274       -1.781904       7.180000 
      16.733518       -1.763089       7.180000 
      16.748363       -1.712481       7.100000 
      16.763627       -1.634022       7.090000 
      16.779031       -1.604079       7.040000 
      16.795897       -1.673862       7.120000 
      16.811208       -1.759075       7.040000 
      16.826775       -1.791285       7.020000 
      16.842490       -1.723181       7.110000 
      16.859634       -1.588328       7.060000 
      16.875065       -1.579829       7.060000 
      16.889497       -1.672530       7.100000 
      16.905405       -1.703480       7.070000 
      16.920722       -1.677462       7.100000 
      16.936179       -1.661804       7.120000 
      16.951657       -1.685985       7.100000 
      16.966786       -1.682871       7.050000 
      16.982695       -1.640722       7.050000 
      16.998403       -1.653292       7.080000 
      17.015100       -1.680129       7.080000 
      17.030127       -1.660902       7.100000 
      17.045892       -1.608441       7.170000 
      17.061119       -1.592328       7.120000 
      17.076591       -1.637134       7.040000 
      17.092541       -1.655892       7.130000 
      17.107502       -1.630395       7.090000 
      17.121492       -1.614628       7.140000 
      17.138173       -1.571226       7.120000 
      17.154129       -1.453290       7.130000 
      17.169567       -1.372313       7.060000 
      17.183829       -1.442978       7.170000 
      17.200064       -1.592282       7.130000 
      17.215616       -1.651351       7.090000 
      17.230953       -1.640277       7.080000 
      17.246668       -1.593117       7.010000 
      17.261341       -1.549359       7.000000 
      17.277991       -1.587345       7.050000 
      17.292289       -1.676115       7.020000 
      17.307508       -1.697571       7.040000 
      17.322649       -1.641607       7.080000 
      17.338976       -1.563188       7.110000 
      17.354139       -1.539877       7.190000 
      17.369130       -1.583815       6.980000 
      17.385662       -1.663089       7.040000 
      17.401149       -1.710584       7.110000 
      17.416453       -1.644721       7.040000 
      17.431865       -1.568104       7.090000 
      17.447474       -1.554675       7.050000 
      17.462366       -1.570771       7.050000 
      17.477210       -1.593670       7.000000 
      17.493161       -1.605270       7.140000 
      17.509136       -1.642050       7.080000 
      17.524077       -1.660834       7.060000 
      17.539037       -1.644277       7.000000 
      17.554994       -1.612427       7.060000 
      17.569954       -1.551060       7.090000 
      17.585911       -1.503526       7.000000 
      17.601869       -1.484285       7.020000 
      17.618834       -1.505780       7.030000 
      17.634782       -1.559103       7.080000 
      17.649741       -1.580589       7.030000 
      17.665698       -1.624580       7.100000 
      17.682654       -1.660777       7.170000 
      17.697613       -1.596340       7.150000 
      17.713570       -1.527780       7.080000 
      17.730525       -1.549678       7.030000 
      17.746483       -1.590511       7.050000 
      17.762443       -1.609270       7.060000 
      17.777399       -1.587827       7.050000 
      17.793357       -1.536639       6.960000 
      17.808793       -1.539503       7.060000 
      17.824516       -1.584587       7.090000 
      17.840834       -1.609379       7.080000 
      17.854796       -1.594918       7.040000 
      17.870754       -1.646105       7.070000 
      17.885713       -1.679119       7.010000 
      17.901411       -1.589638       7.060000 
      17.917368       -1.469434       7.080000 
      17.933325       -1.426075       7.070000 
      17.949449       -1.477474       7.050000 
      17.965486       -1.562314       7.140000 
      17.980544       -1.607401       7.050000 
      17.995733       -1.613852       7.070000 
      18.009933       -1.584590       7.080000 
      18.026876       -1.598638       7.090000 
      18.042832       -1.611055       7.140000 
      18.058791       -1.601725       7.130000 
      18.074787       -1.601673       7.100000 
      18.090099       -1.609296       7.080000 
      18.105059       -1.577485       7.020000 
      18.119114       -1.493227       7.200000 
      18.135070       -1.479345       7.230000 
      18.151332       -1.560861       7.090000 
      18.166286       -1.607882       7.060000 
      18.181247       -1.535751       7.090000 
      18.197209       -1.422367       7.030000 
      18.212164       -1.385184       6.990000 
      18.229233       -1.398140       7.110000 
      18.244078       -1.425991       7.160000 
      18.260036       -1.462204       7.180000 
      18.273000       -1.477945       7.070000 
      18.290051       -1.509796       7.110000 
      18.306008       -1.572032       7.020000 
      18.319970       -1.566246       6.990000 
      18.333932       -1.539352       7.090000 
      18.349891       -1.552361       7.150000 
      18.363854       -1.505696       7.150000 
      18.379810       -1.424679       7.090000 
      18.395767       -1.422811       7.060000 
      18.411726       -1.501736       7.070000 
      18.427681       -1.526766       7.070000 
      18.444629       -1.502226       7.100000 
      18.459504       -1.556835       7.080000 
      18.474640       -1.641536       7.080000 
      18.491317       -1.637992       7.010000 
      18.506299       -1.596313       7.040000 
      18.523384       -1.549692       6.980000 
      18.538500       -1.522421       6.940000 
      18.555523       -1.573043       7.100000 
      18.571108       -1.632111       7.040000 
      18.586874       -1.653746       7.070000 
      18.602376       -1.674247       6.990000 
      18.617501       -1.629063       7.010000 
      18.632460       -1.536709       7.120000 
      18.648014       -1.564077       7.070000 
      18.663484       -1.633006       7.060000 
      18.677538       -1.590011       7.130000 
      18.694062       -1.455162       7.130000 
      18.709120       -1.419267       7.190000 
      18.724559       -1.534436       7.000000 
      18.740524       -1.615510       7.080000 
      18.755319       -1.594027       7.100000 
      18.770531       -1.479235       7.140000 
      18.786686       -1.392881       7.160000 
      18.801306       -1.438908       7.180000 
      18.817420       -1.477069       7.110000 
      18.832831       -1.459090       7.070000 
      18.848673       -1.474831       7.020000 
      18.863542       -1.494888       6.960000 
      18.878127       -1.516107       7.080000 
      18.894074       -1.505173       7.080000 
      18.910361       -1.452875       7.050000 
      18.925577       -1.411113       7.020000 
      18.942209       -1.412977       6.970000 
      18.957581       -1.393144       7.060000 
      18.973326       -1.377599       7.110000 
      18.988322       -1.440195       7.010000 
      19.002483       -1.486897       7.090000 
      19.019149       -1.429937       7.060000 
      19.033178       -1.400469       7.140000 
      19.048816       -1.452819       7.100000 
      19.064195       -1.536691       7.130000 
      19.079427       -1.590001       7.200000 
      19.096332       -1.614641       7.100000 
      19.112032       -1.611984       7.080000 
      19.126451       -1.575257       7.140000 
      19.142947       -1.549289       7.040000 
      19.159333       -1.539407       7.060000 
      19.173198       -1.591414       7.100000 
      19.189390       -1.694457       7.030000 
      19.205473       -1.708325       6.970000 
      19.220676       -1.607555       7.250000 
      19.235093       -1.534038       7.230000 
      19.250791       -1.573056       7.140000 
      19.267515       -1.620923       7.070000 
      19.284300       -1.600800       7.090000 
      19.298711       -1.579730       7.030000 
      19.314251       -1.572932       7.040000 
      19.329805       -1.507582       7.120000 
      19.344354       -1.470332       7.170000 
      19.360732       -1.499011       7.090000 
      19.376666       -1.464902       7.040000 
      19.390587       -1.418407       7.090000 
      19.405873       -1.428569       7.050000 
      19.422937       -1.471740       7.060000 
      19.437903       -1.510612       6.980000 
      19.453852       -1.523238       7.080000 
      19.470210       -1.534396       7.110000 
      19.485298       -1.576088       7.010000 
      19.500894       -1.549620       7.020000 
      19.516495       -1.456459       7.120000 
      19.532095       -1.391013       7.180000 
      19.547744       -1.393698       7.070000 
      19.562029       -1.472157       7.090000 
      19.578944       -1.550050       7.110000 
      19.594296       -1.565387       7.100000 
      19.609139       -1.551396       7.060000 
      19.626076       -1.552405       7.100000 
      19.641420       -1.558576       7.040000 
      19.656871       -1.528164       7.000000 
      19.672238       -1.441179       7.050000 
      19.687663       -1.413895       7.180000 
      19.703864       -1.438518       7.030000 
      19.719486       -1.452416       7.070000 
      19.734485       -1.494559       7.120000 
      19.751222       -1.598044       7.060000 
      19.764377       -1.693056       7.100000 
      19.780497       -1.619553       7.170000 
      19.795527       -1.463205       7.130000 
      19.811483       -1.426009       7.060000 
      19.825860       -1.481526       6.990000 
      19.841129       -1.506679       6.980000 
      19.857155       -1.486876       7.090000 
      19.872838       -1.512537       7.050000 
      19.888545       -1.575589       7.130000 
      19.903706       -1.586913       7.040000 
      19.919095       -1.558607       7.000000 
      19.934371       -1.558230       7.210000 
      19.949193       -1.517368       7.060000 
      19.965300       -1.478512       7.060000 
      19.980075       -1.527670       7.110000 
      19.994758       -1.600379       7.130000 
      20.009993       -1.604703       7.080000 
      20.025460       -1.562317       7.040000 
      20.041148       -1.543779       7.020000 
      20.057205       -1.526406       7.110000 
      20.071799       -1.455078       7.190000 
      20.088283       -1.482538       7.070000 
      20.104028       -1.533397       7.120000 
      20.119373       -1.495524       7.070000 
      20.135431       -1.510186       7.060000 
      20.150548       -1.558146       7.090000 
      20.166692       -1.499454       7.090000 
      20.180930       -1.448406       7.050000 
      20.196211       -1.468046       7.020000 
      20.211717       -1.485555       7.110000 
      20.228460       -1.471673       7.080000 
      20.244476       -1.451436       7.100000 
      20.260547       -1.447502       7.090000 
      20.275939       -1.441082       7.110000 
      20.290596       -1.427818       7.070000 
      20.307201       -1.419998       7.130000 
      20.321300       -1.420151       7.090000 
      20.337459       -1.407941       7.000000 
      20.351725       -1.428177       7.060000 
      20.367189       -1.392231       7.130000 
      20.383733       -1.350674       7.040000 
      20.398338       -1.383744       7.010000 
      20.414373       -1.386468       7.020000 
      20.430385       -1.367687       7.110000 
      20.444379       -1.408414       7.120000 
      20.460618       -1.484642       7.080000 
      20.475204       -1.519567       7.130000 
      20.490313       -1.472103       7.160000 
      20.506848       -1.422367       7.040000 
      20.521856       -1.448805       7.080000 
      20.537079       -1.485529       7.210000 
      20.552927       -1.490041       7.170000 
      20.568098       -1.467147       7.060000 
      20.582869       -1.432678       7.250000 
      20.598162       -1.432678       7.190000 
      20.613331       -1.467160       7.100000 
      20.629420       -1.490458       7.080000 
      20.659622       -1.490014       7.050000 
      20.676044       -1.461291       7.120000 
      20.691249       -1.402182       7.070000 
      20.706551       -1.357333       7.040000 
      20.721756       -1.348859       7.060000 
      20.738235       -1.352363       7.030000 
      20.752642       -1.382458       7.050000 
      20.767503       -1.433453       7.120000 
      20.784067       -1.440677       7.120000 
      20.799000       -1.351464       7.060000 
      20.814638       -1.279412       7.110000 
      20.829641       -1.304842       7.080000 
      20.845741       -1.371713       7.150000 
      20.860564       -1.433453       7.020000 
      20.877008       -1.451448       7.010000 
      20.892459       -1.399830       7.100000 
      20.908079       -1.358301       7.080000 
      20.922554       -1.342021       7.030000 
      20.938157       -1.329604       7.130000 
      20.954467       -1.341152       7.150000 
      20.969202       -1.411567       6.970000 
      20.984887       -1.444207       6.980000 
      21.000249       -1.395857       7.060000 
