Human trial picking the raspberry twin 

 time    ||     output compensated 

      0       -800.950000 
      0       -800.950000 
      0       -800.950000 
      0       -800.950000 
      0       -800.950000 
      0       -800.950000 
      0       -800.950000 
      0       -800.950000 
      0       -800.950000 
      0       -800.949995 
      0       -800.948804 
      0       -800.841620 
      0       -797.292139 
      0       -754.050344 
      0       -560.251022 
      0       -240.718921 
      0       -46.903902 
      0       -3.659006 
      0       -0.107670 
      0       -0.001911 
      1       0.000719 
      1       -0.000715 
      1       0.000723 
      1       -0.000715 
      1       0.000723 
      1       -0.000715 
      1       0.000723 
      1       -0.000715 
      1       0.000723 
      1       -0.000715 
      1       0.000724 
      1       -0.000688 
      1       0.001610 
      1       0.010083 
      1       0.049118 
      1       0.079074 
      1       0.049118 
      1       0.010083 
      1       0.001610 
      1       -0.000688 
      2       0.000724 
      2       -0.000715 
      2       0.000723 
      2       -0.000715 
      2       0.000723 
      2       -0.000715 
      2       0.000723 
      2       -0.000715 
      2       0.000723 
      2       -0.000715 
      2       0.000723 
      2       -0.000715 
      2       0.000724 
      2       -0.000688 
      3       0.001610 
      3       0.010083 
      3       0.049118 
      3       0.079074 
      3       0.049118 
      3       0.010083 
      3       0.001610 
      3       -0.000688 
      3       0.000724 
      3       -0.000715 
      3       0.000723 
      3       -0.000715 
      3       0.000723 
      3       -0.000715 
      3       0.000723 
      3       -0.000715 
      3       0.000723 
      3       -0.000715 
      3       0.000723 
      3       -0.000715 
      3       0.000724 
      3       -0.000688 
      4       0.001610 
      4       0.010083 
      4       0.049118 
      4       0.079074 
      4       0.049118 
      4       0.010083 
      4       0.001610 
      4       -0.000688 
      4       0.000724 
      4       -0.000715 
      4       0.000723 
      4       -0.000715 
      4       0.000723 
      4       -0.000715 
      4       0.000723 
      4       -0.000715 
      4       0.000723 
      4       -0.000715 
      4       0.000723 
      4       -0.000715 
      4       0.000723 
      4       -0.000728 
      4       0.000281 
      4       -0.006087 
      4       -0.022587 
      4       -0.029811 
      4       0.024921 
      4       0.073674 
      4       0.048674 
      4       0.010070 
      5       0.001610 
      5       -0.000688 
      5       0.000724 
      5       -0.000715 
      5       0.000723 
      5       -0.000715 
      5       0.000723 
      5       -0.000715 
      5       0.000723 
      5       -0.000715 
      5       0.000723 
      5       -0.000715 
      5       0.000717 
      5       -0.000688 
      5       0.001594 
      5       0.010046 
      5       0.051170 
      5       0.110710 
      5       0.204956 
      5       0.338362 
      5       0.466760 
      5       0.680976 
      5       0.880389 
      5       0.958345 
      5       1.013014 
      5       1.071442 
      5       1.170181 
      5       1.384014 
      5       1.683998 
      5       2.049320 
      5       2.372106 
      5       2.567194 
      6       2.756036 
      6       2.906657 
      6       2.972313 
      6       3.066490 
      6       3.255260 
      6       3.506714 
      6       3.738523 
      6       3.877393 
      6       3.901248 
      6       3.866668 
      6       3.818604 
      6       3.614464 
      6       3.231384 
      6       2.694487 
      6       1.871204 
      6       0.638933 
      6       -0.787086 
      6       -1.407047 
      6       -0.933034 
      6       -0.506546 
      6       -0.340863 
      6       -0.374217 
      6       -0.688047 
      6       -1.117132 
      6       -1.583874 
      6       -2.035260 
      6       -2.472937 
      6       -2.842814 
      6       -3.063522 
      6       -3.203949 
      6       -3.387392 
      6       -3.633939 
      6       -3.789894 
      6       -3.797622 
      6       -3.803930 
      6       -3.768825 
      6       -3.621099 
      6       -3.513362 
      6       -3.431495 
      6       -3.199469 
      6       -3.081745 
      6       -3.129888 
      6       -3.150936 
      6       -3.210443 
      6       -3.262522 
      6       -3.278792 
      6       -3.243321 
      6       -3.180085 
      6       -3.101293 
      6       -2.993597 
      6       -2.926957 
      7       -2.909725 
      7       -2.909430 
      7       -2.903412 
      7       -2.890565 
      7       -2.886855 
      7       -2.896337 
      7       -2.867600 
      7       -2.864043 
      7       -2.869398 
      7       -2.832618 
      7       -2.796851 
      7       -2.793181 
      7       -2.826860 
      7       -2.843403 
      7       -2.888240 
      7       -2.938875 
      7       -2.926279 
      7       -2.890122 
      7       -2.858575 
      7       -2.842614 
      7       -2.846478 
      7       -2.889178 
      7       -2.862104 
      7       -2.779837 
      7       -2.744707 
      7       -2.750667 
      7       -2.733519 
      7       -2.726930 
      7       -2.768917 
      7       -2.849284 
      7       -2.891271 
      7       -2.884736 
      7       -2.869346 
      7       -2.896394 
      7       -2.950490 
      7       -2.978367 
      7       -2.908368 
      7       -2.840803 
      7       -2.860000 
      7       -2.888680 
      7       -2.864043 
      7       -2.848346 
      7       -2.869855 
      7       -2.854144 
      7       -2.829091 
      7       -2.853231 
      7       -2.858170 
      7       -2.789154 
      7       -2.735860 
      7       -2.760470 
      7       -2.799922 
      8       -2.818320 
      8       -2.859073 
      8       -2.898967 
      8       -2.906581 
      8       -2.898108 
      8       -2.849162 
      8       -2.780724 
      8       -2.768487 
      8       -2.790535 
      8       -2.757259 
      8       -2.726447 
      8       -2.738448 
      8       -2.769465 
      8       -2.732813 
      8       -2.709569 
      8       -2.764478 
      8       -2.781218 
      8       -2.674884 
      8       -2.577204 
      8       -2.570876 
      8       -2.582921 
      8       -2.564616 
      8       -2.557418 
      8       -2.522923 
      8       -2.506380 
      8       -2.528279 
      8       -2.517135 
      8       -2.507226 
      8       -2.543577 
      8       -2.578914 
      8       -2.578085 
      8       -2.531437 
      8       -2.528349 
      8       -2.557862 
      8       -2.564629 
      8       -2.557002 
      8       -2.518411 
      8       -2.492968 
      8       -2.536350 
      8       -2.567784 
      8       -2.531880 
      8       -2.544064 
      8       -2.624651 
      9       -2.656045 
      9       -2.555843 
      9       -2.490842 
      9       -2.493354 
      9       -2.445850 
      9       -2.410293 
      9       -2.418503 
      9       -2.361975 
      9       -2.285608 
      9       -2.251558 
      9       -2.245568 
      9       -2.294443 
      9       -2.318119 
      9       -2.232777 
      9       -2.151562 
      9       -2.113917 
      9       -2.097818 
      9       -2.093987 
      9       -2.090011 
      9       -2.052173 
      9       -2.015317 
      9       -1.998699 
      9       -2.018645 
      9       -2.048166 
      9       -2.077787 
      9       -2.103629 
      9       -2.041700 
      9       -1.930465 
      9       -1.857798 
      9       -1.834886 
      9       -1.838178 
      10       -1.860663 
      10       -1.863762 
      10       -1.842919 
      10       -1.795684 
      10       -1.780797 
      10       -1.809184 
      10       -1.792313 
      10       -1.743474 
      10       -1.699262 
      10       -1.674866 
      10       -1.635795 
      10       -1.601812 
      10       -1.579451 
      10       -1.564668 
      10       -1.548023 
      10       -1.539311 
      10       -1.546449 
      10       -1.571878 
      10       -1.577839 
      10       -1.558991 
      10       -1.504344 
      10       -1.449819 
      10       -1.426906 
      10       -1.410361 
      10       -1.397669 
      10       -1.382694 
      10       -1.375223 
      10       -1.379508 
      10       -1.392490 
      10       -1.398821 
      10       -1.398727 
      10       -1.347355 
      10       -1.298498 
      10       -1.283664 
      10       -1.304179 
      10       -1.308367 
      10       -1.284266 
      10       -1.329503 
      10       -1.394743 
      10       -1.349715 
      10       -1.251543 
      10       -1.208356 
      10       -1.216250 
      10       -1.187657 
      11       -1.141604 
      11       -1.122211 
      11       -1.108727 
      11       -1.099038 
      11       -1.086623 
      11       -1.077194 
      11       -1.065424 
      11       -1.061100 
      11       -1.067675 
      11       -1.073962 
      11       -1.046259 
      11       -1.018623 
      11       -1.002532 
      11       -0.998412 
      11       -1.005600 
      11       -1.012508 
      11       -0.985419 
      11       -0.958379 
      11       -0.942491 
      11       -0.934903 
      11       -0.933517 
      11       -0.958332 
      11       -0.964289 
      11       -0.923592 
      11       -0.893527 
      11       -0.887688 
      11       -0.917868 
      11       -0.948171 
      11       -0.947104 
      11       -0.939882 
      11       -0.928235 
      11       -0.910564 
      11       -0.862814 
      11       -0.824503 
      11       -0.845063 
      11       -0.865418 
      11       -0.827081 
      11       -0.780166 
      11       -0.763975 
      11       -0.754061 
      11       -0.747918 
      12       -0.739014 
      12       -0.733048 
      12       -0.724294 
      12       -0.718475 
      12       -0.709866 
      12       -0.704191 
      12       -0.695726 
      12       -0.690192 
      12       -0.681866 
      12       -0.676472 
      12       -0.668283 
      12       -0.663024 
      12       -0.654970 
      12       -0.649844 
      12       -0.641922 
      12       -0.636927 
      12       -0.629133 
      12       -0.624266 
      12       -0.616600 
      12       -0.611884 
      12       -0.605192 
      12       -0.610377 
      12       -0.640069 
      12       -0.666173 
      12       -0.627033 
      12       -0.585818 
      12       -0.578536 
      12       -0.610543 
      12       -0.634068 
      12       -0.598071 
      13       -0.553446 
      13       -0.539523 
      13       -0.531852 
      13       -0.527932 
      13       -0.521228 
      13       -0.517440 
      13       -0.510841 
      13       -0.507157 
      13       -0.500661 
      13       -0.497079 
      13       -0.490684 
      13       -0.487201 
      13       -0.480905 
      13       -0.477533 
      13       -0.471760 
      13       -0.473372 
      13       -0.485825 
      13       -0.497931 
      13       -0.475987 
      13       -0.454055 
      13       -0.443622 
      13       -0.445503 
      13       -0.462715 
      13       -0.489168 
      13       -0.468736 
      13       -0.429899 
      13       -0.417624 
      13       -0.411185 
      13       -0.408472 
      14       -0.402989 
      14       -0.401221 
      14       -0.405185 
      14       -0.435283 
      14       -0.446470 
      14       -0.410925 
      14       -0.385136 
      14       -0.374542 
      14       -0.371782 
      14       -0.366627 
      14       -0.364385 
      14       -0.359317 
      14       -0.357148 
      14       -0.352152 
      14       -0.350068 
      14       -0.345569 
      14       -0.348443 
      14       -0.362145 
      14       -0.375488 
      14       -0.354769 
      14       -0.334035 
      14       -0.324364 
      14       -0.322132 
      14       -0.317899 
      14       -0.321051 
      14       -0.335026 
      14       -0.348640 
      15       -0.328190 
      15       -0.307735 
      15       -0.298766 
      15       -0.302122 
      15       -0.321618 
      15       -0.359295 
      15       -0.377382 
      15       -0.370538 
      15       -0.327777 
      15       -0.285017 
      15       -0.273765 
      15       -0.269178 
      15       -0.272803 
      15       -0.287686 
      15       -0.306680 
      15       -0.305259 
      15       -0.300561 
      15       -0.275685 
      15       -0.255316 
      15       -0.246420 
      15       -0.244954 
      15       -0.241067 
      15       -0.240080 
      15       -0.236255 
      15       -0.235317 
      16       -0.231540 
      16       -0.230648 
      16       -0.226918 
      16       -0.226073 
      16       -0.222388 
      16       -0.221588 
      16       -0.217948 
      16       -0.217193 
      16       -0.213597 
      16       -0.212885 
      16       -0.209332 
      16       -0.208663 
      16       -0.205152 
      16       -0.204524 
      16       -0.201055 
      16       -0.200469 
      16       -0.197040 
      16       -0.196494 
      16       -0.193105 
      16       -0.192598 
      16       -0.189248 
      16       -0.188779 
      16       -0.185467 
      16       -0.185037 
      16       -0.181762 
      16       -0.181369 
      16       -0.178131 
      16       -0.177774 
      16       -0.174572 
      16       -0.174250 
      16       -0.171084 
      16       -0.170797 
      16       -0.167665 
      17       -0.167412 
      17       -0.164314 
      17       -0.164095 
      17       -0.161030 
      17       -0.160844 
      17       -0.157811 
      17       -0.157657 
      17       -0.154657 
      17       -0.154547 
      17       -0.152003 
      17       -0.156814 
      17       -0.172432 
      17       -0.187671 
      17       -0.168831 
      17       -0.149956 
      17       -0.142126 
      17       -0.141704 
      17       -0.138849 
      17       -0.138885 
      17       -0.136072 
      17       -0.136135 
      17       -0.133350 
      17       -0.133440 
      17       -0.130682 
      17       -0.130799 
      17       -0.128067 
      17       -0.128210 
      17       -0.125504 
      18       -0.125673 
      18       -0.122979 
      18       -0.122735 
      18       -0.114765 
      18       -0.091937 
      18       -0.059937 
      18       -0.074878 
      18       -0.108280 
      18       -0.115173 
      18       -0.116283 
      18       -0.113723 
      18       -0.114010 
      18       -0.111446 
      18       -0.111755 
      18       -0.109214 
      18       -0.109545 
      18       -0.107026 
      18       -0.107380 
      18       -0.104882 
      18       -0.105257 
      18       -0.102781 
      18       -0.103177 
      19       -0.100721 
      19       -0.101111 
      19       -0.097825 
      19       -0.088458 
      19       -0.048930 
      19       -0.018797 
      19       -0.048691 
      19       -0.091755 
      19       -0.117836 
      19       -0.134473 
      19       -0.116190 
      19       -0.097842 
      19       -0.090533 
      19       -0.090627 
      19       -0.088283 
      19       -0.088824 
      19       -0.086512 
      19       -0.087071 
      19       -0.084776 
      19       -0.085352 
      20       -0.083075 
      20       -0.083668 
      20       -0.081407 
      20       -0.082017 
      20       -0.079773 
      20       -0.080399 
      20       -0.078171 
      20       -0.078814 
      20       -0.076602 
      20       -0.077260 
      20       -0.075063 
      20       -0.075736 
      20       -0.073555 
      20       -0.074243 
      20       -0.072077 
      20       -0.072780 
      20       -0.070615 
      20       -0.070908 
      20       -0.063868 
      20       -0.046043 
      20       -0.028619 
      20       -0.045297 
      20       -0.062030 
      20       -0.067740 
