Human trial picking the raspberry twin 

 time    ||     output compensated 

      0       -799.950000 
      0       -799.950000 
      0       -799.950000 
      0       -799.950000 
      0       -799.950000 
      0       -799.950000 
      0       -799.950000 
      0       -799.950000 
      0       -799.950000 
      0       -799.949995 
      0       -799.948806 
      0       -799.841755 
      0       -796.296706 
      0       -753.108902 
      0       -559.551550 
      0       -240.418392 
      0       -46.845344 
      0       -3.654439 
      0       -0.107535 
      0       -0.001923 
      0       0.000275 
      0       -0.006114 
      0       -0.023474 
      0       -0.040609 
      1       -0.023474 
      1       -0.006114 
      1       0.000280 
      1       -0.000742 
      1       0.000280 
      1       -0.006114 
      1       -0.023474 
      1       -0.040609 
      1       -0.023474 
      1       -0.006127 
      2       -0.000163 
      2       -0.006127 
      2       -0.023474 
      2       -0.040609 
      2       -0.023474 
      2       -0.006114 
      2       0.000280 
      2       -0.000742 
      2       0.000280 
      2       -0.006087 
      2       -0.022587 
      2       -0.029811 
      2       0.024921 
      2       0.073674 
      2       0.048674 
      2       0.010070 
      2       0.001610 
      2       -0.000702 
      2       0.000281 
      2       -0.006114 
      2       -0.023474 
      2       -0.040623 
      2       -0.023917 
      2       -0.011513 
      2       -0.023917 
      3       -0.040636 
      3       -0.023917 
      3       -0.011526 
      3       -0.024360 
      3       -0.046022 
      3       -0.047671 
      3       -0.046008 
      3       -0.023917 
      3       -0.006127 
      3       0.000280 
      3       -0.000702 
      3       0.001596 
      3       0.009653 
      3       0.044148 
      3       0.059846 
      3       0.028451 
      3       0.006553 
      3       -0.000259 
      3       0.000710 
      3       -0.001588 
      3       -0.009645 
      4       -0.044140 
      4       -0.059837 
      4       -0.028443 
      4       -0.006544 
      4       0.000267 
      4       -0.000728 
      4       0.000723 
      4       -0.000715 
      4       0.000723 
      4       -0.000715 
      4       0.000723 
      4       -0.000715 
      4       0.000723 
      4       -0.000715 
      5       0.000723 
      5       -0.000715 
      5       0.000723 
      5       -0.000715 
      5       0.000723 
      5       -0.000715 
      5       0.000723 
      5       -0.000715 
      5       0.000723 
      5       -0.000715 
      5       0.000723 
      5       -0.000715 
      5       0.000723 
      5       -0.000715 
      5       0.000723 
      5       -0.000715 
      5       0.000723 
      5       -0.000715 
      6       0.000723 
      6       -0.000742 
      6       -0.000163 
      6       -0.011513 
      6       -0.047671 
      6       -0.080503 
      6       -0.047194 
      6       -0.010926 
      6       0.000420 
      6       -0.000171 
      6       0.000856 
      6       -0.005483 
      6       -0.022614 
      6       -0.039352 
      6       -0.021994 
      6       -0.004588 
      6       0.001789 
      6       0.000838 
      6       0.004435 
      6       0.028841 
      6       0.139966 
      6       0.298317 
      6       0.397459 
      6       0.513838 
      6       0.701245 
      6       0.878923 
      6       1.003093 
      6       1.060957 
      6       1.080753 
      6       1.121641 
      6       1.164625 
      6       1.209643 
      6       1.366897 
      6       1.593803 
      6       1.743514 
      6       1.888948 
      7       2.078040 
      7       2.302359 
      7       2.539889 
      7       2.754698 
      7       2.909352 
      7       3.019773 
      7       3.111165 
      7       3.177705 
      7       3.255587 
      7       3.368749 
      7       3.463157 
      7       3.544096 
      7       3.604451 
      7       3.699218 
      7       3.794541 
      7       3.882978 
      7       3.908812 
      7       3.819371 
      7       3.707690 
      7       3.643696 
      7       3.662494 
      7       3.813088 
      7       3.938959 
      7       3.968168 
      7       3.972211 
      7       3.970674 
      7       3.966012 
      7       3.882775 
      7       3.417416 
      7       2.092026 
      7       0.004297 
      7       -1.403104 
      7       -1.061322 
      7       -0.489316 
      7       -0.607610 
      7       -0.966073 
      7       -1.421680 
      7       -2.076532 
      8       -2.709469 
      8       -3.043582 
      8       -3.158026 
      8       -3.246907 
      8       -3.302108 
      8       -3.283811 
      8       -3.278886 
      8       -3.342530 
      8       -3.372070 
      8       -3.312992 
      8       -3.274387 
      8       -3.299992 
      8       -3.316492 
      8       -3.304492 
      8       -3.287799 
      8       -3.271899 
      8       -3.256365 
      8       -3.230079 
      8       -3.195051 
      8       -3.144049 
      8       -3.026546 
      8       -2.894694 
      8       -2.920720 
      8       -3.069454 
      8       -3.188640 
      8       -3.177943 
      8       -3.139861 
      8       -3.125090 
      8       -3.106279 
      8       -3.165901 
      8       -3.243347 
      8       -3.208448 
      8       -3.103112 
      8       -3.062814 
      8       -3.115647 
      8       -3.130875 
      8       -3.074884 
      8       -3.067674 
      8       -3.096419 
      8       -3.100367 
      8       -3.098708 
      8       -3.137980 
      8       -3.201804 
      8       -3.168002 
      8       -3.109949 
      8       -3.125038 
      8       -3.200445 
      8       -3.186455 
      8       -3.127420 
      8       -3.197323 
      8       -3.315577 
      8       -3.330475 
      8       -3.334452 
      8       -3.411096 
      8       -3.421364 
      8       -3.324633 
      9       -3.198653 
      9       -3.134641 
      9       -3.169514 
      9       -3.260568 
      9       -3.357663 
      9       -3.385153 
      9       -3.332109 
      9       -3.284325 
      9       -3.232620 
      9       -3.192836 
      9       -3.111192 
      9       -3.052513 
      9       -3.065486 
      9       -3.113003 
      9       -3.182427 
      9       -3.185142 
      9       -3.193265 
      9       -3.229493 
      9       -3.199577 
      9       -3.221507 
      9       -3.288256 
      9       -3.306207 
      9       -3.316576 
      9       -3.276989 
      9       -3.241813 
      9       -3.294471 
      9       -3.321488 
      9       -3.243003 
      9       -3.200481 
      9       -3.217007 
      9       -3.273940 
      9       -3.305321 
      9       -3.254147 
      9       -3.204604 
      9       -3.216052 
      9       -3.279437 
      9       -3.331708 
      9       -3.386080 
      9       -3.370260 
      9       -3.298157 
      9       -3.291175 
      9       -3.300537 
      9       -3.283801 
      9       -3.220017 
      9       -3.082075 
      9       -2.948899 
      9       -2.870033 
      9       -2.857828 
      9       -2.809588 
      9       -2.750576 
      9       -2.782422 
      9       -2.804727 
      9       -2.749259 
      9       -2.733677 
      9       -2.732566 
      9       -2.682124 
      9       -2.658962 
      10       -2.658369 
      10       -2.634182 
      10       -2.570456 
      10       -2.520892 
      10       -2.488970 
      10       -2.531121 
      10       -2.608208 
      10       -2.583958 
      10       -2.459576 
      10       -2.324154 
      10       -2.288400 
      10       -2.326387 
      10       -2.312744 
      10       -2.285317 
      10       -2.282746 
      10       -2.305741 
      10       -2.263500 
      10       -2.187284 
      10       -2.194695 
      10       -2.232086 
      10       -2.199283 
      10       -2.179362 
      10       -2.193208 
      10       -2.126780 
      10       -2.087509 
      10       -2.139689 
      10       -2.222193 
      10       -2.195455 
      10       -2.117257 
      10       -2.100016 
      10       -2.034627 
      10       -1.943843 
      10       -1.959762 
      10       -1.983659 
      10       -1.920831 
      10       -1.853183 
      10       -1.799702 
      10       -1.798479 
      10       -1.834270 
      10       -1.833525 
      10       -1.854411 
      10       -1.841429 
      10       -1.768157 
      10       -1.674981 
      10       -1.639591 
      10       -1.614342 
      10       -1.569735 
      10       -1.568319 
      10       -1.567612 
      10       -1.556047 
      10       -1.534160 
      10       -1.561571 
      11       -1.601252 
      11       -1.552596 
      11       -1.520987 
      11       -1.611900 
      11       -1.685718 
      11       -1.648553 
      11       -1.499743 
      11       -1.377971 
      11       -1.331605 
      11       -1.290933 
      11       -1.289426 
      11       -1.297377 
      11       -1.233862 
      11       -1.229526 
      11       -1.239775 
      11       -1.202214 
      11       -1.238475 
      11       -1.278864 
      11       -1.262155 
      11       -1.234870 
      11       -1.168776 
      11       -1.135969 
      11       -1.192758 
      11       -1.203525 
      11       -1.151573 
      11       -1.192817 
      11       -1.199495 
      11       -1.092162 
      11       -1.018260 
      11       -1.014664 
      11       -1.044972 
      11       -1.066827 
      11       -1.100148 
      11       -1.119294 
      11       -1.080147 
      11       -1.049927 
      11       -1.101411 
      11       -1.141047 
      11       -1.085234 
      11       -1.022047 
      11       -0.951885 
      11       -0.924698 
      11       -0.947726 
      11       -0.911236 
      11       -0.873279 
      11       -0.891133 
      11       -0.902637 
      11       -0.890502 
      11       -0.842567 
      11       -0.795523 
      11       -0.789405 
      11       -0.821840 
      11       -0.871319 
      12       -0.883916 
      12       -0.914998 
      12       -0.937380 
      12       -0.899995 
      12       -0.870701 
      12       -0.848108 
      12       -0.814439 
      12       -0.759595 
      12       -0.765424 
      12       -0.783328 
      12       -0.704566 
      12       -0.638259 
      12       -0.682514 
      12       -0.699206 
      12       -0.715696 
      12       -0.775827 
      12       -0.759533 
      12       -0.710919 
      12       -0.677047 
      12       -0.665622 
      12       -0.622839 
      12       -0.591233 
      12       -0.604900 
      12       -0.654868 
      12       -0.710657 
      12       -0.734629 
      12       -0.700815 
      12       -0.682236 
      12       -0.677517 
      12       -0.700604 
      12       -0.716512 
      12       -0.719402 
      12       -0.698170 
      12       -0.685753 
      12       -0.702240 
      12       -0.727859 
      12       -0.689671 
      12       -0.635145 
      12       -0.679385 
      12       -0.742277 
      12       -0.733963 
      12       -0.711070 
      12       -0.636042 
      12       -0.538833 
      12       -0.513627 
      12       -0.502000 
      12       -0.532495 
      12       -0.605042 
      12       -0.579463 
      12       -0.529866 
      12       -0.579879 
      12       -0.609581 
      12       -0.546739 
      13       -0.502928 
      13       -0.488876 
      13       -0.485898 
      13       -0.463806 
      13       -0.447306 
      13       -0.455793 
      13       -0.514055 
      13       -0.569633 
      13       -0.562436 
      13       -0.545937 
      13       -0.539595 
      13       -0.541451 
      13       -0.549507 
      13       -0.584432 
      13       -0.605058 
      13       -0.591602 
      13       -0.575462 
      13       -0.514498 
      13       -0.455363 
      13       -0.441907 
      13       -0.439609 
      13       -0.445964 
      13       -0.463323 
      13       -0.480485 
      13       -0.464222 
      13       -0.457191 
      13       -0.492932 
      13       -0.539620 
      13       -0.509073 
      13       -0.465718 
      13       -0.491148 
      13       -0.529322 
      13       -0.532384 
      13       -0.510485 
      13       -0.469205 
      13       -0.447293 
      13       -0.449964 
      13       -0.484446 
      13       -0.505099 
      13       -0.492945 
      13       -0.492116 
      13       -0.492945 
      13       -0.505099 
      13       -0.484432 
      14       -0.449507 
      14       -0.441437 
      14       -0.439152 
      14       -0.440564 
      14       -0.439126 
      14       -0.440564 
      14       -0.439126 
      14       -0.440591 
      14       -0.440025 
      14       -0.451792 
      14       -0.492489 
      14       -0.539607 
      14       -0.509059 
      14       -0.465261 
      14       -0.485305 
      14       -0.499726 
      14       -0.468319 
      14       -0.447280 
      14       -0.450407 
      14       -0.489845 
      14       -0.529283 
      14       -0.532410 
      14       -0.511357 
      14       -0.474751 
      14       -0.480199 
      14       -0.485592 
      14       -0.449243 
      14       -0.423896 
      14       -0.422327 
      14       -0.452254 
      14       -0.468578 
      14       -0.455915 
      14       -0.459332 
      14       -0.433880 
      14       -0.394953 
      14       -0.383014 
      14       -0.376921 
      14       -0.374550 
      14       -0.369380 
      14       -0.367110 
      14       -0.362015 
      14       -0.359819 
      14       -0.354797 
      15       -0.352673 
      15       -0.347722 
      15       -0.345669 
      15       -0.340789 
      15       -0.338818 
      15       -0.334444 
      15       -0.337843 
      15       -0.356171 
      15       -0.384540 
      15       -0.374967 
      15       -0.374287 
      15       -0.393649 
      15       -0.356370 
      15       -0.316984 
      15       -0.302577 
      15       -0.300125 
      15       -0.295673 
      15       -0.294153 
      15       -0.290213 
      15       -0.293641 
      15       -0.307891 
      15       -0.321790 
      15       -0.302047 
      15       -0.287198 
      15       -0.302363 
      15       -0.344301 
      15       -0.376641 
      15       -0.371228 
      15       -0.311495 
      15       -0.267253 
      15       -0.252905 
      15       -0.250949 
      16       -0.247414 
      16       -0.251270 
      16       -0.265944 
      16       -0.280248 
      16       -0.260482 
      16       -0.240691 
      16       -0.231954 
      16       -0.230633 
      16       -0.226889 
      16       -0.226044 
      16       -0.222360 
      16       -0.221560 
      16       -0.217920 
      16       -0.217165 
      16       -0.213570 
      16       -0.212871 
      16       -0.209744 
      16       -0.213977 
      16       -0.229023 
      16       -0.243697 
      16       -0.224296 
      16       -0.204867 
      16       -0.196488 
      16       -0.195522 
      16       -0.192129 
      16       -0.191632 
      16       -0.188291 
      16       -0.187833 
      16       -0.184530 
      16       -0.184109 
      16       -0.180844 
      16       -0.180459 
      16       -0.177231 
      17       -0.176882 
      17       -0.173690 
      17       -0.173377 
      17       -0.170219 
      17       -0.169941 
      17       -0.166817 
      17       -0.166573 
      17       -0.163483 
      17       -0.163273 
      17       -0.160216 
      17       -0.160038 
      17       -0.157013 
      17       -0.156867 
      17       -0.153875 
      17       -0.153760 
      17       -0.150798 
      17       -0.150714 
      17       -0.147783 
      17       -0.147729 
      17       -0.144828 
      17       -0.144804 
      17       -0.141932 
      17       -0.141936 
      17       -0.139093 
      17       -0.139126 
      17       -0.136311 
      17       -0.136385 
      17       -0.134036 
      17       -0.139438 
      17       -0.159724 
      18       -0.189207 
      18       -0.171788 
      18       -0.136345 
      18       -0.131912 
      18       -0.146941 
      18       -0.162410 
      18       -0.143821 
      18       -0.125197 
      18       -0.117614 
      18       -0.117437 
      18       -0.114825 
      18       -0.115101 
      18       -0.112526 
      18       -0.112825 
      18       -0.110272 
      18       -0.110594 
      18       -0.108064 
      18       -0.108407 
      18       -0.105899 
      18       -0.106264 
      18       -0.103777 
      18       -0.104164 
      18       -0.101698 
      18       -0.102105 
      18       -0.099660 
      18       -0.100087 
      18       -0.097662 
      19       -0.098110 
      19       -0.095705 
      19       -0.096172 
      19       -0.093786 
      19       -0.094285 
      19       -0.092344 
      19       -0.097751 
      19       -0.113959 
      19       -0.129784 
      19       -0.111522 
      19       -0.093221 
      19       -0.085958 
      19       -0.086097 
      19       -0.083799 
      19       -0.084385 
      19       -0.082117 
      19       -0.082720 
      19       -0.080469 
      19       -0.081088 
      19       -0.078853 
      19       -0.079489 
      19       -0.077270 
      19       -0.077921 
      19       -0.075718 
      20       -0.076385 
      20       -0.074197 
      20       -0.074879 
      20       -0.072706 
      20       -0.073403 
      20       -0.071245 
      20       -0.071956 
      20       -0.069813 
      20       -0.070539 
      20       -0.068409 
      20       -0.069149 
      20       -0.067034 
      20       -0.067761 
      20       -0.064808 
      20       -0.055772 
      20       -0.016570 
      20       0.013252 
      20       -0.016537 
      20       -0.055015 
      20       -0.062854 
      20       -0.064500 
      20       -0.062458 
      20       -0.063257 
      20       -0.061201 
      20       -0.062013 
      21       -0.059969 
