Human trial picking the raspberry twin 

 time    ||     output compensated 

      0       -800.603774 
      0       -800.603774 
      0       -800.603774 
      0       -800.603774 
      0       -800.603774 
      0       -800.603774 
      0       -800.603774 
      0       -800.603774 
      0       -800.603774 
      0       -800.603769 
      0       -800.602578 
      0       -800.495394 
      0       -796.945966 
      0       -753.705891 
      0       -559.926459 
      0       -240.471713 
      0       -46.744731 
      0       -3.537322 
      0       -0.024276 
      0       0.091504 
      0       0.085831 
      0       0.054590 
      0       0.037468 
      0       0.003000 
      0       -0.002786 
      0       0.067051 
      0       0.129839 
      0       0.138312 
      0       0.116830 
      0       0.074678 
      0       0.042034 
      0       -0.001566 
      0       -0.022913 
      0       0.034700 
      0       0.067117 
      0       0.008328 
      0       -0.007711 
      0       0.041069 
      0       0.153607 
      0       0.204659 
      0       0.128927 
      0       0.075235 
      0       0.100204 
      0       0.145120 
      0       0.103774 
      0       0.012857 
      0       -0.032462 
      0       -0.015440 
      0       -0.034738 
      0       -0.143206 
      0       -0.215284 
      0       -0.171460 
      0       -0.088045 
      0       -0.032091 
      1       0.004716 
      1       -0.019980 
      1       -0.086659 
      1       -0.101939 
      1       -0.033769 
      1       0.020344 
      1       0.005256 
      1       -0.000252 
      1       0.009310 
      1       -0.014996 
      1       0.015170 
      1       0.093919 
      1       0.169746 
      1       0.160228 
      1       0.113299 
      1       0.096160 
      1       0.013284 
      1       -0.083447 
      1       -0.050377 
      1       0.007442 
      1       0.033051 
      1       0.082708 
      1       0.095747 
      1       0.102944 
      1       0.116760 
      1       0.044195 
      1       -0.038681 
      1       -0.079987 
      1       -0.107728 
      1       -0.068746 
      1       -0.004256 
      1       -0.009209 
      1       -0.029252 
      1       0.005130 
      1       0.004327 
      1       -0.040519 
      1       0.022283 
      1       0.079936 
      1       0.029507 
      1       -0.012777 
      1       -0.000545 
      1       0.024415 
      1       0.066690 
      1       0.077278 
      1       0.038839 
      1       -0.024835 
      1       -0.009585 
      1       -0.011923 
      1       -0.101417 
      1       -0.120794 
      2       -0.105098 
      2       -0.082686 
      2       -0.009183 
      2       -0.036191 
      2       -0.147097 
      2       -0.175553 
      2       -0.101848 
      2       -0.028133 
      2       -0.017600 
      2       -0.066695 
      2       -0.070436 
      2       -0.066672 
      2       -0.080348 
      2       -0.105177 
      2       -0.059779 
      2       -0.044690 
      2       -0.137268 
      2       -0.186966 
      2       -0.116796 
      2       -0.017537 
      2       0.017613 
      2       -0.048176 
      2       -0.118204 
      2       -0.103291 
      2       -0.094695 
      2       -0.075586 
      2       -0.004707 
      2       0.025444 
      2       -0.027965 
      2       -0.108018 
      2       -0.081149 
      2       -0.016531 
      2       -0.009623 
      2       0.012609 
      2       0.047110 
      2       0.054629 
      2       0.056318 
      2       0.053466 
      2       0.043228 
      2       -0.011818 
      2       -0.111054 
      2       -0.172926 
      2       -0.095385 
      2       0.045800 
      2       0.067872 
      2       -0.025414 
      2       -0.081541 
      2       -0.033696 
      2       -0.026246 
      2       -0.046853 
      2       -0.017549 
      2       0.001245 
      3       -0.004547 
      3       -0.055043 
      3       -0.085164 
      3       -0.098442 
      3       -0.138416 
      3       -0.104007 
      3       -0.073067 
      3       -0.135539 
      3       -0.210607 
      3       -0.145837 
      3       -0.048228 
      3       0.007866 
      3       0.078229 
      3       0.093890 
      3       0.037135 
      3       0.024705 
      3       0.033763 
      3       0.013057 
      3       -0.035969 
      3       -0.161989 
      3       -0.226065 
      3       -0.133277 
      3       -0.060166 
      3       -0.078965 
      3       -0.117749 
      3       -0.062361 
      3       0.019842 
      3       0.009010 
      3       -0.056680 
      3       -0.080576 
      3       -0.044182 
      3       0.001869 
      3       0.048101 
      3       0.071002 
      3       0.081515 
      3       0.092102 
      3       0.073527 
      3       -0.031113 
      3       -0.144737 
      3       -0.169081 
      3       -0.099928 
      3       -0.035571 
      3       -0.012919 
      3       0.013275 
      3       -0.003205 
      3       -0.043107 
      3       -0.014283 
      3       -0.044852 
      3       -0.138769 
      3       -0.159665 
      4       -0.152780 
      4       -0.169354 
      4       -0.142911 
      4       -0.133440 
      4       -0.183602 
      4       -0.154138 
      4       -0.052955 
      4       -0.002544 
      4       -0.028840 
      4       -0.047917 
      4       -0.050672 
      4       -0.028746 
      4       -0.011711 
      4       -0.015037 
      4       -0.052228 
      4       -0.070711 
      4       0.005860 
      4       0.103784 
      4       0.083715 
      4       0.022579 
      4       0.031590 
      4       0.014071 
      4       -0.016776 
      4       -0.002315 
      4       0.015302 
      4       0.030827 
      4       -0.004274 
      4       -0.030657 
      4       -0.069597 
      4       -0.131682 
      4       -0.130513 
      4       -0.048833 
      4       0.043445 
      4       0.113560 
      4       0.073833 
      4       -0.033824 
      4       -0.079107 
      4       -0.053610 
      4       -0.016592 
      4       -0.031185 
      4       -0.060477 
      4       -0.117686 
      4       -0.132298 
      4       -0.034894 
      4       0.034315 
      4       -0.028162 
      4       -0.108144 
      4       -0.137730 
      4       -0.057723 
      4       0.046486 
      4       -0.013305 
      4       -0.135205 
      5       -0.156930 
      5       -0.132725 
      5       -0.077253 
      5       -0.059265 
      5       -0.090999 
      5       -0.064301 
      5       -0.047844 
      5       -0.110581 
      5       -0.106979 
      5       -0.012655 
      5       0.003806 
      5       -0.010730 
      5       -0.038728 
      5       -0.058543 
      5       -0.003509 
      5       0.079985 
      5       0.134220 
      5       0.165686 
      5       0.135650 
      5       0.107282 
      5       0.138111 
      5       0.115857 
      5       0.055733 
      5       0.060491 
      5       0.079304 
      5       0.039193 
      5       0.017782 
      5       0.047477 
      5       0.059268 
      5       0.097897 
      5       0.107773 
      5       0.074555 
      5       0.024354 
      5       -0.012124 
      5       -0.011633 
      5       0.030171 
      5       0.018823 
      5       -0.011569 
      5       0.004118 
      5       0.035977 
      5       0.102645 
      5       0.099782 
      5       0.030098 
      5       -0.019068 
      5       -0.033011 
      5       0.012064 
      5       0.032350 
      6       0.008098 
      6       0.008855 
      6       -0.023152 
      6       -0.039299 
      6       -0.019497 
      6       -0.039614 
      6       -0.033478 
      6       -0.047433 
      6       -0.107148 
      6       -0.055153 
      6       -0.017382 
      6       -0.092512 
      6       -0.090323 
      6       -0.065018 
      6       -0.078136 
      6       -0.039970 
      6       -0.004326 
      6       -0.047464 
      6       -0.111573 
      6       -0.068938 
      6       -0.035701 
      6       -0.031519 
      6       -0.015017 
      6       0.012319 
      6       -0.024229 
      6       -0.081641 
      6       -0.106985 
      6       -0.100188 
      6       -0.042805 
      6       -0.002526 
      6       -0.005944 
      6       -0.066316 
      6       -0.119208 
      6       -0.046619 
      6       0.072689 
      6       0.083997 
      6       0.072949 
      6       0.081070 
      6       0.009324 
      6       -0.056395 
      6       -0.020843 
      6       0.077934 
      6       0.152024 
      6       0.136391 
      6       0.117251 
      6       0.121395 
      6       0.033240 
      6       -0.038501 
      6       -0.016836 
      6       0.023209 
      6       0.055447 
      6       0.080093 
      6       0.107754 
      6       0.075996 
      7       0.044716 
      7       0.055723 
      7       0.015684 
      7       -0.043399 
      7       -0.017803 
      7       0.035721 
      7       0.041890 
      7       0.026533 
      7       0.002561 
      7       -0.003483 
      7       -0.032952 
      7       -0.077672 
      7       -0.142330 
      7       -0.172686 
      7       -0.141320 
      7       -0.097355 
      7       -0.126460 
      7       -0.118617 
      7       -0.047241 
      7       -0.068187 
      7       -0.085934 
      7       -0.040016 
      7       0.011138 
      7       -0.013085 
      7       -0.028304 
      7       0.039664 
      7       0.050088 
      7       -0.050367 
      7       -0.101208 
      7       -0.049715 
      7       0.041322 
      7       -0.003090 
      7       -0.093439 
      7       -0.072209 
      7       -0.069694 
      7       -0.086687 
      7       -0.053068 
      7       -0.072944 
      7       -0.125782 
      7       -0.093579 
      7       -0.014916 
      7       0.035775 
      7       0.059442 
      7       0.052998 
      7       0.081903 
      7       0.138135 
      7       0.118717 
      7       0.027372 
      7       -0.020690 
      7       -0.018438 
      7       0.053828 
      7       0.147998 
      7       0.132033 
      7       0.024579 
      7       0.027565 
      7       0.068397 
      7       0.005730 
      7       -0.066693 
      7       0.002287 
      8       0.122075 
      8       0.129642 
      8       0.053496 
      8       0.020918 
      8       0.035412 
      8       -0.004451 
      8       -0.002184 
      8       0.042608 
      8       0.047045 
      8       0.021786 
      8       -0.039786 
      8       -0.081392 
      8       -0.097586 
      8       -0.119128 
      8       -0.148166 
      8       -0.120507 
      8       -0.038996 
      8       0.027046 
      8       -0.016705 
      8       -0.139379 
      8       -0.122458 
      8       0.004304 
      8       0.030821 
      8       -0.039017 
      8       -0.064953 
      8       -0.027321 
      8       -0.046300 
      8       -0.090431 
      8       -0.096417 
      8       -0.053973 
      8       -0.014528 
      8       0.006558 
      8       -0.005548 
      8       0.055843 
      8       0.135852 
      8       0.058803 
      8       -0.052811 
      8       -0.071718 
      8       -0.054683 
      8       -0.019435 
      8       -0.027791 
      8       -0.020757 
      8       0.009107 
      8       0.011288 
      8       -0.009241 
      8       -0.034885 
      8       0.004082 
      8       0.067010 
      8       0.050773 
      8       -0.016611 
      8       -0.050746 
      8       -0.052296 
      9       -0.042152 
      9       0.016939 
      9       0.060182 
      9       0.078247 
      9       0.053991 
      9       0.059630 
      9       0.118565 
      9       0.111527 
      9       0.106605 
      9       0.148541 
      9       0.243929 
      9       0.391983 
      9       0.664640 
      9       1.060035 
      9       1.396761 
      9       1.685136 
      9       2.017306 
      9       2.278723 
      9       2.429957 
      9       2.538498 
      9       2.651109 
      9       2.814828 
      9       3.056383 
      9       3.275180 
      9       3.368036 
      9       3.390131 
      9       3.423384 
      9       3.581730 
      9       3.878850 
      9       4.153653 
      10       4.312791 
      10       4.376015 
      10       4.384191 
      10       4.361630 
      10       4.261824 
      10       4.131645 
      10       3.976661 
      10       3.711629 
      10       3.535232 
      10       3.503131 
      10       3.554803 
      10       3.655471 
      10       3.723599 
      10       3.660258 
      10       3.504586 
      10       3.354335 
      10       3.018276 
      10       2.042810 
      10       0.367088 
      10       -0.934637 
      10       -0.778319 
      10       -0.034342 
      10       0.359516 
      10       0.403235 
      10       0.134593 
      10       -0.327503 
      10       -0.707692 
      10       -1.078129 
      10       -1.490091 
      10       -1.916111 
      10       -2.332113 
      10       -2.560297 
      10       -2.617953 
      10       -2.663207 
      10       -2.720305 
      10       -2.812222 
      10       -2.983457 
      10       -3.144363 
      10       -3.248836 
      10       -3.300415 
      10       -3.304469 
      10       -3.283457 
      10       -3.252049 
      10       -3.266458 
      10       -3.286098 
      10       -3.238204 
      10       -3.166783 
      10       -3.203454 
      10       -3.258769 
      10       -3.230706 
      10       -3.189480 
      10       -3.221370 
      11       -3.243686 
      11       -3.254580 
      11       -3.262054 
      11       -3.237068 
      11       -3.174253 
      11       -3.186016 
      11       -3.225288 
      11       -3.209783 
      11       -3.214564 
      11       -3.266221 
      11       -3.286265 
      11       -3.271151 
      11       -3.232958 
      11       -3.221371 
      11       -3.200262 
      11       -3.183691 
      11       -3.191305 
      11       -3.173323 
      11       -3.155950 
      11       -3.149999 
      11       -3.156380 
      11       -3.178292 
      11       -3.210546 
      11       -3.204761 
      11       -3.207888 
      11       -3.232086 
      11       -3.208345 
      11       -3.210603 
      11       -3.240169 
      11       -3.243270 
      11       -3.231283 
      11       -3.228445 
      11       -3.247410 
      11       -3.251327 
      11       -3.260809 
      11       -3.224472 
      11       -3.190003 
      11       -3.203420 
      11       -3.232125 
      11       -3.280050 
      11       -3.269725 
      11       -3.242481 
      11       -3.257626 
      11       -3.235713 
      11       -3.247840 
      11       -3.314989 
      11       -3.283204 
      11       -3.206174 
      11       -3.217775 
      11       -3.288576 
      12       -3.327128 
      12       -3.288067 
      12       -3.210173 
      12       -3.155438 
      12       -3.128114 
      12       -3.119170 
      12       -3.164783 
      12       -3.184589 
      12       -3.151770 
      12       -3.129055 
      12       -3.112789 
      12       -3.147894 
      12       -3.173753 
      12       -3.204344 
      12       -3.240102 
      12       -3.247339 
      12       -3.239713 
      12       -3.200731 
      12       -3.171622 
      12       -3.178963 
      12       -3.218583 
      12       -3.213026 
      12       -3.165372 
      12       -3.167469 
      12       -3.170740 
      12       -3.073950 
      12       -2.961002 
      12       -2.900885 
      12       -2.869957 
      12       -2.869775 
      12       -2.816944 
      12       -2.734382 
      12       -2.667409 
      12       -2.665249 
      12       -2.709941 
      12       -2.721937 
      12       -2.667124 
      12       -2.614878 
      12       -2.617396 
      12       -2.570940 
      12       -2.475067 
      12       -2.486304 
      12       -2.491519 
      12       -2.446747 
      12       -2.420872 
      12       -2.417544 
      13       -2.424450 
      13       -2.385516 
      13       -2.337323 
      13       -2.343168 
      13       -2.347716 
      13       -2.285156 
      13       -2.190908 
      13       -2.142835 
      13       -2.143099 
      13       -2.120808 
      13       -2.130693 
      13       -2.182059 
      13       -2.143877 
      13       -2.100732 
      13       -2.122659 
      13       -2.063331 
      13       -1.950377 
      13       -1.875013 
      13       -1.823356 
      13       -1.790585 
      13       -1.792565 
      13       -1.889603 
      13       -1.971338 
      13       -1.969027 
      13       -1.919547 
      13       -1.826745 
      13       -1.768132 
      13       -1.766373 
      13       -1.732704 
      13       -1.690163 
      13       -1.693143 
      13       -1.673528 
      13       -1.623216 
      13       -1.638777 
      13       -1.626939 
      13       -1.592871 
      13       -1.691017 
      13       -1.736098 
      13       -1.638544 
      13       -1.512570 
      13       -1.480090 
      13       -1.507963 
      13       -1.491458 
      13       -1.501900 
      13       -1.527197 
      13       -1.545663 
      13       -1.508926 
      13       -1.426357 
      13       -1.397566 
      13       -1.375449 
      13       -1.359175 
      14       -1.385847 
      14       -1.431926 
      14       -1.384269 
      14       -1.295574 
      14       -1.294950 
      14       -1.297541 
      14       -1.275303 
      14       -1.323725 
      14       -1.340184 
      14       -1.275859 
      14       -1.256427 
      14       -1.273983 
      14       -1.283035 
      14       -1.322074 
      14       -1.319896 
      14       -1.180291 
      14       -1.042083 
      14       -1.042705 
      14       -1.084173 
      14       -1.095975 
      14       -1.124948 
      14       -1.144272 
      14       -1.113837 
      14       -1.111074 
      14       -1.159489 
      14       -1.142003 
      14       -1.060241 
      14       -1.047215 
      14       -1.117662 
      14       -1.124067 
      14       -1.061520 
      14       -0.985141 
      14       -1.010890 
      14       -1.088051 
      14       -1.111880 
      14       -1.089130 
      14       -1.002001 
      14       -0.921405 
      14       -0.934419 
      14       -0.954713 
      14       -0.933699 
      14       -0.899052 
      14       -0.924703 
      14       -0.971342 
      14       -0.987820 
      14       -1.037896 
      14       -1.071768 
      14       -1.022610 
      14       -0.977234 
      14       -0.990075 
      15       -0.977964 
      15       -0.920683 
      15       -0.765515 
      15       -0.613695 
      15       -0.692783 
      15       -0.876011 
      15       -0.930400 
      15       -0.863351 
      15       -0.811302 
      15       -0.805834 
      15       -0.853687 
      15       -0.884098 
      15       -0.795441 
      15       -0.643692 
      15       -0.531279 
      15       -0.513067 
      15       -0.560262 
      15       -0.603927 
      15       -0.695488 
      15       -0.755492 
      15       -0.700588 
      15       -0.674456 
      15       -0.706807 
      15       -0.762695 
      15       -0.803937 
      15       -0.748318 
      15       -0.691774 
      15       -0.692629 
      15       -0.724043 
      15       -0.723750 
      15       -0.658476 
      15       -0.576426 
      15       -0.619089 
      15       -0.700603 
      15       -0.657748 
      15       -0.583283 
      15       -0.570773 
      15       -0.549087 
      15       -0.541897 
      15       -0.595804 
      15       -0.609893 
      15       -0.562479 
      15       -0.550741 
      15       -0.552620 
      15       -0.538856 
      15       -0.530606 
      15       -0.538782 
      15       -0.514594 
      15       -0.494125 
      15       -0.487199 
      15       -0.513559 
      15       -0.561965 
      15       -0.579023 
      16       -0.484447 
      16       -0.386509 
      16       -0.370157 
      16       -0.345119 
      16       -0.320947 
      16       -0.357467 
      16       -0.380696 
      16       -0.376355 
      16       -0.424999 
      16       -0.457969 
      16       -0.507162 
      16       -0.501530 
      16       -0.390569 
      16       -0.359639 
      16       -0.399811 
      16       -0.374680 
      16       -0.341090 
      16       -0.366154 
      16       -0.387255 
      16       -0.410585 
      16       -0.424942 
      16       -0.431530 
      16       -0.439881 
      16       -0.432585 
      16       -0.381449 
      16       -0.324639 
      16       -0.300755 
      16       -0.347177 
      16       -0.366619 
      16       -0.367077 
      16       -0.349556 
      16       -0.358157 
      16       -0.416150 
      16       -0.424446 
      16       -0.409142 
      16       -0.403679 
      16       -0.349939 
      16       -0.320799 
      16       -0.366279 
      16       -0.359533 
      16       -0.289448 
      16       -0.308671 
      16       -0.349930 
      16       -0.326518 
      16       -0.308138 
      16       -0.261519 
      16       -0.217325 
      16       -0.250535 
      16       -0.263556 
      16       -0.228142 
      16       -0.247580 
      16       -0.251695 
      16       -0.202683 
      16       -0.229435 
      17       -0.271947 
      17       -0.185813 
      17       -0.093978 
      17       -0.154556 
      17       -0.268035 
      17       -0.243419 
      17       -0.104548 
      17       -0.011956 
      17       -0.023443 
      17       -0.024936 
      17       -0.078871 
      17       -0.117457 
      17       -0.063192 
      17       -0.105607 
      17       -0.227366 
      17       -0.294395 
      17       -0.336239 
      17       -0.334189 
      17       -0.239084 
      17       -0.150621 
      17       -0.182826 
      17       -0.285241 
      17       -0.321832 
      17       -0.260550 
      17       -0.214395 
      17       -0.213233 
      17       -0.183472 
      17       -0.132498 
      17       -0.116440 
      17       -0.172131 
      17       -0.174304 
      17       -0.142083 
      17       -0.181791 
      17       -0.212886 
      17       -0.179690 
      17       -0.139305 
      17       -0.130362 
      17       -0.201440 
      17       -0.264083 
      17       -0.231377 
      17       -0.213909 
      17       -0.242434 
      17       -0.193772 
      17       -0.092619 
      17       -0.065341 
      17       -0.130504 
      17       -0.172958 
      17       -0.185126 
      17       -0.185346 
      17       -0.194712 
      17       -0.162454 
      17       -0.087756 
      17       -0.033064 
      17       -0.004897 
      17       0.012143 
      17       -0.014742 
      17       -0.069439 
      17       -0.111474 
      17       -0.101385 
      17       -0.094271 
      18       -0.068853 
      18       -0.043840 
      18       -0.082845 
      18       -0.152574 
      18       -0.167440 
      18       -0.108156 
      18       -0.092411 
      18       -0.156744 
      18       -0.200360 
      18       -0.210019 
      18       -0.202890 
      18       -0.188569 
      18       -0.187066 
      18       -0.203420 
      18       -0.152546 
      18       -0.116036 
      18       -0.193823 
      18       -0.258349 
      18       -0.222179 
      18       -0.179901 
      18       -0.176865 
      18       -0.136383 
      18       -0.098333 
      18       -0.081193 
      18       -0.062344 
      18       -0.044770 
      18       -0.062536 
      18       -0.092978 
      18       -0.144795 
      18       -0.155818 
      18       -0.087232 
      18       -0.043838 
      18       -0.044220 
      18       -0.097497 
      18       -0.130633 
      18       -0.097860 
      18       -0.052949 
      18       -0.020953 
      18       -0.054854 
      18       -0.108025 
      18       -0.107779 
      18       -0.064618 
      18       -0.002236 
      18       -0.036898 
      18       -0.107843 
      18       -0.071776 
      18       0.033225 
      18       0.072375 
      18       0.014879 
      18       -0.013637 
      18       0.049468 
      19       0.100444 
      19       0.065237 
      19       -0.012131 
      19       -0.066610 
      19       -0.097875 
      19       -0.123508 
      19       -0.082779 
      19       -0.007494 
      19       0.033061 
      19       0.063251 
      19       0.041364 
      19       -0.022460 
      19       -0.027168 
      19       -0.048620 
      19       -0.080091 
      19       -0.074397 
      19       -0.088399 
      19       -0.085131 
      19       -0.081388 
      19       -0.111876 
      19       -0.142823 
      19       -0.108026 
      19       -0.061310 
      19       -0.011363 
      19       0.029948 
      19       0.047929 
      19       0.087796 
      19       0.126400 
      19       0.132262 
      19       0.118057 
      19       0.054342 
      19       -0.014102 
      19       0.005621 
      19       0.085294 
      19       0.106312 
      19       0.044790 
      19       0.029870 
      19       0.079124 
      19       0.139659 
      19       0.154588 
      19       0.167744 
      19       0.143385 
      19       0.034182 
      19       -0.037543 
      19       0.005805 
      19       0.084655 
      19       0.125544 
      19       0.152719 
      19       0.127360 
      19       0.105282 
      19       0.177539 
      19       0.179171 
      20       0.128702 
      20       0.075229 
      20       0.034488 
      20       0.030032 
      20       0.036216 
      20       0.011633 
      20       -0.045783 
      20       -0.009836 
      20       0.068873 
      20       0.071710 
      20       0.051904 
      20       0.036246 
      20       -0.011718 
      20       -0.015705 
      20       0.003923 
      20       -0.026020 
      20       -0.054283 
      20       -0.014389 
      20       0.062241 
      20       0.102082 
      20       0.072113 
      20       0.022550 
      20       -0.027739 
      20       -0.073643 
      20       -0.026669 
      20       0.088318 
      20       0.178579 
      20       0.185070 
      20       0.088840 
      20       -0.018992 
      20       0.055799 
      20       0.161556 
      20       0.118324 
      20       0.064354 
      20       0.060486 
      20       -0.013191 
      20       -0.093882 
      20       -0.054286 
      20       0.000250 
      20       0.021271 
      20       0.039547 
      20       0.056980 
      20       0.048447 
      20       0.059448 
      20       0.060690 
      20       0.050283 
      20       0.075533 
      20       0.064552 
      20       0.060837 
      20       0.053104 
      20       0.029095 
      21       0.062946 
