Human trial picking the raspberry twin 

 time    ||     output     ||     loadcell

      0.000000       -801.956923       0.230000 
      0.030361       -801.956923       0.150000 
      0.061211       -801.956923       0.130000 
      0.092735       -801.956923       0.010000 
      0.124929       -801.956923       0.090000 
      0.156580       -801.956923       0.050000 
      0.187516       -801.956923       0.040000 
      0.218599       -801.956923       0.010000 
      0.249473       -801.956923       0.210000 
      0.280389       -801.956918       0.080000 
      0.310817       -801.955726       0.120000 
      0.342718       -801.848394       0.240000 
      0.373837       -798.294052       0.130000 
      0.404579       -754.993296       0.140000 
      0.436510       -560.932775       0.080000 
      0.468422       -240.981066       0.070000 
      0.498342       -46.920545       0.090000 
      0.530283       -3.619790       0.230000 
      0.561773       -0.065448       0.220000 
      0.593673       0.041871       0.100000 
      0.624599       0.042633       0.090000 
      0.655483       0.037682       0.200000 
      0.686978       0.018884       0.000000 
      0.717888       0.003174       0.100000 
      0.748806       0.018441       0.260000 
      0.778730       0.032283       0.150000 
      0.810652       0.018441       0.040000 
      0.842525       0.003173       0.100000 
      0.873628       0.018870       0.370000 
      0.904883       0.037226       0.070000 
      0.936080       0.036796       0.010000 
      0.967703       0.013458       0.080000 
      0.998299       -0.021467       0.070000 
      1.029086       -0.026853       0.100000 
      1.059866       -0.016125       0.030000 
      1.090911       -0.027309       0.040000 
      1.122082       -0.027309       0.290000 
      1.153475       -0.016138       0.240000 
      1.185410       -0.027296       0.080000 
      1.216513       -0.026866       0.010000 
      1.248112       -0.010726       0.220000 
      1.280030       -0.002669       0.220000 
      1.310693       0.017984       0.110000 
      1.341795       0.032256       0.190000 
      1.371709       0.017984       0.370000 
      1.403082       -0.002669       0.180000 
      1.434645       -0.010712       0.250000 
      1.466531       -0.026423       0.170000 
      1.497226       -0.021923       0.110000 
      1.529000       0.007173       0.190000 
      1.560050       0.001800       0.040000 
      1.592138       -0.051076       0.080000 
      1.623037       -0.085572       0.050000 
      1.653955       -0.056462       0.080000 
      1.684764       -0.022410       0.020000 
      1.715810       -0.033151       0.110000 
      1.745729       -0.051076       0.100000 
      1.776942       -0.050620       0.040000 
      1.806892       -0.026853       0.200000 
      1.837777       0.013002       0.130000 
      1.867700       0.036339       0.120000 
      1.898504       0.031826       0.160000 
      1.929358       -0.005326       0.040000 
      1.959889       -0.036707       0.050000 
      1.991832       -0.005313       0.100000 
      2.022016       0.032283       0.080000 
      2.053889       0.042195       0.180000 
      2.083979       0.043041       0.270000 
      2.115900       0.042624       0.370000 
      2.147114       0.037226       0.020000 
      2.178234       0.013042       0.150000 
      2.209851       -0.026409       0.190000 
      2.240819       -0.045221       0.060000 
      2.272051       -0.026852       0.060000 
      2.302879       0.007643       0.280000 
      2.334682       0.013028       0.130000 
      2.365421       0.002704       0.140000 
      2.396190       0.017984       0.180000 
      2.427325       0.026884       0.080000 
      2.457993       -0.005756       0.170000 
      2.489439       -0.036721       0.020000 
      2.520078       -0.005326       0.050000 
      2.551910       0.031840       0.030000 
      2.583199       0.036796       0.140000 
      2.613571       0.018844       0.190000 
      2.644790       0.002744       0.080000 
      2.676310       0.013485       0.180000 
      2.707285       0.013472       0.060000 
      2.737983       0.002301       0.010000 
      2.769733       0.013472       0.010000 
      2.800927       0.013485       0.350000 
      2.832770       0.002730       0.100000 
      2.864526       0.018428       0.100000 
      2.895763       0.032283       0.220000 
      2.926582       0.018414       0.130000 
      2.957356       0.002287       0.260000 
      2.987919       0.008086       0.190000 
      3.020269       -0.010739       0.110000 
      3.051831       -0.038050       0.030000 
      3.083054       -0.016581       0.060000 
      3.115010       -0.021980       0.300000 
      3.145831       -0.068090       0.030000 
      3.176966       -0.080673       0.070000 
      3.209191       -0.085615       0.100000 
      3.240925       -0.091830       0.110000 
      3.272842       -0.056475       0.120000 
      3.302756       -0.016568       0.060000 
      3.332683       -0.003125       0.250000 
      3.364590       0.017971       0.060000 
      3.395082       0.032269       0.190000 
      3.426002       0.018440       0.010000 
      3.455889       0.003133       0.060000 
      3.486868       0.017541       0.080000 
      3.517783       0.021028       0.060000 
      3.548705       -0.035795       0.010000 
      3.579626       -0.106211       0.170000 
      3.610345       -0.093628       0.110000 
      3.642260       -0.038094       0.110000 
      3.672180       0.001357       0.120000 
      3.703297       -0.011222       0.060000 
      3.734680       -0.038078       0.040000 
      3.765863       -0.017038       0.050000 
      3.797006       -0.027796       0.040000 
      3.827460       -0.096786       0.120000 
      3.858782       -0.133522       0.060000 
      3.889889       -0.095900       0.180000 
      3.921684       -0.017038       0.300000 
      3.953164       0.030027       0.100000 
      3.984115       0.025501       0.070000 
      4.015060       -0.035823       0.010000 
      4.046265       -0.111637       0.250000 
      4.077387       -0.119128       0.060000 
      4.108004       -0.093299       0.120000 
      4.139019       -0.084633       0.060000 
      4.170331       -0.087897       0.160000 
      4.202126       -0.030881       0.010000 
      4.232078       0.020531       0.180000 
      4.263408       0.005426       0.110000 
      4.295283       -0.061498       0.060000 
      4.326812       -0.135296       0.130000 
      4.356934       -0.152918       0.020000 
      4.389169       -0.149681       0.060000 
      4.421048       -0.198628       0.000000 
      4.452533       -0.212883       0.120000 
      4.483066       -0.172186       0.070000 
      4.514598       -0.099086       0.110000 
      4.545846       -0.082556       0.040000 
      4.577224       -0.143490       0.030000 
      4.609332       -0.170761       0.150000 
      4.639291       -0.171746       0.150000 
      4.670571       -0.199417       0.230000 
      4.701547       -0.200839       0.150000 
      4.733049       -0.106240       0.060000 
      4.763662       -0.015780       0.090000 
      4.794974       -0.029609       0.070000 
      4.825902       -0.121091       0.310000 
      4.856576       -0.180603       0.070000 
      4.888506       -0.166817       0.230000 
      4.919907       -0.171221       0.040000 
      4.951302       -0.217909       0.070000 
      4.982521       -0.218725       0.130000 
      5.014026       -0.182944       0.090000 
      5.045084       -0.141208       0.120000 
      5.076095       -0.127336       0.380000 
      5.107446       -0.103126       0.310000 
      5.139719       -0.071342       0.010000 
      5.169934       -0.085644       0.230000 
      5.202094       -0.122437       0.050000 
      5.233351       -0.204857       0.140000 
      5.264643       -0.276145       0.010000 
      5.295838       -0.248308       0.060000 
      5.326254       -0.194199       0.180000 
      5.357388       -0.166748       0.040000 
      5.388177       -0.178069       0.020000 
      5.419895       -0.176603       0.010000 
      5.451014       -0.167274       0.320000 
      5.481790       -0.181130       0.140000 
      5.513877       -0.192327       0.160000 
      5.561084       -0.168200       0.150000 
      5.592614       -0.177546       0.260000 
      5.623319       -0.253348       0.130000 
      5.654826       -0.312453       0.030000 
      5.685448       -0.312484       0.230000 
      5.717090       -0.252006       0.080000 
      5.747174       -0.247090       0.000000 
      5.777868       -0.289643       0.030000 
      5.809699       -0.289200       0.120000 
      5.840927       -0.307168       0.150000 
      5.871338       -0.316914       0.050000 
      5.903252       -0.291068       0.280000 
      5.934592       -0.281989       0.240000 
      5.965186       -0.278471       0.220000 
      5.996359       -0.265419       0.280000 
      6.027248       -0.277572       0.120000 
      6.058704       -0.270720       0.100000 
      6.089356       -0.236334       0.030000 
      6.119942       -0.200344       0.170000 
      6.151560       -0.148459       0.050000 
      6.180923       -0.072645       0.050000 
      6.213093       -0.055688       0.060000 
      6.245032       -0.112082       0.040000 
      6.276132       -0.190984       0.120000 
      6.308050       -0.220567       0.040000 
      6.337784       -0.211182       0.030000 
      6.369095       -0.214796       0.030000 
      6.399908       -0.247064       0.030000 
      6.430914       -0.325966       0.080000 
      6.462768       -0.379689       0.080000 
      6.493684       -0.350190       0.010000 
      6.524725       -0.293244       0.110000 
      6.556875       -0.274473       0.250000 
      6.588605       -0.311666       0.310000 
      6.619017       -0.367674       0.010000 
      6.650574       -0.386502       0.060000 
      6.681750       -0.415668       0.040000 
      6.711847       -0.461804       0.190000 
      6.742574       -0.451479       0.150000 
      6.773986       -0.426010       0.220000 
      6.803808       -0.440292       0.170000 
      6.834679       -0.408951       0.090000 
      6.866061       -0.324281       0.050000 
      6.896858       -0.369144       0.080000 
      6.927695       -0.521840       0.280000 
      6.958447       -0.583812       0.090000 
      6.989909       -0.564452       0.040000 
      7.020788       -0.558720       0.160000 
      7.052838       -0.549234       0.100000 
      7.083469       -0.523779       0.100000 
      7.114556       -0.471718       0.180000 
      7.145628       -0.468200       0.020000 
      7.177086       -0.498157       0.170000 
      7.208597       -0.510766       0.070000 
      7.239103       -0.532695       0.210000 
      7.270283       -0.556905       0.260000 
      7.302198       -0.580673       0.030000 
      7.332215       -0.596840       0.320000 
      7.363654       -0.582432       0.100000 
      7.395044       -0.578085       0.010000 
      7.424774       -0.624984       0.020000 
      7.456215       -0.657387       0.160000 
      7.488161       -0.608830       0.220000 
      7.518926       -0.569142       0.180000 
      7.550048       -0.550994       0.190000 
      7.580882       -0.534630       0.210000 
      7.612727       -0.521012       0.080000 
      7.642940       -0.559244       0.590000 
      7.673540       -0.600787       1.640000 
      7.705315       -0.630948       1.080000 
      7.736521       -0.646053       1.010000 
      7.767362       -0.631365       0.370000 
      7.798711       -0.605340       0.180000 
      7.829572       -0.573959       2.240000 
      7.859824       -0.528293       4.630000 
      7.891679       -0.547091       8.210000 
      7.921630       -0.613437       12.670000 
      7.952848       -0.630423       16.920000 
      7.983382       -0.647966       26.390000 
      8.014893       -0.699001       38.990000 
      8.045997       -0.720093       52.540000 
      8.076972       -0.633151       63.240000 
      8.108151       -0.553392       85.580000 
      8.139381       -0.608001       112.510000 
      8.171060       -0.661745       138.300000 
      8.201884       -0.573403       174.580000 
      8.233806       -0.378905       208.490000 
      8.265168       -0.242635       150.820000 
      8.295949       -0.214337       13.710000 
      8.327866       -0.146175       30.370000 
      8.358168       -0.052047       24.040000 
      8.389713       -0.014797       17.050000 
      8.420895       -0.006253       15.960000 
      8.452621       -0.002239       24.840000 
      8.482948       0.018441       8.250000 
      8.514037       0.037669       13.670000 
      8.545042       0.042638       18.160000 
      8.576125       0.043050       11.270000 
      8.607185       0.042232       4.060000 
      8.638067       0.023981       7.630000 
      8.669279       -0.156723       8.700000 
      8.700500       -0.896144       11.100000 
      8.730693       -2.051204       9.330000 
      8.761911       -2.649462       2.510000 
      8.793172       -2.671733       0.250000 
      8.824704       -2.720412       5.900000 
      8.855864       -2.915443       10.250000 
      8.886881       -3.233635       6.280000 
      8.917805       -3.630796       2.920000 
      8.949044       -3.858426       4.970000 
      8.980759       -3.928154       7.850000 
      9.012056       -3.951384       6.720000 
      9.044057       -3.956474       5.760000 
      9.074848       -3.956905       3.960000 
      9.106161       -3.956919       6.210000 
      9.137450       -3.956919       6.770000 
      9.168633       -3.956919       6.430000 
      9.199409       -3.956919       5.460000 
      9.230124       -3.956919       5.430000 
      9.261757       -3.956919       6.320000 
      9.292764       -3.956919       6.590000 
      9.322784       -3.956919       6.230000 
      9.353699       -3.956919       5.350000 
      9.384892       -3.956919       5.470000 
      9.416340       -3.956919       6.110000 
      9.446848       -3.956919       6.660000 
      9.478893       -3.956919       5.530000 
      9.509338       -3.956919       6.120000 
      9.541048       -3.956919       5.700000 
      9.572782       -3.956919       6.080000 
      9.603853       -3.956919       5.640000 
      9.635808       -3.956919       5.780000 
      9.666325       -3.956919       5.670000 
      9.696494       -3.956919       5.670000 
      9.728069       -3.956919       5.530000 
      9.759411       -3.956919       5.720000 
      9.789849       -3.956919       5.470000 
      9.820946       -3.956919       5.600000 
      9.851811       -3.956919       5.600000 
      9.882045       -3.956919       5.650000 
      9.912722       -3.956919       5.710000 
      9.944571       -3.956919       5.480000 
      9.975773       -3.956919       5.800000 
      10.006045       -3.956919       5.640000 
      10.035884       -3.956919       5.640000 
      10.066176       -3.956919       5.700000 
      10.096466       -3.956919       5.840000 
      10.127870       -3.956919       5.830000 
      10.159172       -3.956919       5.900000 
      10.189934       -3.956919       6.010000 
      10.220315       -3.956919       5.920000 
      10.250961       -3.956919       6.150000 
      10.280925       -3.956919       5.900000 
      10.311840       -3.956919       5.930000 
      10.343754       -3.956919       5.870000 
      10.374672       -3.956919       5.920000 
      10.404523       -3.956919       5.730000 
      10.435440       -3.956919       6.100000 
      10.466392       -3.956919       5.360000 
      10.498307       -3.956919       5.860000 
      10.528192       -3.956919       5.680000 
      10.558112       -3.956919       5.790000 
      10.588033       -3.956919       5.800000 
      10.617985       -3.956919       5.360000 
      10.647873       -3.956919       5.940000 
      10.678790       -3.956919       5.520000 
      10.710706       -3.956919       5.590000 
      10.741622       -3.956919       5.740000 
      10.773536       -3.956905       5.670000 
      10.803483       -3.956476       5.700000 
      10.850358       -3.951520       5.720000 
      10.880278       -3.932722       5.850000 
      10.911879       -3.917025       5.580000 
      10.943218       -3.932722       5.600000 
      10.973151       -3.951520       5.890000 
      11.003510       -3.956476       5.770000 
      11.035011       -3.956905       5.690000 
      11.065892       -3.956919       5.960000 
      11.097804       -3.956919       5.820000 
      11.128722       -3.956919       5.950000 
      11.159640       -3.956919       5.820000 
      11.191555       -3.956919       5.760000 
      11.222796       -3.956919       5.750000 
      11.253773       -3.956919       5.800000 
      11.285653       -3.956919       5.880000 
      11.315830       -3.956919       5.720000 
      11.347781       -3.956919       5.780000 
      11.379093       -3.956919       5.660000 
      11.410440       -3.956919       5.650000 
      11.441890       -3.956919       5.830000 
      11.472326       -3.956919       5.720000 
      11.502785       -3.956919       5.790000 
      11.533595       -3.956919       5.490000 
      11.565443       -3.956919       5.700000 
      11.596361       -3.956919       5.730000 
      11.627279       -3.956919       5.660000 
      11.659194       -3.956919       5.740000 
      11.690111       -3.956919       5.760000 
      11.720704       -3.956919       5.670000 
      11.750990       -3.956919       5.840000 
      11.797099       -3.956919       5.680000 
      11.827422       -3.956919       5.980000 
      11.859252       -3.956919       5.890000 
      11.890867       -3.956919       6.000000 
      11.920949       -3.956919       5.990000 
      11.951888       -3.956919       5.630000 
      11.981644       -3.956919       5.890000 
      12.012917       -3.956919       5.710000 
      12.043466       -3.956919       5.670000 
      12.074486       -3.956919       5.870000 
      12.105737       -3.956919       5.700000 
      12.136848       -3.956919       5.590000 
      12.168762       -3.956919       5.590000 
      12.198683       -3.956919       5.860000 
      12.230597       -3.956919       5.650000 
      12.262514       -3.956919       5.760000 
      12.293570       -3.956919       5.820000 
      12.325276       -3.956919       5.680000 
      12.357143       -3.956919       5.680000 
      12.387315       -3.956919       5.930000 
      12.418126       -3.956919       5.660000 
      12.448232       -3.956919       5.640000 
      12.478902       -3.956919       5.760000 
      12.510434       -3.956919       5.890000 
      12.541074       -3.956919       5.760000 
      12.572449       -3.956919       5.810000 
      12.603695       -3.956919       5.770000 
      12.635187       -3.956919       5.860000 
      12.666473       -3.956919       5.950000 
      12.697821       -3.956919       5.800000 
      12.728285       -3.956919       5.630000 
      12.758904       -3.956919       5.500000 
      12.790502       -3.956919       5.980000 
      12.821000       -3.956919       5.830000 
      12.852914       -3.956919       5.850000 
      12.883832       -3.956919       5.850000 
      12.914750       -3.956919       5.850000 
      12.946587       -3.956919       5.490000 
      12.977429       -3.956919       5.920000 
      13.008096       -3.956919       5.680000 
      13.038855       -3.956919       5.850000 
      13.069847       -3.956919       5.850000 
      13.100635       -3.956919       5.650000 
      13.131812       -3.956919       5.570000 
      13.163446       -3.956919       5.800000 
      13.194686       -3.956919       5.620000 
      13.225381       -3.956919       5.770000 
      13.256838       -3.956919       5.790000 
      13.288755       -3.956919       5.460000 
      13.318679       -3.956919       5.700000 
      13.350592       -3.956919       5.720000 
      13.380548       -3.956919       5.600000 
      13.412486       -3.956919       5.850000 
      13.443377       -3.956919       5.870000 
      13.474294       -3.956919       5.570000 
      13.505814       -3.956919       5.980000 
      13.537696       -3.956919       6.070000 
      13.569637       -3.956919       5.920000 
      13.600528       -3.956905       5.780000 
      13.631446       -3.956476       5.610000 
      13.663361       -3.951520       5.830000 
      13.693313       -3.932722       5.520000 
      13.724756       -3.917011       5.880000 
      13.756138       -3.932265       5.730000 
      13.787419       -3.945664       5.720000 
      13.817622       -3.926436       5.760000 
      13.848747       -3.887415       5.410000 
      13.880025       -3.868630       5.560000 
      13.910943       -3.887428       5.720000 
      13.942859       -3.926879       5.610000 
      13.973774       -3.951063       5.690000 
      14.004692       -3.956462       5.760000 
      14.036207       -3.956905       5.870000 
      14.067582       -3.956919       5.880000 
      14.099433       -3.956905       5.680000 
      14.130702       -3.956476       5.770000 
      14.177879       -3.951519       5.850000 
      14.207973       -3.932695       5.730000 
      14.239872       -3.916138       5.830000 
      14.270700       -3.921924       5.640000 
      14.301830       -3.903125       6.070000 
      14.332748       -3.876660       5.850000 
      14.363667       -3.907625       5.820000 
      14.395579       -3.935309       5.860000 
      14.426497       -3.907182       5.870000 
      14.458411       -3.871248       5.850000 
      14.488331       -3.878472       5.930000 
      14.518251       -3.876187       5.830000 
      14.550166       -3.862345       5.860000 
      14.580086       -3.863205       5.660000 
      14.610007       -3.886985       5.880000 
      14.640924       -3.926866       5.740000 
      14.671842       -3.951063       5.790000 
      14.702758       -3.956449       5.740000 
      14.732679       -3.956449       5.810000 
      14.762599       -3.951076       5.980000 
      14.792519       -3.927309       5.600000 
      14.822439       -3.892384       5.710000 
      14.853359       -3.887428       5.660000 
      14.883277       -3.903112       5.690000 
      14.913197       -3.910739       5.630000 
      14.944114       -3.926866       5.910000 
      14.975031       -3.927296       5.730000 
      15.005948       -3.916138       5.770000 
      15.037764       -3.927309       5.650000 
      15.068683       -3.927322       5.810000 
      15.099665       -3.916581       5.750000 
      15.131585       -3.932682       5.780000 
      15.163245       -3.950633       5.840000 
      15.193165       -3.945677       5.850000 
      15.224762       -3.908511       5.980000 
      15.256678       -3.877130       5.840000 
      15.288593       -3.908511       5.650000 
      15.318710       -3.945677       6.050000 
      15.350683       -3.950633       5.990000 
      15.380605       -3.932695       5.770000 
      15.410559       -3.917011       5.900000 
      15.441978       -3.932278       5.880000 
      15.473765       -3.946107       5.680000 
      15.503686       -3.931835       5.930000 
      15.535710       -3.911612       5.870000 
      15.567606       -3.908525       5.650000 
      15.597527       -3.911625       5.670000 
      15.628917       -3.932251       5.760000 
      15.658838       -3.950593       5.730000 
      15.689755       -3.944777       5.580000 
      15.720710       -3.897256       5.610000 
      15.750601       -3.822880       5.740000 
      15.780513       -3.798697       5.580000 
      15.812450       -3.828223       6.070000 
      15.842351       -3.856503       5.870000 
      15.874262       -3.881103       5.870000 
      15.905211       -3.902199       5.730000 
      15.936099       -3.905326       5.760000 
      15.967016       -3.902655       6.120000 
      15.997932       -3.886958       5.920000 
      16.029847       -3.886515       5.740000 
      16.059794       -3.896827       5.900000 
      16.089687       -3.876173       5.700000 
      16.120740       -3.843533       5.720000 
      16.151514       -3.842108       5.580000 
      16.183046       -3.878029       5.810000 
      16.214745       -3.899928       5.790000 
      16.245060       -3.902225       5.880000 
      16.276943       -3.887375       5.930000 
      16.307860       -3.891484       5.940000 
      16.338777       -3.916054       5.680000 
      16.369693       -3.896813       5.790000 
      16.399647       -3.846191       5.560000 
      16.429562       -3.833595       5.720000 
      16.460456       -3.832749       6.010000 
      16.492366       -3.835836       5.660000 
      16.522286       -3.853805       5.660000 
      16.554234       -3.860006       5.850000 
      16.586150       -3.877102       5.880000 
      16.616063       -3.869875       5.790000 
      16.647987       -3.827336       5.670000 
      16.679898       -3.774460       5.770000 
      16.709785       -3.777157       5.710000 
      16.741769       -3.843463       5.920000 
      16.773692       -3.875274       5.810000 
      16.803601       -3.885615       5.880000 
      16.835557       -3.897229       5.600000 
      16.867021       -3.881129       6.220000 
      16.898971       -3.862331       6.130000 
      16.931071       -3.857778       5.760000 
      16.962991       -3.861432       5.970000 
      16.992906       -3.869875       5.950000 
      17.024795       -3.843033       5.850000 
      17.054748       -3.777574       5.780000 
      17.086631       -3.779442       5.940000 
      17.116548       -3.847020       5.900000 
      17.148462       -3.896356       5.640000 
      17.178369       -3.909356       5.730000 
      17.210281       -3.915610       5.810000 
      17.242196       -3.873476       5.610000 
      17.272116       -3.811266       5.590000 
      17.304032       -3.828196       5.620000 
      17.334949       -3.843033       5.800000 
      17.365866       -3.819239       5.820000 
      17.396784       -3.829138       5.850000 
      17.429695       -3.825024       5.510000 
      17.459616       -3.807638       5.790000 
      17.489535       -3.787388       5.810000 
      17.520454       -3.786555       5.760000 
      17.551371       -3.797700       5.830000 
      17.581291       -3.786541       5.740000 
      17.611210       -3.786932       5.970000 
      17.643135       -3.801769       5.760000 
      17.674057       -3.794542       5.830000 
      17.704961       -3.754261       5.760000 
      17.734879       -3.707183       5.990000 
      17.765797       -3.738578       6.070000 
      17.796747       -3.791884       5.830000 
      17.828662       -3.805340       5.850000 
      17.859579       -3.813414       5.610000 
      17.890494       -3.834922       5.970000 
      17.922378       -3.861375       5.810000 
      17.953329       -3.827323       5.920000 
      17.984216       -3.782529       5.770000 
      18.015159       -3.814353       5.610000 
      18.047081       -3.870317       5.860000 
      18.077995       -3.895470       5.830000 
      18.108881       -3.875247       5.560000 
      18.139799       -3.832708       5.910000 
      18.170715       -3.792801       5.780000 
      18.202680       -3.786556       5.930000 
      18.233606       -3.792341       5.760000 
      18.264498       -3.763231       5.750000 
      18.294415       -3.757862       5.910000 
      18.324363       -3.826826       6.100000 
      18.356250       -3.878843       5.900000 
      18.386171       -3.839821       5.430000 
      18.418113       -3.749779       5.800000 
      18.450020       -3.712595       5.790000 
      18.479919       -3.768104       5.660000 
      18.511643       -3.790555       5.880000 
      18.543516       -3.759590       5.860000 
      18.573435       -3.735866       5.830000 
      18.604566       -3.725551       5.710000 
      18.636454       -3.772630       5.620000 
      18.666401       -3.791857       5.860000 
      18.698315       -3.770401       5.760000 
      18.729204       -3.784274       5.760000 
      18.760149       -3.805769       5.860000 
      18.791040       -3.825993       6.020000 
      18.820959       -3.821857       5.800000 
      18.851905       -3.791068       5.670000 
      18.882794       -3.777073       5.670000 
      18.913713       -3.760560       5.920000 
      18.945626       -3.760493       5.690000 
      18.976545       -3.840791       5.840000 
      19.007462       -3.859019       5.840000 
      19.037385       -3.748959       5.790000 
      19.069296       -3.684789       5.540000 
      19.101212       -3.784770       5.890000 
      19.131131       -3.898541       5.970000 
      19.163045       -3.913825       5.910000 
      19.194997       -3.862251       5.930000 
      19.224880       -3.822436       5.760000 
      19.256795       -3.828182       5.840000 
      19.286716       -3.831379       5.880000 
      19.318630       -3.823668       5.680000 
      19.348586       -3.788313       5.920000 
      19.380464       -3.696385       5.580000 
      19.410389       -3.655244       5.800000 
      19.442300       -3.682862       5.740000 
      19.474235       -3.724690       5.920000 
      19.504646       -3.729467       5.590000 
      19.535563       -3.660103       5.730000 
      19.565482       -3.602285       5.730000 
      19.595910       -3.678955       5.850000 
      19.626829       -3.751892       5.650000 
      19.657745       -3.749790       5.760000 
      19.689153       -3.780606       5.620000 
      19.720964       -3.801698       5.870000 
      19.752672       -3.734936       5.740000 
      19.783727       -3.673559       5.910000 
      19.815171       -3.658222       5.710000 
      19.846529       -3.655643       5.720000 
      19.877780       -3.641152       5.780000 
      19.908936       -3.589297       5.940000 
      19.940446       -3.556491       5.880000 
      19.971789       -3.605867       6.200000 
      20.003373       -3.654661       5.830000 
      20.034339       -3.702226       5.890000 
      20.064542       -3.732667       5.780000 
      20.095838       -3.764478       5.850000 
      20.127893       -3.810724       5.820000 
      20.159807       -3.778773       5.870000 
      20.189556       -3.676301       5.740000 
      20.220295       -3.626924       5.780000 
      20.251266       -3.713423       5.790000 
      20.282866       -3.750120       5.710000 
      20.313879       -3.693672       5.900000 
      20.344216       -3.659150       5.730000 
      20.375865       -3.624984       5.800000 
      20.406687       -3.576309       5.660000 
      20.438605       -3.497175       5.920000 
      20.469521       -3.411376       5.770000 
      20.499946       -3.405745       5.640000 
      20.531861       -3.484339       5.830000 
      20.562779       -3.486375       5.780000 
      20.593697       -3.433704       5.530000 
      20.623618       -3.373491       5.900000 
      20.655533       -3.379939       5.780000 
      20.687449       -3.458262       5.930000 
      20.717366       -3.550593       6.030000 
      20.747286       -3.618767       6.010000 
      20.778232       -3.628956       5.790000 
      20.809145       -3.558303       5.730000 
      20.841039       -3.480217       5.820000 
      20.872951       -3.475828       5.860000 
      20.902871       -3.455574       5.680000 
      20.934820       -3.443990       5.750000 
      20.965731       -3.468604       5.680000 
      20.995623       -3.529980       5.800000 
      21.026553       -3.587373       5.920000 
