Human trial picking the raspberry twin 

 time    ||     output     ||     loadcell

      0.000000       -799.016949       0.050000 
      0.015568       -799.016949       0.040000 
      0.046281       -799.016949       0.010000 
      0.077554       -799.016949       0.010000 
      0.108745       -799.016949       0.020000 
      0.125203       -799.016949       0.150000 
      0.141153       -799.016949       0.010000 
      0.156748       -799.016949       0.130000 
      0.172261       -799.016949       0.010000 
      0.187079       -799.016944       0.030000 
      0.202906       -799.015756       0.080000 
      0.217716       -798.908826       0.140000 
      0.232668       -795.367779       0.060000 
      0.248770       -752.228997       0.020000 
      0.264867       -558.894388       0.010000 
      0.280747       -240.139506       0.080000 
      0.295751       -46.804897       0.030000 
      0.326980       -3.666115       0.010000 
      0.343214       -0.125055       0.020000 
      0.358182       -0.017694       0.040000 
      0.375206       -0.011551       0.070000 
      0.390229       0.007252       0.060000 
      0.405871       0.022963       0.030000 
      0.421330       0.007695       0.000000 
      0.436403       -0.006147       0.020000 
      0.450736       0.007695       0.010000 
      0.467328       0.022963       0.080000 
      0.482637       0.007252       0.110000 
      0.498939       -0.011546       0.020000 
      0.514769       -0.016502       0.060000 
      0.530287       -0.016931       0.000000 
      0.545709       -0.016945       0.060000 
      0.559898       -0.016945       0.040000 
      0.576073       -0.016945       0.020000 
      0.592626       -0.016945       0.040000 
      0.608364       -0.016945       0.040000 
      0.623827       -0.016945       0.030000 
      0.639376       -0.016945       0.040000 
      0.653702       -0.016945       0.090000 
      0.668618       -0.016945       0.020000 
      0.684106       -0.016945       0.030000 
      0.700794       -0.016945       0.080000 
      0.715212       -0.016945       0.010000 
      0.731307       -0.016945       0.050000 
      0.746021       -0.016945       0.040000 
      0.761840       -0.016945       0.020000 
      0.778144       -0.016931       0.030000 
      0.793670       -0.016502       0.090000 
      0.808738       -0.011546       0.100000 
      0.824028       0.007252       0.030000 
      0.840623       0.022949       0.040000 
      0.855326       0.007252       0.100000 
      0.870327       -0.011546       0.020000 
      0.886975       -0.016502       0.030000 
      0.900934       -0.016931       0.010000 
      0.915720       -0.016945       0.000000 
      0.932683       -0.016945       0.070000 
      0.963078       -0.016945       0.040000 
      0.979033       -0.016945       0.050000 
      0.995021       -0.016945       0.040000 
      1.010200       -0.016945       0.130000 
      1.025789       -0.016945       0.040000 
      1.039892       -0.016945       0.080000 
      1.057086       -0.016945       0.020000 
      1.070674       -0.016945       0.030000 
      1.086857       -0.016945       0.010000 
      1.102252       -0.016945       0.040000 
      1.118194       -0.016945       0.100000 
      1.132369       -0.016945       0.030000 
      1.148309       -0.016945       0.100000 
      1.163435       -0.016945       0.120000 
      1.179745       -0.016945       0.130000 
      1.194908       -0.016945       0.090000 
      1.210516       -0.016945       0.010000 
      1.226029       -0.016945       0.050000 
      1.242200       -0.016945       0.110000 
      1.258200       -0.016945       0.080000 
      1.272249       -0.016945       0.090000 
      1.286905       -0.016945       0.050000 
      1.302967       -0.016945       0.010000 
      1.320028       -0.016945       0.120000 
      1.334774       -0.016945       0.110000 
      1.349820       -0.016931       0.030000 
      1.365052       -0.016502       0.070000 
      1.381325       -0.011532       0.040000 
      1.396738       0.007695       0.010000 
      1.411632       0.028348       0.070000 
      1.427684       0.031449       0.010000 
      1.443923       0.028348       0.000000 
      1.459904       0.007695       0.070000 
      1.475500       -0.011532       0.020000 
      1.490494       -0.016502       0.050000 
      1.507395       -0.016931       0.010000 
      1.522347       -0.016945       0.020000 
      1.537323       -0.016945       0.070000 
      1.553588       -0.016945       0.000000 
      1.567916       -0.016945       0.080000 
      1.584911       -0.016945       0.050000 
      1.600296       -0.016945       0.040000 
      1.615688       -0.016945       0.010000 
      1.631243       -0.016945       0.060000 
      1.647447       -0.016945       0.080000 
      1.663464       -0.016931       0.090000 
      1.678369       -0.016502       0.030000 
      1.693346       -0.011546       0.050000 
      1.708287       0.007252       0.010000 
      1.724065       0.022949       0.010000 
      1.741056       0.007252       0.010000 
      1.755854       -0.011546       0.030000 
      1.770366       -0.016502       0.030000 
      1.785779       -0.016918       0.120000 
      1.801742       -0.016502       0.010000 
      1.816334       -0.011546       0.040000 
      1.833379       0.007252       0.020000 
      1.848287       0.022949       0.020000 
      1.863341       0.007252       0.050000 
      1.878237       -0.011546       0.060000 
      1.894731       -0.016502       0.030000 
      1.910695       -0.016918       0.080000 
      1.926252       -0.016502       0.050000 
      1.942213       -0.011559       0.010000 
      1.958758       0.006822       0.020000 
      1.973711       0.017993       0.080000 
      1.989637       -0.011546       0.040000 
      2.004928       -0.027243       0.020000 
      2.020242       -0.000805       0.070000 
      2.036196       0.001866       0.080000 
      2.050824       -0.011989       0.100000 
      2.067760       -0.016515       0.000000 
      2.083403       -0.016932       0.050000 
      2.098395       -0.016945       0.040000 
      2.113135       -0.016945       0.000000 
      2.127866       -0.016931       0.010000 
      2.144930       -0.016502       0.040000 
      2.159053       -0.011546       0.000000 
      2.174676       0.007252       0.030000 
      2.191455       0.022949       0.010000 
      2.207257       0.007252       0.070000 
      2.223289       -0.011546       0.050000 
      2.238270       -0.016502       0.000000 
      2.254918       -0.016931       0.020000 
      2.272054       -0.016945       0.030000 
      2.286974       -0.016931       0.010000 
      2.301733       -0.016502       0.040000 
      2.318393       -0.011546       0.100000 
      2.333174       0.007252       0.110000 
      2.348414       0.022949       0.120000 
      2.363889       0.007252       0.000000 
      2.379270       -0.011546       0.030000 
      2.394021       -0.016502       0.070000 
      2.410399       -0.016931       0.020000 
      2.424679       -0.016945       0.030000 
      2.440872       -0.016945       0.010000 
      2.456235       -0.016945       0.020000 
      2.485636       -0.016945       0.030000 
      2.501652       -0.016945       0.100000 
      2.516238       -0.016945       0.020000 
      2.532593       -0.016945       0.090000 
      2.548626       -0.016945       0.040000 
      2.564786       -0.016945       0.050000 
      2.580315       -0.016945       0.010000 
      2.597278       -0.016945       0.070000 
      2.612579       -0.016945       0.010000 
      2.627359       -0.016945       0.050000 
      2.642337       -0.016945       0.080000 
      2.657170       -0.016945       0.070000 
      2.673649       -0.016945       0.020000 
      2.703737       -0.016945       0.060000 
      2.719785       -0.016945       0.050000 
      2.735784       -0.016945       0.030000 
      2.750184       -0.016945       0.000000 
      2.765814       -0.016945       0.060000 
      2.782693       -0.016945       0.130000 
      2.797830       -0.016945       0.010000 
      2.811767       -0.016945       0.140000 
      2.827996       -0.016945       0.040000 
      2.843524       -0.016945       0.050000 
      2.857689       -0.016945       0.030000 
      2.874531       -0.016945       0.030000 
      2.890555       -0.016945       0.070000 
      2.920696       -0.016945       0.080000 
      2.950744       -0.016945       0.010000 
      2.966382       -0.016945       0.020000 
      2.981540       -0.016945       0.030000 
      2.996044       -0.016931       0.040000 
      3.012417       -0.016502       0.040000 
      3.028357       -0.011546       0.110000 
      3.043489       0.007252       0.090000 
      3.058875       0.022949       0.080000 
      3.074225       0.007252       0.010000 
      3.090554       -0.011546       0.070000 
      3.105368       -0.016502       0.020000 
      3.120550       -0.016931       0.010000 
      3.137021       -0.016945       0.000000 
      3.152843       -0.016945       0.000000 
      3.166826       -0.016945       0.040000 
      3.183485       -0.016945       0.050000 
      3.198770       -0.016945       0.030000 
      3.214741       -0.016945       0.000000 
      3.229788       -0.016945       0.030000 
      3.245343       -0.016945       0.010000 
      3.262757       -0.016945       0.080000 
      3.278442       -0.016945       0.080000 
      3.308446       -0.016945       0.060000 
      3.324966       -0.016945       0.030000 
      3.340379       -0.016945       0.050000 
      3.355972       -0.016945       0.090000 
      3.371470       -0.016945       0.010000 
      3.387040       -0.016945       0.020000 
      3.402093       -0.016945       0.070000 
      3.417112       -0.016945       0.010000 
      3.432762       -0.016931       0.100000 
      3.448695       -0.016502       0.110000 
      3.463862       -0.011546       0.070000 
      3.479100       0.007252       0.020000 
      3.494368       0.022949       0.040000 
      3.509329       0.007252       0.100000 
      3.556261       -0.011546       0.050000 
      3.571565       -0.016502       0.020000 
      3.587737       -0.016931       0.040000 
      3.618379       -0.016945       0.030000 
      3.634657       -0.016945       0.090000 
      3.650464       -0.016931       0.000000 
      3.665763       -0.016502       0.010000 
      3.681226       -0.011546       0.060000 
      3.696362       0.007252       0.060000 
      3.711492       0.022949       0.010000 
      3.727509       0.007252       0.050000 
      3.743478       -0.011546       0.090000 
      3.759012       -0.016502       0.110000 
      3.774662       -0.016931       0.000000 
      3.788590       -0.016931       0.020000 
      3.804675       -0.016502       0.040000 
      3.820636       -0.011546       0.050000 
      3.835877       0.007266       0.030000 
      3.850157       0.023393       0.060000 
      3.865494       0.012651       0.100000 
      3.881682       0.012651       0.010000 
      3.896207       0.023393       0.100000 
      3.913173       0.007266       0.070000 
      3.928276       -0.011546       0.000000 
      3.944111       -0.016502       0.040000 
      3.960162       -0.016918       0.000000 
      3.974921       -0.016502       0.060000 
      3.989209       -0.011546       0.050000 
      4.005205       0.007252       0.100000 
      4.021947       0.022949       0.010000 
      4.038052       0.007252       0.040000 
      4.054021       -0.011546       0.030000 
      4.069778       -0.016502       0.020000 
      4.084759       -0.016931       0.030000 
      4.100878       -0.016945       0.020000 
      4.116017       -0.016945       0.050000 
      4.130980       -0.016945       0.010000 
      4.146302       -0.016945       0.000000 
      4.160619       -0.016945       0.110000 
      4.191984       -0.016945       0.010000 
      4.208104       -0.016945       0.100000 
      4.238001       -0.016945       0.020000 
      4.253685       -0.016945       0.000000 
      4.268865       -0.016945       0.010000 
      4.299846       -0.016945       0.040000 
      4.316430       -0.016945       0.040000 
      4.331220       -0.016945       0.050000 
      4.346294       -0.016945       0.090000 
      4.362800       -0.016945       0.120000 
      4.377320       -0.016945       0.010000 
      4.393200       -0.016945       0.030000 
      4.408566       -0.016945       0.050000 
      4.423705       -0.016945       0.100000 
      4.438656       -0.016945       0.080000 
      4.454010       -0.016945       0.030000 
      4.469461       -0.016945       0.060000 
      4.485634       -0.016945       0.050000 
      4.515048       -0.016945       0.040000 
      4.530972       -0.016945       0.050000 
      4.548005       -0.016945       0.010000 
      4.562262       -0.016945       0.050000 
      4.577258       -0.016945       0.080000 
      4.592221       -0.016945       0.060000 
      4.608176       -0.016945       0.040000 
      4.622182       -0.016945       0.020000 
      4.638174       -0.016945       0.070000 
      4.669796       -0.016945       0.010000 
      4.684824       -0.016945       0.060000 
      4.701496       -0.016945       0.070000 
      4.716064       -0.016945       0.100000 
      4.731836       -0.016945       0.080000 
      4.747735       -0.016945       0.140000 
      4.763005       -0.016945       0.060000 
      4.778966       -0.016945       0.020000 
      4.794535       -0.016945       0.030000 
      4.810467       -0.016945       0.020000 
      4.841325       -0.016945       0.040000 
      4.857280       -0.016945       0.080000 
      4.872212       -0.016945       0.070000 
      4.886026       -0.016945       0.020000 
      4.901950       -0.016945       0.060000 
      4.917908       -0.016945       0.030000 
      4.933029       -0.016945       0.020000 
      4.948663       -0.016945       0.010000 
      4.963654       -0.016945       0.130000 
      4.979982       -0.016945       0.040000 
      4.994427       -0.016945       0.020000 
      5.010393       -0.016945       0.010000 
      5.026529       -0.016945       0.010000 
      5.042889       -0.016945       0.030000 
      5.057788       -0.016945       0.020000 
      5.073553       -0.016945       0.040000 
      5.088979       -0.016945       0.000000 
      5.105136       -0.016945       0.010000 
      5.120806       -0.016945       0.030000 
      5.138679       -0.016945       0.090000 
      5.153771       -0.016945       0.030000 
      5.169377       -0.016945       0.010000 
      5.184159       -0.016945       0.030000 
      5.199535       -0.016945       0.110000 
      5.214229       -0.016945       0.080000 
      5.230059       -0.016945       0.120000 
      5.245828       -0.016945       0.050000 
      5.259984       -0.016945       0.060000 
      5.275383       -0.016945       0.000000 
      5.291506       -0.016945       0.100000 
      5.307256       -0.016945       0.040000 
      5.322471       -0.016931       0.020000 
      5.338422       -0.016502       0.080000 
      5.354482       -0.011546       0.010000 
      5.368780       0.007252       0.020000 
      5.384604       0.022949       0.080000 
      5.400115       0.007252       0.020000 
      5.415482       -0.011546       0.040000 
      5.432436       -0.016502       0.030000 
      5.446632       -0.016931       0.090000 
      5.461900       -0.016945       0.020000 
      5.492618       -0.016945       0.030000 
      5.508806       -0.016945       0.010000 
      5.524436       -0.016945       0.070000 
      5.540338       -0.016945       0.050000 
      5.555295       -0.016945       0.000000 
      5.571234       -0.016945       0.020000 
      5.585225       -0.016945       0.080000 
      5.600784       -0.016931       0.120000 
      5.616430       -0.016502       0.070000 
      5.632626       -0.011546       0.060000 
      5.647929       0.007252       0.000000 
      5.663565       0.022949       0.010000 
      5.679838       0.007252       0.070000 
      5.694121       -0.011546       0.100000 
      5.710007       -0.016502       0.050000 
      5.726070       -0.016931       0.070000 
      5.741984       -0.016945       0.040000 
      5.756977       -0.016945       0.030000 
      5.773850       -0.016945       0.040000 
      5.788902       -0.016945       0.070000 
      5.803916       -0.016945       0.000000 
      5.820441       -0.016945       0.000000 
      5.835888       -0.016945       0.000000 
      5.850935       -0.016945       0.120000 
      5.867008       -0.016945       0.030000 
      5.882738       -0.016945       0.050000 
      5.898802       -0.016945       0.030000 
      5.913172       -0.016945       0.050000 
      5.928718       -0.016945       0.030000 
      5.945063       -0.016945       0.080000 
      5.960055       -0.016945       0.010000 
      5.974209       -0.016945       0.050000 
      5.990041       -0.016945       0.060000 
      6.006387       -0.016945       0.040000 
      6.021711       -0.016945       0.060000 
      6.036183       -0.016945       0.090000 
      6.052976       -0.016945       0.060000 
      6.068663       -0.016945       0.100000 
      6.083869       -0.016945       0.070000 
      6.098151       -0.016945       0.080000 
      6.114878       -0.016945       0.050000 
      6.129380       -0.016945       0.100000 
      6.145863       -0.016945       0.130000 
      6.160968       -0.016945       0.110000 
      6.176224       -0.016945       0.040000 
      6.190822       -0.016931       0.020000 
      6.206358       -0.016502       0.030000 
      6.223305       -0.011546       0.070000 
      6.238341       0.007252       0.060000 
      6.255113       0.022949       0.080000 
      6.271162       0.007252       0.000000 
      6.285006       -0.011546       0.120000 
      6.300523       -0.016502       0.100000 
      6.317331       -0.016931       0.040000 
      6.332635       -0.016945       0.050000 
      6.347130       -0.016945       0.150000 
      6.363639       -0.016945       0.090000 
      6.409836       -0.016945       0.150000 
      6.426522       -0.016945       0.010000 
      6.456232       -0.016945       0.070000 
      6.472572       -0.016945       0.060000 
      6.487832       -0.016945       0.010000 
      6.502857       -0.016945       0.060000 
      6.519378       -0.016945       0.040000 
      6.535083       -0.016945       0.010000 
      6.549550       -0.016945       0.030000 
      6.566228       -0.016945       0.060000 
      6.581193       -0.016945       0.080000 
      6.595416       -0.016945       0.070000 
      6.611522       -0.016945       0.120000 
      6.626838       -0.016945       0.070000 
      6.642657       -0.016945       0.080000 
      6.673795       -0.016945       0.020000 
      6.689556       -0.016945       0.010000 
      6.704549       -0.016931       0.010000 
      6.719745       -0.016502       0.060000 
      6.735923       -0.011532       0.610000 
      6.751007       0.007695       1.160000 
      6.766210       0.028348       1.660000 
      6.783025       0.031449       1.670000 
      6.798153       0.028348       1.450000 
      6.812850       0.007695       1.000000 
      6.827872       -0.011532       0.690000 
      6.844784       -0.016502       1.350000 
      6.859717       -0.016931       2.010000 
      6.874973       -0.016945       1.950000 
      6.891769       -0.016945       1.800000 
      6.907546       -0.016945       2.220000 
      6.922794       -0.016945       2.520000 
      6.937654       -0.016945       2.670000 
      6.954359       -0.016945       3.280000 
      6.968667       -0.016945       3.890000 
      6.983862       -0.016945       4.690000 
      6.998924       -0.016945       5.400000 
      7.012954       -0.016945       4.490000 
      7.029324       -0.016945       0.700000 
      7.044062       -0.016945       0.390000 
      7.058736       -0.016945       0.180000 
      7.073020       -0.016945       1.520000 
      7.089988       -0.016945       2.350000 
      7.103656       -0.016945       3.730000 
      7.118654       -0.016945       9.010000 
      7.134841       -0.016945       13.330000 
      7.150145       -0.016945       18.350000 
      7.164613       -0.016945       28.760000 
      7.179858       -0.016945       33.900000 
      7.195221       -0.016931       44.860000 
      7.211668       -0.016488       51.360000 
      7.226813       -0.011076       66.870000 
      7.241804       0.013538       75.900000 
      7.257908       0.057972       85.670000 
      7.272090       0.096468       106.880000 
      7.288127       0.104662       118.080000 
      7.303814       0.105094       128.410000 
      7.320018       0.188137       147.440000 
      7.334917       0.368272       156.700000 
      7.349704       0.586625       177.850000 
      7.365195       0.735422       188.730000 
      7.380589       0.811724       199.820000 
      7.396152       0.888414       220.110000 
      7.411562       0.977696       228.920000 
      7.426543       1.054399       245.520000 
      7.442472       1.131105       253.590000 
      7.457763       1.284026       262.850000 
      7.473428       1.512165       285.660000 
      7.489240       1.681656       296.300000 
      7.505262       1.771912       313.710000 
      7.520697       1.896567       320.330000 
      7.536219       2.077796       325.270000 
      7.551501       2.333374       336.380000 
      7.568020       2.669197       344.930000 
      7.582522       2.967287       363.140000 
      7.598479       3.227921       371.590000 
      7.614136       3.530455       384.040000 
      7.628874       3.814283       388.460000 
      7.645721       3.952514       391.500000 
      7.660764       3.985298       396.070000 
      7.677736       4.041545       397.650000 
      7.693551       4.283583       398.810000 
      7.708623       4.682540       400.360000 
      7.723671       4.924981       401.230000 
      7.739134       4.985312       400.730000 
      7.754945       5.026552       396.790000 
      7.768948       5.137900       395.380000 
      7.784839       5.354873       393.650000 
      7.800574       5.640875       388.610000 
      7.817200       5.869944       385.470000 
      7.831792       5.982182       380.430000 
      7.848572       6.085784       381.800000 
      7.863901       6.282240       378.990000 
      7.879340       6.555646       319.740000 
      7.895748       6.819709       224.290000 
      7.910411       6.952822       20.030000 
      7.926221       6.980744       19.060000 
      7.941118       6.982987       13.200000 
      7.957866       6.983054       3.020000 
      7.972440       6.982987       2.090000 
      7.986868       6.980718       15.870000 
      8.002820       6.952004       7.730000 
      8.018852       6.811243       0.800000 
      8.034762       6.537824       6.130000 
      8.050102       6.357802       13.530000 
      8.065908       6.261368       4.860000 
      8.081806       5.329019       0.300000 
      8.097044       2.945749       8.330000 
      8.113524       0.732440       13.600000 
      8.129167       0.403777       10.900000 
      8.144723       1.162902       1.340000 
      8.159010       1.702702       4.180000 
      8.175027       1.875882       13.640000 
      8.189436       1.858251       9.980000 
      8.205969       1.656765       4.860000 
      8.221711       1.259924       6.610000 
      8.235827       0.767314       11.410000 
      8.252439       0.215270       8.640000 
      8.267427       -0.300152       4.100000 
      8.283381       -0.701140       6.680000 
      8.299036       -1.104239       10.440000 
      8.314594       -1.500441       10.790000 
      8.328854       -1.611873       3.320000 
      8.344200       -1.540206       3.370000 
      8.360866       -1.604519       9.900000 
      8.375828       -1.772396       9.590000 
      8.392360       -1.901258       6.120000 
      8.406746       -1.886245       4.080000 
      8.423590       -1.847066       7.250000 
      8.438754       -1.802923       8.990000 
      8.454602       -1.738595       5.760000 
      8.470022       -1.731287       4.050000 
      8.486122       -1.767567       8.450000 
      8.500937       -1.734401       10.600000 
      8.515927       -1.670349       5.590000 
      8.531259       -1.611158       4.600000 
      8.547028       -1.555664       6.330000 
      8.562063       -1.630070       10.760000 
      8.578656       -1.821831       8.620000 
      8.593560       -1.957210       5.010000 
      8.609402       -1.979639       6.910000 
      8.623420       -1.951872       9.570000 
      8.639103       -1.946541       7.670000 
      8.654365       -1.951910       5.170000 
      8.669683       -1.917375       6.800000 
      8.685008       -1.886936       9.100000 
      8.700614       -1.905690       9.040000 
      8.716387       -1.891777       4.570000 
      8.731791       -1.805734       4.870000 
      8.748188       -1.751953       9.020000 
      8.763009       -1.723160       8.400000 
      8.778348       -1.651551       4.710000 
      8.795227       -1.601705       5.590000 
      8.809887       -1.585148       7.720000 
      8.825350       -1.555955       8.110000 
      8.840771       -1.572634       6.020000 
      8.857355       -1.596195       6.430000 
      8.872659       -1.572217       8.420000 
      8.887783       -1.551428       8.050000 
      8.904920       -1.571265       6.220000 
      8.920282       -1.603448       5.920000 
      8.935218       -1.665781       8.880000 
      8.951452       -1.640185       9.140000 
      8.967690       -1.536740       6.070000 
      8.983588       -1.492351       5.900000 
      8.998057       -1.531824       8.510000 
      9.014681       -1.622341       8.360000 
      9.029988       -1.663098       6.930000 
      9.046075       -1.694562       5.850000 
      9.061499       -1.791764       7.030000 
      9.077054       -1.816431       7.830000 
      9.092299       -1.770808       6.580000 
      9.108375       -1.798536       5.670000 
      9.123364       -1.846040       7.290000 
      9.138925       -1.834427       8.220000 
      9.153959       -1.792721       6.630000 
      9.170312       -1.753310       5.970000 
      9.184649       -1.753310       6.510000 
      9.200202       -1.792748       8.420000 
      9.216575       -1.835300       7.890000 
      9.231601       -1.856369       6.670000 
      9.246338       -1.840685       6.840000 
      9.262765       -1.816918       7.950000 
      9.278246       -1.792331       7.780000 
      9.293493       -1.767152       6.700000 
      9.308875       -1.755165       6.920000 
      9.324817       -1.780581       7.900000 
      9.339869       -1.852839       7.390000 
      9.355860       -1.872882       6.480000 
      9.371933       -1.837155       7.010000 
      9.388403       -1.777924       7.910000 
      9.403502       -1.758736       7.920000 
      9.418062       -1.793661       6.220000 
      9.434862       -1.841599       6.350000 
      9.449851       -1.891405       7.900000 
      9.465019       -1.930330       7.720000 
      9.479716       -1.938027       6.770000 
      9.495978       -1.930817       6.490000 
      9.511283       -1.961795       7.350000 
      9.526952       -1.970668       8.060000 
      9.543087       -1.921458       6.850000 
      9.558641       -1.877051       6.320000 
      9.573965       -1.864051       7.630000 
      9.589129       -1.852881       8.120000 
      9.604794       -1.877051       7.660000 
      9.618923       -1.932615       6.620000 
      9.636069       -1.959040       6.950000 
      9.651198       -1.955926       8.000000 
      9.666549       -1.911532       7.490000 
      9.682547       -1.852854       6.530000 
      9.697775       -1.828670       6.910000 
      9.713556       -1.842472       7.520000 
      9.728790       -1.866778       7.040000 
      9.744248       -1.879181       6.580000 
      9.759333       -1.859151       7.040000 
      9.774454       -1.810648       7.540000 
      9.790121       -1.825112       7.630000 
      9.806021       -1.861283       6.590000 
      9.821442       -1.891431       6.610000 
      9.836716       -1.911505       7.780000 
      9.853409       -1.916474       7.610000 
      9.869179       -1.916032       6.700000 
      9.884958       -1.905690       6.770000 
      9.899431       -1.862695       7.790000 
      9.916281       -1.807131       7.610000 
      9.932666       -1.799517       7.040000 
      9.948103       -1.823700       6.940000 
      9.963473       -1.876138       7.420000 
      9.978869       -1.950097       7.480000 
      9.994948       -1.964812       6.880000 
      10.010276       -1.902646       6.650000 
      10.024995       -1.861770       7.440000 
      10.040152       -1.884261       7.670000 
      10.056078       -1.885078       6.930000 
      10.071111       -1.873520       6.760000 
      10.086718       -1.877897       6.960000 
      10.102340       -1.921457       7.600000 
      10.118515       -1.969781       7.220000 
      10.133370       -1.950983       6.820000 
      10.148382       -1.881993       7.130000 
      10.164302       -1.853297       7.530000 
      10.178296       -1.863608       7.250000 
      10.194838       -1.871235       6.950000 
      10.209765       -1.892735       6.880000 
      10.224852       -1.916931       7.510000 
      10.241554       -1.940685       7.460000 
      10.256024       -1.956383       6.910000 
      10.271889       -1.935743       6.980000 
      10.285905       -1.898134       7.310000 
      10.302134       -1.877051       7.560000 
      10.317307       -1.887376       7.150000 
      10.333063       -1.887805       7.030000 
      10.349212       -1.882450       7.390000 
      10.378980       -1.922344       7.070000 
      10.395134       -1.976080       6.870000 
      10.410541       -1.986006       7.330000 
      10.427404       -1.971181       7.520000 
      10.441373       -1.968510       7.280000 
      10.457228       -1.970765       6.810000 
      10.473968       -1.981466       6.980000 
      10.489051       -1.961795       7.480000 
      10.504225       -1.920059       7.280000 
      10.519836       -1.890090       6.920000 
      10.535309       -1.856411       7.110000 
      10.551367       -1.873534       7.430000 
      10.566103       -1.907033       7.280000 
      10.581442       -1.921927       6.980000 
      10.596632       -1.946944       7.240000 
      10.613416       -1.985979       7.480000 
      10.627557       -1.999404       7.430000 
      10.642846       -1.957282       7.060000 
      10.657958       -1.888305       7.090000 
      10.673967       -1.883349       7.430000 
      10.689494       -1.933085       7.360000 
      10.705553       -1.959054       7.160000 
      10.720401       -1.955953       7.030000 
      10.737196       -1.912432       7.270000 
      10.752678       -1.864108       7.350000 
      10.767859       -1.882853       7.190000 
      10.782077       -1.950110       7.100000 
      10.798069       -1.958527       7.290000 
      10.814192       -1.867208       7.500000 
      10.828405       -1.768109       7.130000 
      10.843843       -1.756952       7.020000 
      10.861046       -1.801731       7.300000 
      10.875582       -1.880594       7.410000 
      10.890898       -1.920487       7.060000 
      10.906660       -1.889966       6.970000 
      10.922675       -1.854225       7.070000 
      10.938915       -1.845156       7.480000 
      10.954857       -1.854222       7.340000 
      10.970558       -1.826358       7.070000 
      10.985558       -1.833599       7.100000 
      11.002709       -1.887295       7.320000 
      11.018704       -1.928570       7.210000 
      11.033966       -1.920904       7.040000 
      11.048034       -1.846527       7.120000 
      11.063025       -1.782450       7.300000 
      11.079969       -1.763622       7.120000 
      11.095565       -1.742553       7.030000 
      11.111422       -1.734526       7.010000 
      11.127063       -1.783323       7.370000 
      11.142506       -1.885992       7.360000 
      11.157904       -1.963456       7.030000 
      11.173772       -1.949627       7.030000 
      11.188607       -1.871195       7.210000 
      11.203810       -1.805345       7.290000 
      11.218194       -1.789206       7.160000 
      11.234407       -1.846595       7.110000 
      11.250182       -1.916432       7.260000 
      11.266151       -1.916045       7.390000 
      11.281656       -1.906177       7.170000 
      11.296548       -1.933058       7.040000 
      11.313462       -1.935313       7.210000 
      11.328724       -1.916502       7.300000 
      11.342807       -1.893164       7.280000 
      11.358541       -1.876621       6.990000 
      11.374042       -1.887335       7.040000 
      11.390819       -1.886906       7.400000 
      11.405934       -1.871209       7.330000 
      11.421169       -1.868550       7.030000 
      11.437252       -1.872068       7.200000 
      11.452332       -1.896790       7.320000 
      11.468695       -1.924018       7.170000 
      11.483672       -1.896303       7.020000 
      11.498997       -1.801678       7.250000 
      11.515117       -1.739468       7.450000 
      11.529780       -1.742982       7.210000 
      11.546508       -1.763608       7.070000 
      11.561700       -1.781510       7.080000 
      11.577499       -1.833957       7.340000 
      11.593322       -1.850953       7.290000 
      11.608809       -1.753324       7.000000 
      11.624726       -1.695548       7.090000 
      11.640226       -1.799490       7.270000 
      11.654985       -1.934370       7.290000 
      11.670027       -1.973838       7.140000 
      11.685998       -1.946031       7.300000 
      11.700635       -1.922317       7.310000 
      11.715830       -1.911559       7.290000 
      11.731146       -1.887349       7.090000 
      11.747373       -1.852424       7.190000 
      11.762538       -1.847884       7.240000 
      11.777885       -1.868108       7.250000 
      11.793010       -1.890006       7.220000 
      11.810046       -1.907988       7.100000 
      11.824582       -1.895835       7.170000 
      11.838852       -1.897703       7.260000 
      11.854827       -1.911962       7.210000 
      11.870420       -1.916058       7.190000 
      11.885557       -1.911089       7.200000 
      11.901789       -1.887348       7.270000 
      11.916756       -1.852827       7.120000 
      11.932895       -1.851954       7.020000 
      11.947228       -1.876094       7.150000 
      11.963774       -1.856853       7.410000 
      11.979003       -1.806674       7.310000 
      11.994767       -1.799477       7.130000 
      12.010727       -1.822814       7.110000 
      12.026257       -1.865353       7.180000 
      12.040517       -1.902120       7.200000 
      12.055949       -1.889563       7.160000 
      12.072070       -1.868537       7.240000 
      12.087748       -1.853270       7.190000 
      12.103027       -1.876164       7.210000 
      12.118242       -1.921374       7.070000 
      12.133677       -1.905260       7.180000 
      12.147891       -1.852397       7.280000 
      12.163932       -1.829086       7.280000 
      12.179606       -1.847454       7.210000 
      12.195087       -1.886449       7.250000 
      12.209513       -1.905260       7.260000 
      12.225539       -1.887322       7.180000 
      12.241397       -1.857783       7.190000 
      12.256653       -1.871208       7.200000 
      12.272458       -1.897620       7.060000 
      12.286419       -1.870309       7.060000 
      12.302575       -1.846555       7.280000 
      12.317467       -1.833985       7.150000 
      12.332493       -1.807117       7.070000 
      12.348955       -1.827757       7.300000 
      12.363646       -1.876537       7.230000 
      12.379922       -1.886462       7.190000 
      12.397130       -1.876594       7.140000 
      12.411606       -1.893150       7.160000 
      12.427741       -1.916004       7.290000 
      12.441616       -1.928088       7.270000 
      12.457660       -1.885519       7.300000 
      12.473590       -1.748784       7.370000 
      12.488174       -1.646281       7.150000 
      12.505189       -1.703048       7.060000 
      12.521455       -1.807085       7.080000 
      12.538946       -1.807905       7.250000 
      12.551528       -1.778436       7.190000 
      12.566788       -1.772940       7.140000 
      12.581628       -1.797274       7.200000 
      12.597373       -1.829888       7.160000 
      12.613283       -1.826813       7.110000 
      12.628873       -1.777480       7.140000 
      12.644484       -1.763638       7.270000 
      12.658858       -1.811559       7.250000 
      12.674264       -1.846041       7.150000 
      12.690725       -1.821471       7.180000 
      12.705882       -1.802134       7.140000 
      12.720884       -1.820143       7.230000 
      12.737436       -1.850125       7.240000 
      12.752670       -1.907975       7.270000 
      12.768260       -1.935272       7.270000 
      12.784963       -1.940228       7.220000 
      12.800957       -1.932132       7.300000 
      12.816097       -1.889146       7.150000 
      12.831507       -1.833985       7.230000 
      12.846028       -1.764565       7.330000 
      12.861699       -1.767209       7.280000 
      12.878227       -1.848326       7.140000 
      12.893697       -1.872466       7.150000 
      12.908044       -1.837155       7.450000 
      12.925069       -1.778367       7.290000 
      12.939496       -1.764121       7.100000 
      12.956853       -1.817375       7.240000 
      12.972408       -1.874764       7.290000 
      12.986837       -1.875180       7.200000 
      13.002838       -1.822290       7.080000 
      13.018427       -1.781563       7.300000 
      13.032959       -1.777021       7.440000 
      13.048667       -1.739425       7.150000 
      13.064577       -1.702661       7.110000 
      13.079066       -1.773923       7.120000 
      13.096016       -1.864382       7.340000 
      13.126256       -1.873824       7.190000 
      13.141611       -1.815562       7.100000 
      13.157544       -1.742082       7.440000 
      13.172383       -1.676206       7.350000 
      13.188530       -1.654294       7.020000 
      13.204487       -1.747454       6.960000 
      13.219427       -1.861268       7.310000 
      13.233400       -1.882364       7.260000 
      13.249365       -1.862212       7.090000 
      13.263853       -1.823686       7.080000 
      13.279461       -1.812946       7.250000 
      13.295958       -1.867651       7.400000 
      13.311205       -1.919115       7.120000 
      13.326572       -1.907975       7.160000 
      13.340835       -1.866242       7.290000 
      13.356050       -1.891391       7.320000 
      13.372582       -1.905203       7.160000 
      13.387833       -1.816985       7.010000 
      13.403887       -1.730043       7.300000 
      13.418665       -1.759609       7.330000 
      13.434931       -1.851923       7.280000 
      13.449142       -1.904777       7.070000 
      13.464576       -1.915131       7.160000 
      13.481192       -1.906079       7.250000 
      13.496255       -1.867194       7.300000 
      13.512367       -1.820046       7.210000 
      13.527730       -1.784275       7.120000 
      13.543539       -1.727285       7.190000 
      13.558721       -1.715715       7.350000 
      13.572717       -1.777508       7.190000 
      13.588943       -1.875677       7.170000 
      13.604738       -1.926759       7.340000 
      13.620228       -1.929904       7.380000 
      13.635661       -1.961338       7.070000 
      13.650965       -1.965711       7.010000 
      13.666620       -1.902659       7.150000 
      13.681441       -1.861314       7.360000 
      13.697293       -1.878419       7.230000 
      13.712609       -1.855468       7.170000 
      13.727965       -1.808972       7.100000 
      13.743043       -1.807976       7.180000 
      13.758696       -1.862681       7.180000 
      13.775808       -1.904334       7.070000 
      13.790673       -1.898921       7.350000 
      13.806046       -1.832186       7.380000 
      13.821677       -1.732227       7.130000 
      13.836239       -1.686561       7.120000 
      13.851823       -1.708017       7.140000 
      13.866966       -1.786476       7.270000 
      13.883793       -1.845585       7.230000 
      13.898753       -1.840685       7.020000 
      13.914265       -1.827743       7.200000 
      13.929587       -1.842471       7.390000 
      13.944817       -1.867624       7.250000 
      13.961709       -1.888650       7.170000 
      13.976420       -1.891334       7.200000 
      13.992877       -1.817401       7.250000 
      14.007086       -1.748398       7.300000 
      14.022986       -1.774380       7.170000 
      14.039548       -1.824529       7.090000 
      14.055119       -1.826384       7.280000 
      14.070367       -1.777910       7.320000 
      14.085380       -1.769050       7.220000 
      14.101346       -1.836173       7.250000 
      14.116660       -1.890461       7.270000 
      14.130814       -1.859483       7.230000 
      14.147580       -1.803506       7.250000 
      14.163622       -1.777037       7.160000 
      14.179553       -1.781533       7.250000 
      14.195420       -1.757753       7.330000 
      14.211475       -1.712529       7.220000 
      14.226013       -1.729046       7.140000 
      14.241704       -1.786005       7.240000 
      14.256680       -1.818203       7.260000 
      14.272584       -1.777936       7.270000 
      14.286778       -1.691863       7.140000 
      14.302503       -1.686091       7.110000 
      14.318588       -1.742068       7.220000 
      14.334576       -1.805247       7.190000 
      14.349835       -1.831272       7.150000 
      14.365658       -1.814176       7.200000 
      14.380318       -1.789191       7.220000 
      14.395934       -1.751025       7.180000 
      14.412730       -1.750182       7.190000 
      14.427372       -1.776581       7.230000 
      14.443606       -1.829001       7.260000 
      14.458796       -1.836614       7.200000 
      14.474835       -1.749655       7.160000 
      14.490318       -1.685204       7.140000 
      14.504478       -1.673398       7.250000 
      14.520426       -1.696441       7.270000 
      14.536949       -1.720419       7.250000 
      14.551994       -1.694630       7.230000 
      14.568131       -1.670727       7.130000 
      14.582171       -1.740353       7.270000 
      14.597000       -1.798422       7.240000 
      14.612664       -1.811628       7.160000 
      14.628673       -1.790839       7.240000 
      14.642959       -1.773533       7.220000 
      14.658969       -1.772511       7.250000 
      14.675218       -1.797274       7.180000 
      14.691200       -1.830330       7.200000 
      14.707061       -1.832185       7.210000 
      14.722147       -1.800777       7.200000 
      14.737440       -1.792277       7.170000 
      14.753425       -1.781466       7.080000 
      14.768324       -1.740296       7.210000 
      14.783373       -1.688236       7.220000 
      14.799417       -1.634539       7.220000 
      14.815381       -1.638043       7.100000 
      14.830521       -1.713387       7.120000 
      14.844595       -1.772425       7.230000 
      14.860550       -1.770697       7.290000 
      14.877510       -1.689120       7.190000 
      14.893503       -1.594561       7.300000 
      14.907620       -1.522470       7.270000 
      14.923561       -1.551995       7.210000 
      14.937917       -1.694063       7.290000 
      14.954050       -1.766166       7.320000 
      14.969775       -1.755442       7.140000 
      14.985906       -1.697637       7.190000 
      15.001970       -1.650138       7.210000 
      15.018078       -1.630885       7.270000 
      15.031723       -1.586034       7.260000 
      15.046902       -1.603560       7.240000 
      15.062323       -1.652326       7.130000 
      15.076307       -1.664909       7.170000 
      15.092263       -1.667141       7.170000 
      15.106737       -1.659509       7.160000 
      15.123419       -1.627660       7.250000 
      15.138042       -1.557394       7.220000 
      15.154842       -1.527285       7.190000 
      15.169320       -1.542596       7.240000 
      15.186932       -1.569853       7.260000 
      15.200947       -1.681992       7.170000 
      15.216370       -1.748198       7.150000 
      15.231725       -1.692290       7.250000 
      15.247805       -1.634435       7.270000 
      15.263707       -1.694102       7.160000 
      15.279991       -1.750897       7.200000 
      15.295578       -1.627784       7.220000 
      15.311978       -1.533631       7.230000 
      15.326546       -1.636700       7.180000 
      15.342928       -1.731655       7.150000 
      15.358704       -1.725001       7.080000 
      15.373574       -1.652773       7.150000 
      15.387840       -1.612488       7.060000 
      15.403290       -1.632642       7.100000 
      15.418532       -1.624529       7.190000 
      15.433642       -1.568135       7.190000 
      15.448706       -1.514302       7.180000 
      15.463892       -1.540354       7.190000 
      15.479344       -1.641155       7.220000 
      15.496070       -1.739258       7.240000 
      15.510540       -1.749157       7.190000 
      15.526442       -1.689080       7.270000 
      15.543048       -1.614757       7.270000 
      15.558441       -1.538942       7.190000 
      15.572387       -1.544424       7.170000 
      15.587345       -1.624959       7.170000 
      15.603064       -1.661335       7.130000 
      15.618066       -1.607077       7.210000 
      15.634177       -1.599077       7.170000 
      15.650159       -1.681923       7.190000 
      15.666302       -1.739339       7.200000 
      15.680290       -1.711076       7.240000 
      15.695008       -1.663638       7.190000 
      15.711748       -1.677923       7.120000 
      15.726032       -1.732172       7.140000 
      15.742094       -1.752755       7.180000 
      15.757168       -1.720917       7.280000 
      15.773322       -1.622787       7.170000 
      15.788981       -1.542999       7.200000 
      15.804998       -1.544367       7.220000 
      15.820964       -1.555481       7.210000 
      15.834769       -1.543481       7.280000 
      15.849783       -1.532134       7.230000 
      15.880921       -1.572217       7.180000 
      15.895803       -1.615463       7.070000 
      15.911557       -1.599559       7.100000 
      15.925708       -1.594037       7.270000 
      15.941635       -1.669878       7.290000 
      15.956950       -1.679194       7.280000 
      15.973037       -1.656453       7.210000 
      15.987205       -1.663098       7.200000 
      16.003239       -1.660437       7.130000 
      16.019264       -1.643924       7.110000 
      16.034706       -1.632617       7.190000 
      16.050823       -1.678462       7.250000 
      16.066107       -1.749101       7.190000 
      16.081698       -1.770750       7.200000 
      16.096731       -1.714163       7.200000 
      16.112348       -1.649282       7.160000 
      16.128806       -1.602135       7.210000 
      16.143332       -1.592372       7.260000 
      16.158859       -1.583279       7.180000 
      16.174331       -1.563208       7.090000 
      16.189889       -1.600778       7.230000 
      16.205320       -1.661281       7.190000 
      16.221107       -1.629444       7.240000 
      16.235934       -1.557366       7.170000 
      16.251496       -1.524560       7.130000 
      16.267502       -1.528213       7.150000 
      16.284424       -1.564910       7.150000 
      16.299077       -1.591348       7.240000 
      16.315822       -1.541572       7.240000 
      16.331584       -1.492832       7.240000 
      16.346471       -1.513319       7.250000 
      16.362931       -1.538122       7.240000 
      16.376904       -1.550985       7.220000 
      16.393233       -1.599988       7.210000 
      16.408189       -1.663443       7.240000 
      16.424128       -1.721456       7.230000 
      16.437907       -1.697952       7.250000 
      16.454497       -1.624225       7.220000 
      16.468760       -1.563100       7.210000 
      16.485050       -1.578972       7.150000 
      16.499559       -1.626248       7.140000 
      16.514906       -1.641667       7.270000 
      16.531280       -1.638360       7.210000 
      16.546237       -1.623699       7.210000 
      16.562218       -1.551025       7.210000 
      16.576158       -1.515688       7.230000 
      16.593271       -1.552854       7.170000 
      16.608334       -1.624541       7.230000 
      16.623342       -1.648299       7.230000 
      16.638466       -1.614246       7.200000 
      16.654772       -1.637974       7.170000 
      16.670356       -1.645114       7.220000 
      16.685945       -1.582875       7.200000 
      16.700855       -1.486008       7.260000 
      16.716186       -1.384803       7.200000 
      16.731602       -1.419258       7.260000 
      16.747491       -1.542927       7.250000 
      16.761783       -1.595777       7.240000 
      16.776865       -1.577036       7.170000 
      16.793856       -1.503007       7.290000 
      16.809541       -1.474933       7.310000 
      16.825515       -1.542512       7.250000 
      16.840460       -1.621817       7.190000 
      16.856599       -1.644325       7.240000 
      16.870561       -1.654944       7.310000 
      16.886618       -1.634953       7.250000 
      16.901891       -1.589511       7.180000 
      16.918403       -1.620212       7.290000 
      16.933013       -1.642344       7.260000 
      16.947191       -1.609856       7.180000 
      16.963792       -1.545563       7.250000 
      16.979762       -1.566321       7.240000 
      16.995720       -1.570182       7.140000 
      17.009898       -1.446622       7.080000 
      17.026191       -1.336356       7.180000 
      17.041279       -1.366378       7.240000 
      17.057853       -1.487805       7.160000 
      17.071810       -1.603447       7.270000 
      17.086773       -1.662999       7.180000 
      17.102180       -1.626316       7.280000 
      17.117963       -1.537142       7.280000 
      17.134417       -1.510275       7.170000 
      17.149393       -1.541612       7.190000 
      17.165147       -1.575221       7.230000 
      17.179467       -1.556826       7.140000 
      17.194768       -1.506687       7.130000 
      17.210274       -1.499946       7.270000 
      17.227255       -1.529059       7.180000 
      17.242242       -1.598965       7.200000 
      17.257068       -1.672438       7.180000 
      17.273670       -1.599361       7.170000 
      17.288943       -1.405886       7.250000 
      17.303436       -1.333189       7.210000 
      17.320559       -1.473547       7.200000 
      17.336424       -1.630658       7.250000 
      17.351882       -1.610188       7.280000 
      17.366976       -1.475199       7.130000 
      17.382874       -1.437280       7.190000 
      17.397898       -1.463539       7.250000 
      17.413434       -1.507656       7.110000 
      17.429429       -1.584084       7.190000 
      17.445164       -1.635741       7.220000 
      17.460477       -1.584150       7.170000 
      17.489941       -1.509818       7.210000 
      17.507007       -1.488762       7.060000 
      17.523225       -1.536669       7.150000 
      17.538865       -1.577923       7.160000 
      17.554750       -1.572966       7.190000 
      17.569976       -1.578352       7.190000 
      17.585268       -1.541599       7.250000 
      17.599932       -1.506700       7.170000 
      17.615387       -1.515590       7.130000 
      17.630833       -1.530401       7.200000 
      17.646539       -1.579720       7.160000 
      17.661789       -1.581396       7.140000 
      17.678100       -1.486962       7.210000 
      17.694023       -1.442556       7.230000 
      17.709161       -1.474793       7.140000 
      17.723614       -1.471249       7.110000 
      17.738782       -1.481994       7.190000 
      17.755069       -1.533085       7.270000 
      17.769471       -1.560423       7.340000 
      17.785222       -1.573466       7.110000 
      17.801852       -1.600764       7.240000 
      17.818215       -1.650540       7.300000 
      17.833230       -1.645584       7.150000 
      17.847329       -1.576593       7.180000 
      17.863817       -1.533989       7.300000 
      17.879820       -1.540725       7.320000 
      17.894448       -1.540656       7.260000 
      17.910722       -1.468108       7.250000 
      17.926523       -1.397235       7.290000 
      17.943573       -1.419700       7.250000 
      17.959507       -1.449625       7.200000 
      17.973267       -1.437612       7.200000 
      17.989474       -1.407090       7.220000 
      18.003858       -1.423270       7.180000 
      18.020371       -1.463581       7.130000 
      18.035241       -1.500361       7.210000 
      18.051390       -1.556356       7.250000 
      18.066378       -1.575180       7.220000 
      18.082972       -1.540672       7.160000 
      18.098133       -1.497677       7.320000 
      18.113247       -1.466266       7.240000 
      18.130270       -1.438995       7.240000 
      18.146307       -1.408447       7.250000 
      18.161500       -1.439012       7.170000 
      18.176359       -1.530344       7.200000 
      18.192651       -1.590918       7.130000 
      18.206741       -1.571141       7.190000 
      18.223465       -1.562254       7.160000 
      18.238377       -1.599807       7.170000 
      18.254580       -1.585062       7.150000 
      18.269512       -1.471195       7.150000 
      18.283797       -1.369924       7.300000 
      18.299927       -1.353337       7.320000 
      18.315743       -1.377021       7.230000 
      18.330122       -1.367665       7.160000 
      18.345970       -1.355485       7.210000 
      18.360613       -1.383818       7.210000 
      18.376899       -1.385923       7.190000 
      18.393086       -1.383419       7.260000 
      18.408083       -1.415077       7.230000 
      18.424030       -1.448379       7.240000 
      18.440022       -1.426331       7.260000 
      18.456432       -1.438555       7.160000 
      18.471443       -1.506563       7.040000 
      18.488899       -1.550553       7.200000 
      18.503079       -1.540189       7.300000 
      18.518803       -1.515615       7.170000 
      18.535750       -1.477477       7.180000 
      18.550476       -1.411188       7.290000 
      18.566752       -1.413030       7.190000 
      18.580797       -1.546470       7.170000 
      18.596892       -1.624916       7.120000 
      18.612425       -1.571569       7.230000 
      18.642694       -1.512917       7.190000 
      18.659507       -1.432586       7.130000 
      18.674690       -1.344935       7.110000 
      18.691117       -1.338943       7.080000 
      18.706713       -1.414314       7.120000 
      18.722605       -1.483681       7.210000 
      18.738324       -1.525013       7.140000 
      18.753453       -1.501110       7.160000 
      18.767627       -1.437682       7.180000 
      18.782525       -1.421415       7.180000 
      18.799469       -1.431328       7.110000 
      18.813654       -1.420143       7.130000 
      18.830312       -1.486892       7.170000 
      18.846246       -1.537944       7.260000 
      18.861769       -1.507988       7.240000 
      18.876087       -1.513764       7.180000 
      18.892586       -1.505676       7.170000 
      18.906930       -1.464507       7.130000 
      18.923754       -1.409788       7.070000 
      18.939333       -1.343871       7.110000 
      18.955492       -1.367722       7.290000 
      18.970246       -1.454054       7.230000 
      18.984868       -1.437098       7.040000 
      19.000924       -1.331358       7.130000 
      19.016236       -1.334928       7.180000 
      19.032781       -1.398546       7.090000 
      19.047956       -1.418730       7.050000 
      19.063948       -1.437102       7.240000 
      19.078160       -1.430343       7.270000 
      19.094676       -1.392747       7.150000 
      19.110386       -1.358199       7.120000 
      19.125346       -1.370348       7.070000 
      19.140339       -1.387279       7.140000 
      19.156296       -1.327770       7.070000 
      19.172089       -1.296805       7.080000 
      19.188353       -1.355068       7.190000 
      19.201578       -1.384204       7.210000 
      19.216812       -1.392279       7.230000 
      19.232838       -1.398160       7.250000 
      19.248130       -1.421375       7.210000 
      19.263773       -1.469493       7.170000 
      19.278929       -1.511905       7.080000 
      19.295175       -1.544782       7.130000 
      19.311002       -1.504765       7.200000 
      19.326605       -1.508099       7.280000 
      19.341596       -1.548257       7.080000 
      19.357649       -1.551967       7.220000 
      19.372887       -1.581080       7.270000 
      19.389428       -1.640641       7.220000 
      19.403967       -1.627229       7.150000 
      19.435461       -1.571225       7.200000 
      19.451477       -1.592291       7.200000 
      19.466136       -1.611489       7.110000 
      19.481530       -1.551524       7.210000 
      19.497738       -1.512503       7.150000 
      19.513344       -1.534415       7.140000 
      19.528232       -1.546138       7.140000 
      19.543941       -1.565326       7.220000 
      19.560228       -1.577895       7.160000 
      19.575918       -1.543356       7.220000 
      19.590983       -1.507961       7.180000 
      19.606096       -1.441586       7.130000 
      19.621497       -1.376688       7.230000 
      19.637538       -1.341184       7.250000 
      19.653280       -1.324228       7.280000 
      19.668541       -1.406204       7.260000 
      19.683427       -1.525803       7.190000 
      19.698419       -1.522715       7.140000 
      19.713492       -1.451927       7.220000 
      19.729340       -1.405332       7.190000 
      19.744958       -1.408043       7.160000 
      19.759814       -1.468551       7.140000 
      19.775082       -1.535260       7.130000 
      19.791221       -1.579250       7.160000 
      19.806883       -1.570211       7.150000 
      19.822282       -1.498107       7.140000 
      19.837624       -1.441696       7.230000 
      19.852642       -1.453710       7.110000 
      19.868812       -1.444797       7.130000 
      19.884831       -1.449753       7.200000 
      19.898757       -1.543786       7.170000 
      19.913557       -1.575194       7.220000 
      19.930175       -1.553711       7.250000 
      19.945622       -1.554571       7.090000 
      19.961006       -1.520045       7.160000 
      19.975192       -1.496804       7.220000 
      19.990550       -1.476510       7.200000 
      20.022890       -1.416542       7.180000 
      20.038962       -1.353271       7.210000 
      20.054574       -1.328253       7.290000 
      20.068767       -1.337556       7.210000 
      20.085182       -1.349296       7.130000 
      20.100891       -1.379265       7.160000 
      20.115191       -1.442927       7.130000 
      20.130625       -1.435743       7.140000 
      20.147257       -1.411590       7.130000 
      20.163378       -1.438484       7.270000 
      20.178149       -1.455454       7.220000 
      20.193736       -1.448437       7.190000 
      20.209028       -1.451401       7.230000 
      20.224306       -1.494145       7.270000 
      20.239848       -1.532934       7.230000 
      20.255013       -1.545653       7.150000 
      20.270637       -1.473769       7.100000 
      20.286700       -1.355178       7.180000 
      20.302421       -1.274368       7.270000 
      20.318529       -1.303627       7.170000 
      20.334445       -1.366210       7.130000 
      20.348636       -1.367691       7.210000 
      20.365037       -1.367182       7.190000 
      20.380561       -1.444313       7.110000 
      20.395597       -1.529444       7.130000 
      20.410167       -1.574294       7.240000 
      20.426530       -1.556812       7.160000 
      20.442566       -1.507089       7.120000 
      20.457719       -1.503963       7.110000 
      20.473284       -1.535340       7.140000 
      20.489387       -1.546484       7.220000 
      20.505148       -1.503062       7.120000 
      20.520404       -1.484624       7.230000 
      20.535497       -1.512444       7.210000 
      20.551187       -1.449626       7.260000 
      20.566749       -1.344907       7.200000 
      20.582729       -1.320991       7.280000 
      20.598264       -1.403156       7.250000 
      20.613537       -1.513247       7.210000 
      20.628848       -1.541556       7.210000 
      20.644658       -1.484127       7.210000 
      20.659860       -1.466750       7.190000 
      20.675226       -1.436559       7.180000 
      20.691096       -1.332780       7.150000 
      20.706983       -1.268539       7.190000 
      20.722405       -1.296403       7.240000 
      20.736710       -1.344284       7.100000 
      20.753509       -1.401716       7.170000 
      20.768510       -1.406523       7.170000 
      20.783356       -1.386048       7.210000 
      20.798329       -1.405637       7.240000 
      20.814728       -1.390932       7.140000 
      20.830309       -1.296359       7.160000 
      20.845488       -1.222886       7.180000 
      20.861410       -1.254670       7.140000 
      20.876011       -1.403957       7.170000 
      20.891013       -1.503749       7.220000 
      20.905849       -1.420504       7.200000 
      20.920617       -1.330847       7.140000 
      20.937263       -1.343853       7.280000 
      20.951579       -1.296289       7.250000 
      20.967916       -1.204114       7.080000 
      20.983639       -1.214706       7.120000 
      20.998657       -1.308498       7.180000 
      21.012707       -1.378725       7.220000 
