

 time    ||    gripping force   ||   raspberry measurement 

      0       0.110000       -794.923077 
      0       0.010000       -794.923077 
      0       0.400000       -794.923077 
      0       0.200000       -794.923077 
      0       0.030000       -794.923077 
      0       0.070000       -794.923077 
      1       0.020000       -786.973846 
      1       0.050000       -779.104108 
      1       0.200000       -771.313067 
      1       0.230000       -763.599931 
      1       0.250000       -755.962765 
      2       0.060000       -748.298071 
      2       0.150000       -744.783602 
      2       0.140000       -701.968336 
      2       0.390000       -510.080608 
      2       0.340000       -193.701012 
      2       2.350000       -1.807499 
      2       11.980000       40.972425 
      2       26.880000       44.447860 
      2       47.150000       44.550873 
      2       56.630000       44.573091 
      2       75.320000       44.604464 
      2       97.040000       44.588780 
      2       129.500000       44.554728 
      2       156.070000       44.552044 
      3       167.860000       44.573096 
      3       163.810000       44.604463 
      3       162.630000       44.588740 
      3       162.100000       44.553400 
      3       161.280000       44.535982 
      3       159.670000       44.505072 
      3       152.800000       44.543326 
      3       150.400000       44.816303 
      3       148.320000       45.233626 
      4       130.120000       45.483474 
      4       127.900000       45.640652 
      5       124.010000       46.027656 
      5       116.330000       46.698748 
      5       115.010000       47.478340 
      5       113.680000       48.107176 
      5       111.130000       48.434169 
      5       109.200000       48.528360 
      5       108.350000       48.542437 
      5       107.710000       48.518624 
      5       107.590000       48.401679 
      5       106.900000       48.142990 
      6       106.410000       47.877265 
      6       104.930000       47.709047 
      6       102.330000       47.607301 
      6       101.880000       47.554756 
      6       101.930000       47.534516 
      6       101.790000       47.482883 
      6       101.830000       47.392782 
      6       101.500000       47.282467 
      6       101.000000       47.130017 
      7       94.100000       46.941826 
      7       93.460000       46.822046 
      7       90.050000       46.798277 
      7       89.660000       46.791478 
      7       89.500000       46.774425 
      8       89.560000       46.695065 
      8       89.550000       46.620246 
      8       89.430000       46.622474 
      8       89.500000       46.638544 
      8       89.290000       46.644872 
      8       89.180000       46.643003 
      8       88.970000       46.634543 
      9       76.250000       46.595509 
      9       76.610000       46.565526 
      9       76.570000       46.594622 
      9       76.690000       46.623718 
      9       76.960000       46.593736 
      9       77.070000       46.554688 
      9       77.090000       46.545785 
      9       77.150000       46.538531 
      9       77.260000       46.521145 
      10       77.340000       46.504009 
      10       77.280000       46.521144 
      10       77.410000       46.538476 
      10       77.380000       46.543931 
      10       77.390000       46.530418 
      10       77.430000       46.464042 
      10       77.390000       46.311304 
      10       77.440000       46.205946 
      10       77.450000       46.221630 
      10       77.500000       46.263685 
      10       77.520000       46.367283 
      10       77.420000       46.441076 
      11       77.590000       46.358310 
      11       77.550000       46.237720 
      11       77.520000       46.247654 
      11       77.510000       46.343859 
      11       77.600000       46.378050 
      11       77.530000       46.345621 
      11       77.540000       46.312174 
      11       77.540000       46.248347 
      11       77.590000       46.212742 
      11       77.600000       46.218751 
      12       77.610000       46.242294 
      12       77.520000       46.253303 
      12       77.600000       46.301876 
      12       77.480000       46.362244 
      12       77.590000       46.403537 
      12       77.550000       46.387410 
      12       77.560000       46.338074 
      12       77.580000       46.273637 
      12       77.570000       46.224690 
      12       77.560000       46.278123 
      12       77.580000       46.351016 
      12       77.560000       46.373108 
      12       77.640000       46.319666 
      13       77.540000       46.270965 
      13       77.580000       46.296382 
      13       77.510000       46.339512 
      13       77.610000       46.361801 
      13       77.540000       46.360555 
      13       77.610000       46.322376 
      13       77.580000       46.297364 
      13       77.610000       46.279368 
      13       77.500000       46.294179 
      13       77.540000       46.304464 
      13       77.520000       46.267684 
      13       77.590000       46.227014 
      13       77.580000       46.205835 
      13       77.610000       46.238685 
      14       77.520000       46.327293 
      14       77.520000       46.437186 
      14       77.580000       46.436620 
      14       77.500000       46.339959 
      14       77.550000       46.290596 
      14       77.540000       46.305833 
      14       77.560000       46.288780 
      14       77.570000       46.253385 
      14       77.560000       46.235417 
      14       77.540000       46.195575 
      14       77.580000       46.166856 
      14       77.570000       46.210860 
      14       77.580000       46.297680 
      14       77.500000       46.330999 
      15       77.600000       46.317881 
      15       77.550000       46.377209 
      15       77.590000       46.446073 
      15       77.530000       46.455169 
      15       77.560000       46.413893 
      15       77.520000       46.424661 
      15       77.570000       46.450657 
      15       77.550000       46.421517 
      15       77.560000       46.397311 
      15       77.540000       46.378508 
      16       77.520000       46.384280 
      16       77.500000       46.367284 
      16       77.590000       46.340815 
      16       77.550000       46.372223 
      16       77.520000       46.339417 
      16       77.470000       46.305491 
      16       77.680000       46.364986 
      16       77.560000       46.412463 
      16       77.560000       46.368183 
      16       77.610000       46.303565 
      16       77.500000       46.268667 
      16       77.680000       46.239514 
      16       77.490000       46.275798 
      16       77.630000       46.328204 
      17       77.530000       46.325476 
      17       77.680000       46.261012 
      17       77.530000       46.164598 
      17       77.620000       46.139625 
      17       77.620000       46.181182 
      17       77.680000       46.274991 
      17       77.610000       46.378371 
      18       77.650000       46.438572 
      18       77.610000       46.467172 
      18       77.660000       46.485155 
      18       77.620000       46.466340 
      18       77.610000       46.429547 
      18       77.620000       46.351641 
      18       77.610000       46.294207 
      18       77.620000       46.319360 
      18       77.630000       46.346561 
      18       77.620000       46.383463 
      18       77.630000       46.368002 
      18       77.640000       46.285722 
      18       77.590000       46.238575 
      18       77.630000       46.246238 
      19       77.630000       46.196906 
      19       77.600000       46.172352 
      19       77.650000       46.300868 
      19       77.660000       46.451041 
      19       77.850000       46.464900 
      19       78.210000       46.380296 
      19       78.560000       46.316149 
      19       78.870000       46.327859 
      19       79.170000       46.366784 
      19       79.340000       46.392376 
      19       79.230000       46.330864 
      20       79.250000       46.241426 
      20       79.390000       46.280698 
      20       79.380000       46.366394 
      20       79.460000       46.369885 
      20       79.310000       46.371327 
      20       79.490000       46.362701 
      20       79.350000       46.339982 
      20       79.800000       46.301794 
      20       79.940000       46.295593 
      20       79.830000       46.364596 
      20       79.900000       46.418762 
      21       79.900000       46.404534 
      21       79.900000       46.408938 
      21       79.960000       46.456069 
      21       80.050000       46.462244 
      21       79.980000       46.449397 
      21       80.020000       46.433521 
      21       79.900000       46.396504 
      21       80.020000       46.358259 
      21       79.920000       46.366921 
      21       79.950000       46.364058 
      22       79.980000       46.361566 
      22       79.960000       46.398610 
      22       79.980000       46.456082 
      22       79.950000       46.473029 
      22       79.880000       46.498195 
      22       79.950000       46.517406 
      22       79.880000       46.453770 
      22       79.940000       46.346702 
      22       79.880000       46.314847 
      22       79.960000       46.346225 
      22       79.930000       46.320176 
      22       79.930000       46.305518 
      23       79.940000       46.385140 
      23       79.890000       46.450227 
      23       79.900000       46.456029 
      23       79.980000       46.485625 
      23       79.910000       46.483783 
      23       79.940000       46.452968 
      23       79.890000       46.435819 
      23       80.000000       46.400048 
      24       80.010000       46.378925 
      24       80.020000       46.386136 
      24       80.110000       46.368610 
      24       80.050000       46.357469 
      24       80.180000       46.384741 
      24       80.150000       46.457840 
      24       80.180000       46.487809 
      24       80.200000       46.424191 
      24       80.200000       46.370469 
      24       80.200000       46.384737 
      24       80.170000       46.381220 
      24       80.190000       46.344860 
      24       80.130000       46.386179 
      25       80.210000       46.467586 
      25       80.240000       46.478520 
      25       80.210000       46.428192 
      25       80.240000       46.408605 
      25       80.280000       46.428206 
      25       80.220000       46.478977 
      25       80.230000       46.473442 
      25       80.210000       46.416232 
      25       80.150000       46.414807 
      26       80.210000       46.475324 
      26       80.160000       46.482951 
      26       80.190000       46.454258 
      26       80.240000       46.451613 
      26       80.190000       46.468556 
      26       80.210000       46.490192 
      26       80.220000       46.486884 
      26       80.200000       46.465981 
      26       80.170000       46.422780 
      26       80.130000       46.396047 
      26       80.230000       46.363171 
      26       80.140000       46.321641 
      27       80.240000       46.286567 
      27       80.140000       46.317145 
      27       80.200000       46.413421 
      27       80.220000       46.492792 
      27       80.210000       46.488739 
      27       80.170000       46.465016 
      27       80.180000       46.493722 
      27       80.220000       46.512919 
      27       80.210000       46.445275 
      27       80.220000       46.372696 
      27       80.130000       46.370811 
      28       80.180000       46.311273 
      28       80.190000       46.234643 
      28       80.170000       46.280352 
      28       80.190000       46.368583 
      28       80.190000       46.462354 
      28       80.130000       46.517822 
      28       80.150000       46.494151 
      28       80.090000       46.465056 
      28       80.140000       46.489652 
      28       80.180000       46.504450 
      29       80.090000       46.471766 
      29       80.200000       46.435833 
      29       80.060000       46.381694 
      29       80.170000       46.363725 
      29       80.110000       46.408535 
      29       80.140000       46.426903 
      29       80.160000       46.463670 
      29       80.140000       46.475297 
      29       80.200000       46.433175 
      29       80.140000       46.431916 
      30       80.180000       46.457745 
      30       80.140000       46.460179 
      30       80.110000       46.423250 
      30       80.140000       46.408161 
      30       80.190000       46.427736 
      30       80.110000       46.473108 
      30       80.100000       46.442960 
      30       80.150000       46.341343 
      30       80.100000       46.302335 
      30       80.090000       46.366382 
      30       80.100000       46.434114 
      30       80.090000       46.467214 
      30       80.140000       46.491051 
      31       80.090000       46.498152 
      31       80.120000       46.520647 
      31       80.140000       46.537160 
      31       80.110000       46.528647 
      31       80.090000       46.469512 
      31       80.060000       46.403578 
      31       80.150000       46.367754 
      31       80.070000       46.327803 
      31       80.090000       46.315773 
      31       80.070000       46.291037 
      32       80.110000       46.271865 
      32       80.110000       46.336333 
      32       80.070000       46.452441 
      32       80.140000       46.511577 
      32       80.010000       46.469915 
      32       80.110000       46.424705 
      32       80.070000       46.459640 
      32       80.000000       46.470355 
      32       80.030000       46.418460 
      32       80.100000       46.425092 
      32       80.030000       46.451140 
      32       80.060000       46.427803 
      33       80.020000       46.432346 
      33       80.090000       46.468087 
      33       80.050000       46.503174 
      33       80.040000       46.478828 
      33       80.050000       46.416245 
      33       80.000000       46.409851 
      33       80.130000       46.456069 
      33       80.120000       46.461398 
      34       80.040000       46.439916 
      34       80.100000       46.400908 
      34       80.010000       46.384821 
      34       80.000000       46.417048 
      34       80.050000       46.448442 
      34       80.140000       46.488337 
      34       79.940000       46.505336 
      34       80.080000       46.483867 
      34       79.990000       46.499578 
      34       80.050000       46.524591 
      34       79.970000       46.499162 
      35       80.070000       46.479355 
      35       79.970000       46.491951 
      35       80.060000       46.497293 
      35       80.060000       46.509890 
      35       80.050000       46.490096 
      35       80.020000       46.465083 
      35       79.950000       46.494622 
      35       80.100000       46.524175 
      35       80.030000       46.499592 
      35       80.000000       46.484754 
      35       80.020000       46.516148 
      36       80.080000       46.537187 
      36       80.030000       46.534060 
      36       80.060000       46.494609 
      36       79.990000       46.454728 
      36       80.040000       46.446242 
      36       80.050000       46.444386 
      36       79.980000       46.451171 
      36       79.990000       46.473083 
      36       80.000000       46.504920 
      36       80.020000       46.494622 
      36       79.980000       46.484311 
      37       80.040000       46.515705 
      37       80.010000       46.532218 
      37       80.000000       46.514846 
      37       80.040000       46.474399 
      37       80.030000       46.457026 
      37       80.020000       46.473526 
      37       80.020000       46.504504 
      37       80.020000       46.489653 
      37       80.010000       46.465096 
      37       80.010000       46.495495 
      37       80.020000       46.534543 
      38       80.070000       46.543003 
      38       80.000000       46.544858 
      38       80.030000       46.538047 
      38       79.990000       46.515262 
      38       80.020000       46.473070 
      38       80.050000       46.440412 
      38       80.000000       46.396395 
      38       79.990000       46.370523 
      39       80.020000       46.414334 
      39       80.060000       46.451127 
      39       79.980000       46.438144 
      39       80.090000       46.475797 
      39       79.960000       46.529533 
      39       80.110000       46.541700 
      39       79.960000       46.534503 
      39       79.990000       46.495495 
      39       79.870000       46.465096 
      40       80.000000       46.489653 
      40       79.890000       46.504504 
      40       79.900000       46.473526 
      40       79.950000       46.457026 
      40       79.850000       46.474385 
      40       80.100000       46.514402 
      40       80.060000       46.526792 
      40       80.000000       46.490635 
      40       80.020000       46.434048 
      41       79.990000       46.427013 
      41       79.990000       46.439417 
      41       79.990000       46.450741 
      41       80.010000       46.473056 
      41       79.940000       46.504490 
      41       80.020000       46.489653 
      41       80.010000       46.465070 
      41       79.930000       46.494622 
      42       80.000000       46.524174 
      42       79.960000       46.499565 
      42       79.980000       46.483867 
      42       79.980000       46.505350 
      42       79.950000       46.488793 
      42       79.970000       46.454298 
      42       79.960000       46.447101 
      42       79.950000       46.454755 
      43       79.930000       46.494622 
      43       79.900000       46.534490 
      43       79.960000       46.542130 
      43       79.900000       46.534516 
      43       79.900000       46.495495 
      43       79.910000       46.465096 
      43       79.950000       46.489653 
      43       79.970000       46.504504 
      43       79.960000       46.473526 
      43       79.940000       46.456986 
      44       79.960000       46.473083 
      44       79.920000       46.499105 
      44       79.910000       46.465456 
      44       79.940000       46.425202 
      44       79.960000       46.471285 
      44       79.920000       46.528687 
      44       79.910000       46.536718 
      44       79.940000       46.515262 
      44       79.860000       46.474399 
      44       79.960000       46.456597 
      44       79.960000       46.468584 
      44       79.890000       46.486136 
      44       79.960000       46.478925 
      44       79.940000       46.500021 
      45       79.930000       46.534960 
      45       79.940000       46.543030 
      45       79.930000       46.545315 
      45       79.940000       46.543889 
      45       79.910000       46.544885 
      45       79.910000       46.538074 
      45       79.950000       46.516175 
      45       79.920000       46.484781 
      45       79.960000       46.500478 
      45       79.890000       46.534946 
      45       79.940000       46.542157 
      46       79.920000       46.534946 
      46       79.900000       46.500451 
      46       79.910000       46.483894 
      46       79.980000       46.505377 
      46       79.930000       46.489680 
      46       79.910000       46.465096 
      46       79.890000       46.495495 
      46       79.910000       46.534516 
      47       79.880000       46.542130 
      47       79.900000       46.534490 
      47       79.910000       46.494635 
      47       79.870000       46.455171 
      47       79.930000       46.451627 
      47       79.860000       46.468154 
      47       79.930000       46.486123 
      47       79.900000       46.478925 
      47       79.880000       46.500021 
      48       79.870000       46.534960 
      48       79.870000       46.543030 
      48       79.870000       46.545315 
      48       79.820000       46.543903 
      48       79.850000       46.545341 
      49       79.890000       46.543890 
      49       79.870000       46.544898 
      49       79.900000       46.538504 
      49       79.890000       46.521144 
      49       79.920000       46.504009 
      49       79.870000       46.521144 
      49       79.820000       46.538504 
      49       79.890000       46.544898 
      49       79.880000       46.543890 
      49       79.880000       46.545341 
      50       79.880000       46.543889 
      50       79.860000       46.544885 
      50       79.950000       46.538074 
      50       79.910000       46.516148 
      50       79.850000       46.483894 
      50       79.920000       46.489680 
      50       79.880000       46.486579 
      50       79.890000       46.463228 
      50       79.870000       46.496477 
      50       79.860000       46.527705 
      50       79.840000       46.520258 
      51       79.850000       46.503982 
      51       79.860000       46.521144 
      51       79.800000       46.538504 
      51       79.850000       46.544898 
      51       79.870000       46.543890 
      51       79.860000       46.545341 
      51       79.820000       46.543903 
      51       79.850000       46.545341 
      51       79.920000       46.543903 
      51       79.850000       46.545341 
      52       79.830000       46.543903 
      52       79.840000       46.545341 
      52       79.870000       46.543903 
      52       79.870000       46.545314 
      52       79.840000       46.542990 
      52       79.890000       46.533644 
      52       79.850000       46.484281 
      52       79.890000       46.412189 
      52       79.890000       46.396466 
      52       79.870000       46.464609 
      52       79.820000       46.518306 
      52       79.810000       46.498678 
      52       79.900000       46.478911 
      53       79.820000       46.487008 
      53       79.820000       46.478952 
      53       79.860000       46.500021 
      53       79.810000       46.534933 
      53       79.870000       46.542157 
      53       79.840000       46.534946 
      53       79.830000       46.500478 
      53       79.830000       46.484767 
      53       79.820000       46.515719 
      53       79.790000       46.532245 
      54       79.780000       46.515719 
      54       79.830000       46.484767 
      54       79.870000       46.500478 
      54       79.810000       46.534946 
      54       79.900000       46.542157 
      54       79.850000       46.534946 
      54       79.840000       46.500478 
      54       79.850000       46.484767 
      54       79.860000       46.515718 
      54       79.800000       46.532218 
      55       79.820000       46.514832 
      55       79.810000       46.473929 
      55       79.860000       46.450754 
      55       79.790000       46.438960 
      55       79.780000       46.421131 
      55       79.790000       46.403149 
      55       79.760000       46.411219 
      55       79.860000       46.400491 
      55       79.860000       46.408991 
      55       79.870000       46.461912 
      56       79.850000       46.492323 
      56       79.830000       46.520204 
      56       79.820000       46.537590 
      56       79.820000       46.534100 
      56       79.790000       46.495482 
      56       79.790000       46.465110 
      56       79.820000       46.490109 
      56       79.850000       46.510306 
      56       79.840000       46.501793 
      56       79.770000       46.504920 
      56       79.840000       46.465912 
      57       79.800000       46.425189 
      57       79.840000       46.470412 
      57       79.790000       46.518345 
      57       79.770000       46.494152 
      57       79.810000       46.464613 
      57       79.760000       46.484253 
      57       79.790000       46.480267 
      57       79.820000       46.432302 
      57       79.780000       46.416605 
      58       79.840000       46.395535 
      58       79.790000       46.384351 
      58       79.800000       46.416162 
      58       79.820000       46.438074 
      58       79.830000       46.444885 
      58       79.800000       46.443916 
      58       79.800000       46.446214 
      58       79.750000       46.454271 
      58       79.830000       46.488766 
      58       79.790000       46.504477 
      58       79.780000       46.473526 
      58       79.820000       46.457026 
      59       79.830000       46.474412 
      59       79.800000       46.515302 
      59       79.850000       46.538047 
      59       79.780000       46.544858 
      59       79.810000       46.543003 
      59       79.820000       46.534543 
      59       79.800000       46.495508 
      59       79.850000       46.465499 
      59       79.800000       46.493722 
      59       79.770000       46.512450 
      59       79.780000       46.439070 
      60       79.820000       46.340361 
      60       79.800000       46.314945 
      60       79.790000       46.353370 
      60       79.830000       46.431443 
      60       79.790000       46.467657 
      60       79.790000       46.499094 
      60       79.790000       46.534033 
      60       79.800000       46.531801 
      60       79.780000       46.491951 
      60       79.800000       46.444860 
