

 time    ||    gripping force   ||   raspberry measurement 

      0       73.330000       3.006977 
      0       24.890000       3.008416 
      0       17.410000       3.006977 
      0       17.000000       3.008416 
      0       16.570000       3.006977 
      0       15.950000       3.008416 
      0       14.510000       3.007004 
      0       13.670000       3.009289 
      0       13.000000       3.017346 
      0       12.420000       3.051841 
      1       11.660000       3.067537 
      1       11.850000       3.036022 
      1       12.170000       3.010107 
      1       12.170000       2.953818 
      1       11.720000       2.726202 
      1       11.700000       2.316018 
      1       11.610000       2.005027 
      1       11.650000       1.850208 
      1       11.580000       1.789782 
      1       11.520000       1.834871 
      1       11.470000       1.898048 
      1       11.280000       1.934814 
      1       11.250000       1.967497 
      1       11.100000       1.951814 
      2       10.700000       1.916472 
      2       10.700000       1.898907 
      2       10.620000       1.863149 
      2       10.440000       1.842900 
      2       10.460000       1.860452 
      2       10.480000       1.885451 
      2       10.500000       1.923656 
      2       10.550000       1.925761 
      2       10.520000       1.913332 
      2       10.550000       1.906091 
      2       10.580000       1.892661 
      2       10.630000       1.839329 
      2       10.590000       1.807075 
      2       10.570000       1.844255 
      2       10.620000       1.847382 
      2       10.670000       1.828614 
      2       10.660000       1.869341 
      2       10.690000       1.945555 
      2       10.720000       1.980050 
      2       10.730000       1.927604 
      2       10.790000       1.858223 
      2       10.790000       1.859483 
      2       10.770000       1.879276 
      2       10.780000       1.890407 
      2       10.740000       1.924060 
      2       10.780000       1.924915 
      2       10.760000       1.903447 
      2       10.870000       1.869382 
      2       10.830000       1.872092 
      3       10.840000       1.920017 
      3       10.820000       1.935687 
      3       10.850000       1.955897 
      3       10.840000       1.957183 
      3       10.860000       1.888206 
      3       10.840000       1.839869 
      3       10.880000       1.883680 
      3       10.870000       1.942925 
      3       10.920000       1.954512 
      3       10.890000       1.954556 
      3       10.810000       1.941999 
      3       10.870000       1.957710 
      3       10.910000       1.973837 
      3       10.940000       1.966209 
      3       10.940000       1.984152 
      3       10.970000       2.000235 
      3       10.880000       1.991319 
      3       10.920000       1.928544 
      3       10.920000       1.859566 
      3       10.950000       1.875224 
      3       10.970000       1.946025 
      3       10.990000       1.980480 
      3       10.930000       1.932130 
      3       10.990000       1.872065 
      3       11.000000       1.856355 
      3       10.950000       1.846996 
      3       10.990000       1.876508 
      3       11.000000       1.889534 
      3       11.010000       1.850513 
      4       10.980000       1.865394 
      4       11.060000       1.896622 
      4       10.690000       1.907556 
      4       10.650000       1.907381 
      4       10.390000       1.913371 
      4       10.360000       1.925735 
      4       10.420000       1.922770 
      4       10.410000       1.874626 
      4       10.470000       1.811184 
      4       10.380000       1.752729 
      4       10.410000       1.770860 
      4       10.380000       1.821276 
      4       10.460000       1.853266 
      4       10.460000       1.860341 
      4       10.500000       1.873837 
      4       10.520000       1.863539 
      4       10.510000       1.871582 
      5       10.490000       1.918230 
      5       10.520000       1.914090 
      5       10.430000       1.859108 
      5       10.520000       1.797566 
      5       10.550000       1.790088 
      5       10.490000       1.802062 
      5       10.490000       1.808899 
      5       10.530000       1.818662 
      5       10.530000       1.868038 
      5       13.370000       1.940129 
      5       49.250000       1.955853 
      5       90.170000       1.887749 
      5       111.870000       1.835342 
      5       102.250000       1.869838 
      6       95.040000       1.946026 
      6       93.600000       1.985906 
      6       93.870000       1.957670 
      7       92.860000       1.928573 
      7       92.790000       1.957670 
      7       92.790000       1.985920 
      7       92.700000       1.946469 
      7       92.540000       1.875266 
      7       92.510000       1.860589 
      7       92.360000       1.943949 
      7       92.500000       2.099587 
      7       93.180000       2.396320 
      8       93.810000       2.799666 
      9       94.620000       3.019778 
      9       94.690000       3.032463 
      10       94.560000       3.014109 
      10       94.610000       3.006546 
      10       94.530000       2.997631 
      10       94.530000       2.958583 
      10       94.500000       2.928627 
      10       94.530000       2.958583 
      10       94.520000       2.997618 
      10       94.490000       3.006091 
      11       96.560000       3.008389 
      11       96.550000       3.006964 
      11       96.530000       3.007973 
      11       96.480000       3.001578 
      11       96.370000       2.984219 
      12       96.380000       2.967110 
      12       96.290000       2.985105 
      12       96.330000       3.012376 
      13       96.290000       3.056367 
      13       96.350000       3.086752 
      13       96.300000       3.056810 
      13       96.350000       3.017776 
      13       96.260000       3.009302 
      13       96.220000       3.007004 
      13       96.210000       3.008416 
      14       96.240000       3.006977 
      15       96.210000       3.008416 
      15       96.190000       3.006977 
      15       96.230000       3.008416 
      15       96.230000       3.006977 
      15       96.170000       3.008416 
      15       96.170000       3.006977 
      15       96.150000       3.008416 
      16       96.170000       3.006964 
      16       97.650000       3.007973 
      16       97.630000       3.001578 
      16       97.590000       2.984219 
      16       97.660000       2.967083 
      16       97.600000       2.984219 
      16       97.600000       3.001578 
      16       97.600000       3.007973 
      16       97.600000       3.006964 
      17       97.560000       3.008416 
      17       97.620000       3.006977 
      17       97.560000       3.008416 
      17       97.560000       3.006977 
      17       98.630000       3.008416 
      18       98.640000       3.006977 
      18       98.610000       3.008416 
      18       98.600000       3.006977 
      18       98.540000       3.008416 
      19       98.580000       3.006977 
      19       98.570000       3.008416 
      19       98.530000       3.007004 
      19       98.540000       3.009302 
      20       98.510000       3.017776 
      20       98.510000       3.056810 
      20       98.470000       3.086766 
      20       98.500000       3.056810 
      20       98.520000       3.017775 
      20       98.470000       3.009276 
      21       98.450000       3.006131 
      21       98.440000       2.998034 
      22       98.370000       2.963109 
      22       98.440000       2.942456 
      22       98.430000       2.955052 
      22       98.440000       2.961254 
      22       101.970000       2.983762 
      23       101.950000       3.001565 
      23       101.890000       3.007972 
      23       101.900000       3.006964 
      23       101.920000       3.008416 
      23       101.830000       3.006977 
      23       101.820000       3.008416 
      23       101.820000       3.006977 
      23       101.840000       3.008416 
      24       101.750000       3.006977 
      24       101.770000       3.008416 
      24       101.730000       3.006977 
      25       101.680000       3.008416 
      25       101.680000       3.006977 
      25       101.700000       3.008416 
      26       101.690000       3.006977 
      26       101.630000       3.008416 
      27       101.560000       3.006978 
      27       101.610000       3.008429 
      28       101.550000       3.007434 
      28       101.530000       3.014245 
      28       101.500000       3.036144 
      28       101.530000       3.067538 
      28       101.490000       3.051841 
      29       101.510000       3.017346 
      29       101.490000       3.009289 
      29       101.510000       3.007031 
      29       101.480000       3.009302 
      29       101.430000       3.017776 
      30       101.450000       3.056810 
      30       101.430000       3.086766 
      30       101.390000       3.056810 
      30       101.430000       3.017776 
      30       101.360000       3.009302 
      30       101.440000       3.007004 
      31       101.440000       3.008416 
      31       101.440000       3.006977 
      32       101.430000       3.008416 
      32       101.390000       3.006977 
      32       101.350000       3.008416 
      32       101.360000       3.006977 
      33       101.370000       3.008416 
      33       101.390000       3.006977 
      33       101.360000       3.008416 
      33       101.370000       3.006977 
      34       101.300000       3.008416 
      34       101.350000       3.006977 
      34       101.330000       3.008416 
      34       101.360000       3.006977 
      35       101.330000       3.008416 
      35       101.290000       3.007018 
      35       101.370000       3.009745 
      35       101.350000       3.023175 
      35       101.320000       3.081007 
      35       101.340000       3.126660 
      36       101.310000       3.081007 
      36       101.290000       3.023175 
      36       101.270000       3.009745 
      36       101.300000       3.007018 
      36       101.270000       3.008417 
      36       101.260000       3.007004 
      37       101.310000       3.009302 
      37       101.250000       3.017776 
      37       101.270000       3.056810 
      38       101.250000       3.086766 
      38       101.260000       3.056810 
      39       101.250000       3.017776 
      39       101.260000       3.009302 
      39       101.230000       3.007004 
      39       101.220000       3.008416 
      39       101.250000       3.006977 
      39       101.290000       3.008416 
      41       101.200000       3.006977 
      41       101.240000       3.008389 
      42       101.270000       3.006104 
      42       101.210000       2.998048 
      43       101.210000       2.963552 
      43       101.260000       2.947855 
      43       101.190000       2.979250 
      43       101.200000       3.001175 
      43       101.210000       3.008846 
      43       101.220000       3.017762 
      43       101.180000       3.056810 
      44       101.140000       3.086766 
      44       101.180000       3.056810 
      44       101.180000       3.017776 
      45       101.160000       3.009302 
      45       101.150000       3.007004 
      45       101.170000       3.008416 
      45       101.140000       3.006977 
      45       101.190000       3.008416 
      45       101.180000       3.006977 
      46       101.160000       3.008416 
      46       101.150000       3.006977 
      46       101.170000       3.008416 
      46       101.150000       3.006977 
      47       101.120000       3.008416 
      47       101.110000       3.006977 
      48       101.190000       3.008416 
      48       101.120000       3.006977 
      49       101.150000       3.008416 
      49       101.150000       3.006977 
      50       101.090000       3.008416 
      50       101.130000       3.006977 
      50       101.110000       3.008416 
      51       101.060000       3.006977 
      51       101.100000       3.008416 
      51       101.080000       3.006977 
      51       101.050000       3.008416 
      51       101.060000       3.007004 
      51       101.050000       3.009302 
      51       101.050000       3.017776 
      53       101.080000       3.056810 
      53       101.120000       3.086766 
      53       101.090000       3.056810 
      53       101.120000       3.017762 
      54       101.060000       3.008859 
      54       101.100000       3.001605 
      54       101.100000       2.984219 
      54       101.050000       2.967083 
      55       101.100000       2.984219 
      55       101.060000       3.001565 
      55       101.070000       3.007530 
      56       101.020000       3.001592 
      56       101.030000       2.985105 
      56       101.080000       2.977881 
      56       101.100000       3.032613 
      56       101.040000       3.081367 
      57       101.030000       3.056367 
      57       101.080000       3.017789 
      58       101.030000       3.010188 
      58       101.040000       3.017802 
      59       100.990000       3.056810 
      59       101.030000       3.086766 
      59       101.040000       3.056810 
      59       101.030000       3.017776 
      59       101.000000       3.009302 
      60       101.020000       3.007004 
      60       101.010000       3.008416 
      60       101.040000       3.006977 
      60       101.010000       3.008416 
      60       100.990000       3.006977 
