Human trial picking the raspberry twin 

 time    ||     output     ||     loadcell

      0.000000       -801.014286       0.010000 
      0.030915       -801.014286       0.130000 
      0.061134       -801.014286       0.080000 
      0.092221       -801.014286       0.030000 
      0.124135       -801.014286       0.010000 
      0.153819       -801.014286       0.040000 
      0.184957       -801.014286       0.010000 
      0.215386       -801.014286       0.070000 
      0.247013       -801.014286       0.160000 
      0.277059       -801.014281       0.150000 
      0.307916       -801.013090       0.120000 
      0.339268       -800.905892       0.190000 
      0.370297       -797.355981       0.010000 
      0.401175       -754.109217       0.030000 
      0.433159       -560.290667       0.020000 
      0.463713       -240.737900       0.030000 
      0.510389       -46.919350       0.180000 
      0.541259       -3.672586       0.010000 
      0.572382       -0.122662       0.010000 
      0.603174       -0.015034       0.100000 
      0.633084       -0.008887       0.150000 
      0.664921       0.009916       0.020000 
      0.694508       0.025626       0.250000 
      0.725268       0.010359       0.070000 
      0.756800       -0.003483       0.070000 
      0.787483       0.010359       0.110000 
      0.817399       0.025626       0.100000 
      0.848752       0.009916       0.210000 
      0.879845       -0.008882       0.120000 
      0.909903       -0.013838       0.360000 
      0.940752       -0.014268       0.080000 
      0.971528       -0.014281       0.180000 
      1.002208       -0.014268       0.130000 
      1.034087       -0.013838       0.010000 
      1.065034       -0.008882       0.200000 
      1.095222       0.009916       0.130000 
      1.126050       0.025613       0.020000 
      1.158067       0.009916       0.030000 
      1.188477       -0.008882       0.130000 
      1.220468       -0.013838       0.140000 
      1.250926       -0.014268       0.110000 
      1.282134       -0.014281       0.090000 
      1.314306       -0.014281       0.210000 
      1.344051       -0.014281       0.030000 
      1.375982       -0.014281       0.050000 
      1.407907       -0.014281       0.000000 
      1.437800       -0.014281       0.040000 
      1.469265       -0.014281       0.010000 
      1.499189       -0.014281       0.100000 
      1.530130       -0.014281       0.200000 
      1.561021       -0.014281       0.100000 
      1.590942       -0.014281       0.010000 
      1.622856       -0.014281       0.010000 
      1.652775       -0.014281       0.210000 
      1.684689       -0.014281       0.150000 
      1.714495       -0.014268       0.060000 
      1.746409       -0.013825       0.020000 
      1.776329       -0.008439       0.030000 
      1.807656       0.015315       0.050000 
      1.837970       0.049810       0.030000 
      1.868880       0.049810       0.070000 
      1.899613       0.015315       0.060000 
      1.930557       -0.008439       0.140000 
      1.961905       -0.013825       0.020000 
      1.993531       -0.014268       0.010000 
      2.026553       -0.014281       0.140000 
      2.057498       -0.014281       0.020000 
      2.087626       -0.014281       0.160000 
      2.119694       -0.014281       0.080000 
      2.149958       -0.014281       0.110000 
      2.181122       -0.014281       0.160000 
      2.212275       -0.014281       0.040000 
      2.244079       -0.014281       0.250000 
      2.275420       -0.014281       0.090000 
      2.306445       -0.014281       0.020000 
      2.337627       -0.014281       0.020000 
      2.369255       -0.014281       0.170000 
      2.400450       -0.014281       0.010000 
      2.431094       -0.014281       0.040000 
      2.462087       -0.014281       0.130000 
      2.493119       -0.014281       0.240000 
      2.524534       -0.014281       0.020000 
      2.555238       -0.014281       0.110000 
      2.587157       -0.014281       0.120000 
      2.617549       -0.014281       0.110000 
      2.648430       -0.014281       0.180000 
      2.679115       -0.014281       0.000000 
      2.709454       -0.014281       0.090000 
      2.741147       -0.014281       0.020000 
      2.770835       -0.014281       0.010000 
      2.801963       -0.014281       0.090000 
      2.832272       -0.014281       0.090000 
      2.863166       -0.014281       0.100000 
      2.893274       -0.014281       0.040000 
      2.924875       -0.014281       0.090000 
      2.954611       -0.014281       0.210000 
      2.985135       -0.014281       0.040000 
      3.016100       -0.014281       0.160000 
      3.047482       -0.014281       0.200000 
      3.079355       -0.014281       0.200000 
      3.110306       -0.014281       0.020000 
      3.140516       -0.014281       0.050000 
      3.171127       -0.014281       0.150000 
      3.203264       -0.014281       0.150000 
      3.234306       -0.014281       0.060000 
      3.265317       -0.014281       0.230000 
      3.296014       -0.014281       0.040000 
      3.326706       -0.014281       0.340000 
      3.358127       -0.014281       0.080000 
      3.388933       -0.014281       0.040000 
      3.420339       -0.014281       0.110000 
      3.451100       -0.014281       0.220000 
      3.482356       -0.014281       0.220000 
      3.513998       -0.014281       0.040000 
      3.545274       -0.014281       0.110000 
      3.576847       -0.014281       0.020000 
      3.606765       -0.014281       0.030000 
      3.637737       -0.014281       0.010000 
      3.684263       -0.014281       0.050000 
      3.716057       -0.014281       0.140000 
      3.748125       -0.014281       0.210000 
      3.777884       -0.014281       0.030000 
      3.808677       -0.014281       0.100000 
      3.840379       -0.014281       0.160000 
      3.872383       -0.014281       0.060000 
      3.903749       -0.014281       0.160000 
      3.950692       -0.014281       0.010000 
      3.981934       -0.014281       0.110000 
      4.013162       -0.014281       0.110000 
      4.043942       -0.014281       0.040000 
      4.075673       -0.014281       0.020000 
      4.106393       -0.014281       0.120000 
      4.138418       -0.014281       0.050000 
      4.169232       -0.014281       0.180000 
      4.200991       -0.014281       0.050000 
      4.232193       -0.014281       0.000000 
      4.264194       -0.014281       0.150000 
      4.295430       -0.014281       0.170000 
      4.326539       -0.014281       0.080000 
      4.357835       -0.014281       0.060000 
      4.389482       -0.014281       0.030000 
      4.420114       -0.014281       0.250000 
      4.450302       -0.014281       0.080000 
      4.481534       -0.014281       0.080000 
      4.512800       -0.014281       0.080000 
      4.544036       -0.014281       0.150000 
      4.575065       -0.014281       0.080000 
      4.606510       -0.014281       0.020000 
      4.637436       -0.014281       0.000000 
      4.668351       -0.014281       0.050000 
      4.698293       -0.014281       0.130000 
      4.728907       -0.014281       0.080000 
      4.760451       -0.014281       0.170000 
      4.792078       -0.014281       0.160000 
      4.824104       -0.014281       0.130000 
      4.855064       -0.014281       0.040000 
      4.885523       -0.014281       0.070000 
      4.916326       -0.014281       0.040000 
      4.948269       -0.014281       0.120000 
      4.978431       -0.014281       0.010000 
      5.009769       -0.014281       0.050000 
      5.040578       -0.014281       0.070000 
      5.072734       -0.014281       0.220000 
      5.103898       -0.014281       0.130000 
      5.134954       -0.014281       0.160000 
      5.166231       -0.014281       0.160000 
      5.197491       -0.014281       0.110000 
      5.227962       -0.014281       0.130000 
      5.258134       -0.014281       0.090000 
      5.290030       -0.014281       0.100000 
      5.321096       -0.014281       0.050000 
      5.351713       -0.014281       0.040000 
      5.382610       -0.014281       0.100000 
      5.413728       -0.014281       0.090000 
      5.444527       -0.014281       0.020000 
      5.475573       -0.014281       0.130000 
      5.507556       -0.014281       0.010000 
      5.538971       -0.014281       0.070000 
      5.569665       -0.014281       0.110000 
      5.600124       -0.014281       0.060000 
      5.631201       -0.014281       0.060000 
      5.662365       -0.014281       0.050000 
      5.693597       -0.014281       0.160000 
      5.724675       -0.014281       0.040000 
      5.755412       -0.014281       0.130000 
      5.785892       -0.014281       0.040000 
      5.816999       -0.014281       0.170000 
      5.847964       -0.014281       0.150000 
      5.879871       -0.014281       0.070000 
      5.910797       -0.014281       0.190000 
      5.941681       -0.014281       0.260000 
      5.972599       -0.014281       0.060000 
      6.003288       -0.014281       0.070000 
      6.035202       -0.014281       0.110000 
      6.065089       -0.014281       0.080000 
      6.097004       -0.014281       0.100000 
      6.128952       -0.014281       0.060000 
      6.158840       -0.014281       0.150000 
      6.190776       -0.014281       0.040000 
      6.222701       -0.014281       0.000000 
      6.252615       -0.014281       0.070000 
      6.284504       -0.014281       0.060000 
      6.316611       -0.014281       0.090000 
      6.347745       -0.014281       0.040000 
      6.378866       -0.014281       0.030000 
      6.410767       -0.014281       0.170000 
      6.442136       -0.014281       0.080000 
      6.473320       -0.014281       0.020000 
      6.504300       -0.014281       0.330000 
      6.535515       -0.014281       0.090000 
      6.566695       -0.014281       0.240000 
      6.598074       -0.014281       0.040000 
      6.630008       -0.014281       0.020000 
      6.661003       -0.014281       0.150000 
      6.692097       -0.014281       0.070000 
      6.722723       -0.014281       0.080000 
      6.753983       -0.014281       0.180000 
      6.800706       -0.014281       0.080000 
      6.830959       -0.014281       0.180000 
      6.860631       -0.014281       0.040000 
      6.892169       -0.014281       0.080000 
      6.922995       -0.014281       0.080000 
      6.953965       -0.014281       0.060000 
      6.983740       -0.014281       0.200000 
      7.015501       -0.014281       0.110000 
      7.046492       -0.014281       0.130000 
      7.077212       -0.014281       0.120000 
      7.107168       -0.014281       0.260000 
      7.137652       -0.014281       0.080000 
      7.169721       -0.014281       0.040000 
      7.201019       -0.014281       0.230000 
      7.233250       -0.014281       0.250000 
      7.264051       -0.014281       0.320000 
      7.294561       -0.014281       0.000000 
      7.324452       -0.014281       0.040000 
      7.356363       -0.014281       0.030000 
      7.388282       -0.014281       0.140000 
      7.418169       -0.014281       0.170000 
      7.450116       -0.014281       0.070000 
      7.481999       -0.014281       0.060000 
      7.511918       -0.014281       0.040000 
      7.541865       -0.014281       0.040000 
      7.572794       -0.014281       0.050000 
      7.603706       -0.014281       0.220000 
      7.634618       -0.014281       0.290000 
      7.665532       -0.014281       0.090000 
      7.697424       -0.014281       0.170000 
      7.728373       -0.014281       0.170000 
      7.758846       -0.014281       0.020000 
      7.789393       -0.014281       0.060000 
      7.821193       -0.014281       0.080000 
      7.852112       -0.014281       0.170000 
      7.882964       -0.014281       0.020000 
      7.913620       -0.014281       0.090000 
      7.944313       -0.014281       0.060000 
      7.974978       -0.014281       0.230000 
      8.005706       -0.014281       0.120000 
      8.037113       -0.014281       0.120000 
      8.068942       -0.014281       0.060000 
      8.099722       -0.014281       2.260000 
      8.130852       -0.014281       5.040000 
      8.162206       -0.014281       4.460000 
      8.193621       -0.014281       1.180000 
      8.225650       -0.014281       3.550000 
      8.256643       -0.014281       12.720000 
      8.287151       -0.014281       23.170000 
      8.319189       -0.014281       35.290000 
      8.349717       -0.014281       45.830000 
      8.380571       -0.014281       63.060000 
      8.412084       -0.014281       81.550000 
      8.443084       -0.014281       99.760000 
      8.474156       -0.014281       121.590000 
      8.504375       -0.014281       131.040000 
      8.534810       -0.014281       142.870000 
      8.566504       -0.014268       161.420000 
      8.597578       -0.013838       182.370000 
      8.628722       -0.008841       204.850000 
      8.659638       0.011327       217.490000 
      8.689726       0.044564       224.220000 
      8.720830       0.118139       238.280000 
      8.750766       0.298344       251.500000 
      8.782646       0.526056       262.520000 
      8.813100       0.726900       270.210000 
      8.844157       0.888294       280.790000 
      8.875025       0.967653       273.850000 
      8.906680       0.984335       145.720000 
      8.937856       0.985759       6.310000 
      8.968805       0.988499       5.080000 
      9.000108       1.022237       5.290000 
      9.031317       1.184075       6.010000 
      9.063310       1.501981       6.510000 
      9.094066       1.800001       6.220000 
      9.125825       2.012714       5.830000 
      9.156657       2.294637       6.490000 
      9.187669       2.668994       5.740000 
      9.219096       2.908345       5.840000 
      9.250443       2.975923       5.470000 
      9.282199       2.975884       5.670000 
      9.313202       2.864020       5.180000 
      9.344437       2.326101       5.320000 
      9.375802       1.286112       5.430000 
      9.405837       0.398795       5.620000 
      9.436331       -0.005242       5.610000 
      9.467112       -0.313197       5.850000 
      9.498341       -0.755532       6.270000 
      9.530063       -1.178260       6.340000 
      9.560095       -1.565306       6.510000 
      9.591180       -1.843103       6.740000 
      9.621687       -1.969318       6.260000 
      9.651604       -2.007417       6.220000 
      9.699626       -2.013797       6.190000 
      9.730201       -2.014268       6.340000 
      9.762215       -2.014281       6.110000 
      9.792620       -2.014281       6.040000 
      9.824255       -2.014281       5.730000 
      9.856364       -2.014281       5.650000 
      9.887497       -2.014281       5.700000 
      9.917148       -2.014281       5.620000 
      9.949291       -2.014281       5.580000 
      9.980801       -2.014281       5.740000 
      10.012151       -2.014281       5.660000 
      10.043335       -2.014281       5.570000 
      10.074469       -2.014281       5.790000 
      10.105873       -2.014281       5.870000 
      10.135829       -2.014281       5.990000 
      10.166229       -2.014281       6.240000 
      10.198287       -2.014281       6.290000 
      10.228751       -2.014281       6.290000 
      10.259574       -2.014281       6.260000 
      10.290449       -2.014281       6.260000 
      10.321223       -2.014281       6.040000 
      10.352194       -2.014281       6.090000 
      10.383487       -2.014281       5.940000 
      10.413899       -2.014281       5.880000 
      10.446026       -2.014281       5.650000 
      10.476472       -2.014281       5.480000 
      10.507180       -2.014281       5.550000 
      10.538010       -2.014281       5.670000 
      10.569474       -2.014281       5.690000 
      10.601221       -2.014281       5.830000 
      10.633267       -2.014281       5.710000 
      10.664990       -2.014281       6.030000 
      10.695923       -2.014281       6.340000 
      10.727106       -2.014281       6.330000 
      10.757602       -2.014281       6.310000 
      10.788970       -2.014281       6.080000 
      10.819856       -2.014281       6.080000 
      10.850295       -2.014281       6.030000 
      10.881013       -2.014281       5.900000 
      10.912667       -2.014281       5.680000 
      10.942649       -2.014281       5.680000 
      10.974060       -2.014281       5.630000 
      11.005544       -2.014281       5.740000 
      11.036473       -2.014281       5.600000 
      11.067420       -2.014281       6.060000 
      11.099006       -2.014281       5.860000 
      11.129952       -2.014281       6.190000 
      11.160847       -2.014281       6.160000 
      11.191339       -2.014281       5.980000 
      11.222042       -2.014281       6.070000 
      11.252280       -2.014281       6.040000 
      11.283801       -2.014281       5.830000 
      11.315217       -2.014281       5.840000 
      11.345986       -2.014281       5.690000 
      11.377846       -2.014281       5.740000 
      11.408376       -2.014281       5.880000 
      11.438950       -2.014281       5.530000 
      11.469630       -2.014281       5.710000 
      11.500361       -2.014281       5.570000 
      11.531065       -2.014281       6.120000 
      11.562254       -2.014281       6.140000 
      11.592738       -2.014281       5.890000 
      11.638337       -2.014281       6.160000 
      11.670094       -2.014281       6.060000 
      11.701826       -2.014281       5.910000 
      11.733079       -2.014281       6.000000 
      11.763898       -2.014281       5.750000 
      11.794786       -2.014268       5.900000 
      11.825203       -2.013838       5.700000 
      11.855673       -2.008882       5.750000 
      11.886335       -1.990084       5.810000 
      11.918025       -1.974387       5.730000 
      11.949024       -1.990084       5.660000 
      11.979560       -2.008869       5.850000 
      12.009183       -2.013395       5.820000 
      12.040292       -2.008869       5.790000 
      12.071995       -1.990084       5.790000 
      12.102110       -1.974387       6.180000 
      12.133742       -1.990084       5.900000 
      12.164868       -2.008882       5.910000 
      12.196029       -2.013838       5.690000 
      12.226723       -2.014268       5.780000 
      12.257106       -2.014281       5.930000 
      12.288024       -2.014281       5.960000 
      12.319565       -2.014281       5.900000 
      12.350212       -2.014281       5.880000 
      12.382212       -2.014281       6.060000 
      12.413993       -2.014281       5.890000 
      12.444383       -2.014281       5.880000 
      12.475880       -2.014281       6.080000 
      12.507688       -2.014281       5.890000 
      12.538732       -2.014268       5.810000 
      12.569520       -2.013838       5.890000 
      12.599515       -2.008882       5.940000 
      12.630385       -1.990084       6.090000 
      12.661609       -1.974387       6.030000 
      12.692836       -1.990084       5.800000 
      12.724048       -2.008869       5.620000 
      12.755319       -2.013395       5.810000 
      12.786022       -2.008869       5.910000 
      12.816504       -1.990084       6.010000 
      12.848202       -1.974387       5.880000 
      12.878910       -1.990084       5.850000 
      12.910206       -2.008882       5.840000 
      12.941906       -2.013838       5.880000 
      12.973385       -2.014268       5.680000 
      13.004480       -2.014281       5.820000 
      13.035737       -2.014281       5.940000 
      13.067275       -2.014281       5.710000 
      13.098545       -2.014281       5.980000 
      13.130333       -2.014281       5.990000 
      13.160255       -2.014268       6.010000 
      13.192093       -2.013838       5.750000 
      13.223503       -2.008882       5.830000 
      13.254554       -1.990084       5.750000 
      13.285860       -1.974387       5.900000 
      13.315998       -1.990084       5.720000 
      13.348110       -2.008882       5.540000 
      13.378552       -2.013838       5.820000 
      13.409703       -2.014268       5.720000 
      13.440186       -2.014281       5.660000 
      13.470631       -2.014281       5.830000 
      13.501188       -2.014281       5.790000 
      13.533296       -2.014281       5.890000 
      13.563731       -2.014281       6.100000 
      13.595961       -2.014281       5.960000 
      13.627189       -2.014281       5.770000 
      13.659226       -2.014281       6.000000 
      13.690960       -2.014281       6.060000 
      13.722234       -2.014281       5.860000 
      13.753904       -2.014268       5.790000 
      13.784263       -2.013838       5.920000 
      13.815771       -2.008882       5.900000 
      13.846364       -1.990084       5.720000 
      13.878114       -1.974387       6.010000 
      13.909423       -1.990071       5.790000 
      13.941427       -2.008439       5.890000 
      13.972506       -2.008439       5.790000 
      14.003268       -1.990058       5.780000 
      14.033613       -1.973944       5.940000 
      14.065428       -1.984685       5.680000 
      14.096957       -1.984685       5.990000 
      14.127977       -1.973944       5.810000 
      14.159013       -1.990058       5.660000 
      14.190865       -2.008439       5.510000 
      14.220977       -2.008439       5.800000 
      14.252377       -1.990071       5.940000 
      14.284380       -1.974374       6.020000 
      14.315575       -1.989641       5.780000 
      14.346183       -2.003470       5.700000 
      14.377929       -1.989185       5.670000 
      14.408973       -1.968532       5.860000 
      14.439762       -1.960488       5.640000 
      14.470604       -1.944778       5.890000 
      14.501254       -1.949304       5.800000 
      14.532040       -1.979273       5.800000 
      14.563164       -1.984242       5.820000 
      14.593781       -1.973931       5.820000 
      14.625209       -1.990071       5.650000 
      14.656522       -2.008869       5.750000 
      14.688216       -2.013395       6.040000 
      14.719127       -2.008855       5.820000 
      14.749585       -1.989628       5.910000 
      14.780016       -1.968545       5.910000 
      14.811012       -1.960488       5.940000 
      14.842197       -1.944778       5.940000 
      14.872897       -1.949304       6.060000 
      14.904018       -1.979273       5.800000 
      14.934644       -1.984228       5.850000 
      14.966225       -1.973461       5.920000 
      14.997108       -1.983785       5.870000 
      15.028538       -1.973887       5.820000 
      15.059774       -1.925550       5.720000 
      15.091062       -1.910269       5.990000 
      15.122106       -1.960045       5.840000 
      15.153233       -1.997628       5.830000 
      15.184998       -1.988741       5.870000 
      15.216205       -1.968961       5.930000 
      15.246090       -1.965887       6.100000 
      15.277388       -1.968988       5.910000 
      15.308211       -1.989628       5.790000 
      15.338126       -2.008426       5.920000 
      15.369632       -2.008439       5.920000 
      15.400764       -1.990071       5.800000 
      15.431201       -1.974360       5.890000 
      15.461943       -1.989198       5.730000 
      15.492026       -1.998071       5.720000 
      15.523183       -1.965001       5.710000 
      15.555152       -1.929080       5.770000 
      15.585861       -1.941677       5.880000 
      15.617519       -1.963146       5.690000 
      15.649357       -1.983786       6.160000 
      15.680544       -1.984215       5.800000 
      15.711487       -1.968531       5.930000 
      15.742368       -1.965404       5.880000 
      15.774046       -1.962689       6.140000 
      15.803876       -1.954203       5.930000 
      15.834770       -1.915181       5.890000 
      15.866495       -1.885656       5.690000 
      15.896446       -1.920581       5.830000 
      15.926368       -1.978843       5.850000 
      15.958275       -2.007982       5.960000 
      15.988177       -2.013784       6.050000 
      16.020113       -2.013355       6.020000 
      16.052032       -2.002597       5.960000 
      16.081953       -1.955076       5.890000 
      16.113861       -1.885656       5.750000 
      16.145782       -1.880686       5.950000 
      16.175671       -1.930435       5.680000 
      16.207614       -1.956860       5.970000 
      16.237509       -1.959562       5.910000 
      16.269453       -1.944307       5.940000 
      16.300704       -1.943904       5.820000 
      16.332989       -1.955049       5.940000 
      16.363271       -1.943448       5.910000 
      16.393943       -1.938465       5.950000 
      16.424773       -1.929992       5.840000 
      16.456102       -1.893615       5.970000 
      16.487253       -1.875813       6.020000 
      16.517833       -1.883260       6.010000 
      16.548699       -1.886124       5.840000 
      16.580280       -1.872532       6.050000 
      16.610238       -1.892396       6.040000 
      16.640517       -1.918255       6.020000 
      16.671982       -1.964100       5.920000 
      16.704006       -1.997561       6.020000 
      16.735921       -1.982455       6.010000 
      16.766838       -1.933483       6.000000 
      16.798751       -1.870870       5.650000 
      16.829668       -1.824595       6.020000 
      16.860608       -1.822906       6.020000 
      16.891923       -1.847905       5.990000 
      16.939672       -1.905325       5.800000 
      16.970861       -1.932609       6.190000 
      17.002364       -1.937592       6.010000 
      17.034147       -1.930368       5.840000 
      17.065878       -1.897711       5.880000 
      17.096797       -1.884685       6.050000 
      17.127264       -1.860931       6.030000 
      17.159178       -1.834063       6.070000 
      17.190096       -1.865860       6.050000 
      17.222012       -1.903013       5.900000 
      17.252030       -1.907110       5.920000 
      17.283362       -1.879273       5.980000 
      17.314778       -1.826436       6.040000 
      17.346692       -1.815695       5.930000 
      17.377607       -1.884685       5.980000 
      17.407977       -1.942921       5.740000 
      17.439891       -1.937135       5.940000 
      17.469810       -1.914241       6.000000 
      17.500729       -1.890057       6.160000 
      17.532643       -1.868088       5.730000 
      17.563562       -1.854189       5.960000 
      17.594477       -1.809339       5.980000 
      17.625395       -1.755603       6.150000 
      17.655342       -1.750647       6.010000 
      17.686273       -1.785142       5.790000 
      17.718147       -1.813825       6.020000 
      17.749097       -1.837565       5.950000 
      17.780012       -1.848320       5.650000 
      17.810792       -1.808896       6.000000 
      17.841561       -1.756059       6.110000 
      17.873386       -1.756905       5.740000 
      17.904826       -1.819250       6.180000 
      17.935890       -1.891302       5.910000 
      17.966619       -1.892740       5.820000 
      17.998536       -1.817812       5.910000 
      18.029453       -1.758304       5.770000 
      18.061368       -1.753291       6.130000 
      18.092286       -1.794137       5.890000 
      18.123204       -1.774291       5.950000 
      18.154014       -1.719334       6.140000 
      18.185966       -1.740238       5.980000 
      18.216908       -1.775728       5.990000 
      18.248504       -1.770276       5.910000 
      18.280059       -1.774372       5.930000 
      18.311320       -1.723168       6.020000 
      18.342432       -1.636388       5.790000 
      18.373126       -1.611613       5.800000 
      18.404047       -1.665928       5.800000 
      18.435424       -1.727707       6.010000 
      18.466436       -1.759535       6.070000 
      18.498539       -1.772574       5.790000 
      18.529913       -1.797587       5.920000 
      18.560893       -1.774815       5.970000 
      18.591811       -1.701255       5.790000 
      18.622728       -1.663243       6.050000 
      18.653646       -1.625024       5.760000 
      18.685562       -1.635448       5.790000 
      18.717475       -1.697157       5.850000 
      18.748425       -1.707026       6.010000 
      18.779538       -1.618794       5.910000 
      18.810639       -1.535353       5.770000 
      18.842321       -1.522919       5.700000 
      18.872451       -1.537577       6.120000 
      18.903786       -1.562370       6.140000 
      18.935149       -1.578348       5.960000 
      18.965989       -1.645316       5.720000 
      18.997054       -1.717285       6.180000 
      19.028694       -1.734021       5.930000 
      19.060164       -1.721828       5.970000 
      19.091159       -1.723652       6.010000 
      19.122103       -1.672974       5.650000 
      19.153382       -1.573985       6.110000 
      19.184633       -1.503153       6.120000 
      19.216178       -1.487455       6.070000 
      19.248105       -1.555119       6.040000 
      19.279524       -1.665762       5.870000 
      19.310805       -1.694898       5.980000 
      19.341491       -1.584658       5.980000 
      19.372409       -1.462818       6.160000 
      19.403324       -1.486515       5.840000 
      19.435244       -1.582829       5.810000 
      19.466419       -1.584184       5.860000 
      19.497125       -1.484672       5.950000 
      19.527574       -1.374016       5.910000 
      19.559258       -1.376284       5.600000 
      19.590658       -1.495400       5.840000 
      19.622061       -1.565332       6.050000 
      19.652870       -1.549594       5.850000 
      19.684261       -1.475232       5.910000 
      19.715527       -1.353761       5.970000 
      19.747027       -1.283482       5.920000 
      19.778290       -1.276644       5.810000 
      19.809463       -1.325133       6.010000 
      19.840473       -1.402987       6.040000 
      19.872226       -1.447004       5.960000 
      19.903625       -1.427653       5.960000 
      19.934006       -1.376645       5.950000 
      19.964325       -1.358273       6.130000 
      19.995905       -1.395870       6.310000 
      20.026284       -1.389628       5.900000 
      20.057640       -1.381544       5.960000 
      20.089469       -1.416052       5.980000 
      20.119941       -1.382360       5.910000 
      20.150862       -1.334602       6.100000 
      20.181779       -1.330313       5.850000 
      20.213694       -1.321589       6.160000 
      20.244613       -1.326339       5.990000 
      20.275529       -1.372614       5.970000 
      20.306201       -1.366233       6.000000 
      20.337853       -1.369943       6.010000 
      20.369100       -1.379689       6.180000 
      20.401404       -1.368101       5.740000 
      20.432898       -1.364974       5.740000 
      20.464141       -1.358189       6.030000 
      20.495801       -1.341220       6.110000 
      20.526661       -1.328194       5.990000 
      20.558540       -1.354632       5.930000 
      20.589968       -1.354619       5.840000 
      20.620627       -1.327737       6.020000 
      20.652072       -1.335351       5.790000 
      20.682872       -1.327667       6.090000 
      20.714185       -1.288755       6.020000 
      20.745534       -1.239365       5.950000 
      20.777430       -1.195940       5.990000 
      20.807553       -1.174388       5.890000 
      20.837626       -1.184255       5.950000 
      20.868750       -1.179273       6.070000 
      20.899415       -1.149304       5.910000 
      20.931310       -1.144791       6.010000 
      20.962197       -1.160931       5.920000 
      20.992305       -1.173944       5.930000 
      21.023191       -1.213852       5.940000 
