

 time    ||    gripping force   ||   raspberry measurement 

      0       200.450000       4.056810 
      0       146.540000       4.017775 
      0       28.970000       4.009276 
      0       8.600000       4.006131 
      0       6.810000       3.998048 
      0       8.350000       3.963553 
      0       10.440000       3.947882 
      0       11.140000       3.980123 
      0       12.140000       4.011517 
      0       12.200000       4.051384 
      0       11.990000       4.067524 
      0       11.870000       4.036139 
      1       11.340000       4.013864 
      1       10.910000       3.994497 
      1       10.860000       3.839443 
      1       10.620000       3.101082 
      1       10.490000       1.719288 
      1       10.370000       0.600649 
      1       10.290000       0.175250 
      1       10.300000       0.068969 
      1       10.330000       0.048465 
      1       10.370000       0.085067 
      1       10.380000       0.129858 
      1       10.480000       0.161252 
      1       10.510000       0.122661 
      1       10.480000       0.058237 
      1       10.570000       0.064882 
      1       10.620000       0.103903 
      1       10.540000       0.135284 
      1       10.630000       0.167968 
      1       10.680000       0.157669 
      2       10.700000       0.146512 
      2       10.770000       0.168411 
      2       10.740000       0.151868 
      2       10.760000       0.117373 
      2       10.720000       0.110176 
      2       10.760000       0.117842 
      2       10.860000       0.158127 
      2       10.810000       0.202547 
      2       10.810000       0.224889 
      2       10.820000       0.224100 
      2       10.880000       0.191723 
      2       10.850000       0.195017 
      2       10.850000       0.226205 
      2       10.860000       0.247424 
      2       10.890000       0.225332 
      2       10.880000       0.184648 
      2       10.940000       0.148272 
      2       10.910000       0.162693 
      2       10.950000       0.187706 
      2       10.930000       0.163553 
      2       10.930000       0.158211 
      2       10.980000       0.223157 
      2       10.960000       0.268424 
      2       11.000000       0.275652 
      2       11.030000       0.321747 
      2       11.060000       0.332059 
      2       10.540000       0.264880 
      2       10.290000       0.209746 
      3       9.980000       0.165392 
      3       9.720000       0.160024 
      3       9.590000       0.244298 
      3       9.500000       0.359384 
      3       9.490000       0.406062 
      3       9.530000       0.359387 
      3       9.550000       0.307946 
      3       9.630000       0.248255 
      3       9.640000       0.175291 
      3       9.740000       0.159580 
      3       9.610000       0.228974 
      3       9.680000       0.296275 
      3       9.700000       0.319020 
      3       9.750000       0.299446 
      3       9.700000       0.246430 
      3       9.710000       0.246649 
      3       9.740000       0.281811 
      3       9.760000       0.334011 
      3       9.800000       0.373230 
      3       9.810000       0.381475 
      3       9.770000       0.296609 
      3       9.840000       0.191058 
      4       9.770000       0.180138 
      4       9.790000       0.255065 
      4       9.850000       0.323976 
      4       9.820000       0.359909 
      4       9.820000       0.311849 
      4       9.910000       0.209802 
      4       9.890000       0.183751 
      4       9.920000       0.238895 
      4       9.890000       0.247342 
      4       9.880000       0.232670 
      4       9.940000       0.277354 
      4       11.150000       0.313341 
      4       38.060000       0.291307 
      4       117.640000       0.301249 
      4       233.390000       0.360354 
      4       315.980000       0.426257 
      4       305.470000       0.397604 
      4       212.710000       0.337987 
      4       129.670000       0.371680 
      5       129.220000       0.444627 
      5       173.300000       0.488231 
      5       227.460000       0.467016 
      5       230.410000       0.478004 
      5       201.550000       0.532074 
      5       177.220000       0.532069 
      5       181.370000       0.548378 
      5       195.890000       0.841530 
      5       200.460000       1.638558 
      6       199.030000       3.054383 
      6       198.960000       4.578985 
      6       198.720000       5.348557 
      6       197.950000       4.873386 
      6       197.860000       3.609573 
      6       197.650000       2.827290 
      6       197.590000       3.102370 
      7       197.280000       3.896542 
      7       197.140000       4.373413 
      7       196.940000       4.219518 
      7       196.960000       3.832246 
      7       196.830000       3.581650 
      7       196.800000       3.669668 
      7       196.740000       3.887234 
      8       196.680000       3.986791 
      8       196.650000       4.006966 
      8       196.470000       4.006936 
      8       196.440000       4.008415 
      8       196.310000       4.006977 
      9       196.240000       4.008416 
      9       196.130000       4.006977 
      9       196.100000       4.008389 
      9       196.220000       4.006104 
      9       196.250000       3.998034 
      10       196.080000       3.963109 
      10       196.030000       3.942456 
      10       196.040000       3.955052 
      10       195.930000       3.961254 
      10       195.950000       3.983762 
      10       195.950000       4.001565 
      10       196.030000       4.007972 
      11       195.990000       4.006951 
      11       195.910000       4.007972 
      11       195.920000       4.001578 
      11       195.900000       3.984219 
      11       195.910000       3.967083 
      11       195.930000       3.984192 
      11       195.850000       4.000705 
      11       195.820000       3.997604 
      11       195.960000       3.963539 
      11       196.170000       3.947855 
      12       196.170000       3.979250 
      12       196.120000       4.001148 
      12       196.060000       4.007959 
      12       196.180000       4.006950 
      12       196.070000       4.007972 
      12       196.040000       4.001578 
      13       196.010000       3.984219 
      13       196.000000       3.967083 
      13       195.970000       3.984219 
      13       196.790000       4.001565 
      14       196.840000       4.007516 
      14       196.880000       4.001135 
      14       196.850000       3.979249 
      14       196.880000       3.947855 
      14       196.770000       3.963552 
      14       196.810000       3.998048 
      15       196.800000       4.006104 
      15       196.730000       4.008389 
      15       196.690000       4.006977 
      15       196.730000       4.008416 
      15       196.690000       4.006977 
      15       196.690000       4.008416 
      15       196.710000       4.006964 
      16       196.700000       4.007959 
      16       196.710000       4.001148 
      16       196.620000       3.979250 
      16       196.630000       3.947855 
      16       196.650000       3.963552 
      16       196.630000       3.998047 
      16       196.620000       4.006091 
      16       196.570000       4.007933 
      17       196.640000       4.001148 
      17       197.150000       3.979250 
      17       197.130000       3.947855 
      17       197.100000       3.963552 
      17       197.120000       3.998048 
      17       197.140000       4.006131 
      17       197.110000       4.009262 
      17       197.120000       4.017319 
      18       197.060000       4.050954 
      18       197.070000       4.056740 
      18       197.100000       3.987749 
      18       197.130000       3.934456 
      18       197.190000       3.959040 
      18       197.310000       3.997631 
      18       197.310000       4.006078 
      19       197.280000       4.007946 
      19       197.300000       4.001578 
      19       197.250000       3.984219 
      19       197.310000       3.967083 
      19       197.280000       3.984219 
      19       197.230000       4.001565 
      19       197.250000       4.007529 
      19       197.310000       4.001565 
      19       197.270000       3.984219 
      19       197.220000       3.967083 
      20       197.180000       3.984219 
      20       197.210000       4.001565 
      20       197.480000       4.007529 
      20       197.780000       4.001565 
      20       197.800000       3.984218 
      21       197.820000       3.967070 
      21       197.800000       3.983776 
      21       197.800000       3.996179 
      21       197.830000       3.983776 
      21       197.800000       3.967070 
      21       197.840000       3.984219 
      21       197.790000       4.001578 
      22       197.800000       4.007972 
      22       197.770000       4.006950 
      22       197.740000       4.007959 
      22       197.740000       4.001122 
      22       197.710000       3.978363 
      22       197.700000       3.937057 
      23       197.730000       3.915158 
      23       197.690000       3.918259 
      23       197.750000       3.957710 
      23       197.700000       3.997591 
      23       197.690000       4.006090 
      23       197.700000       4.008362 
      23       197.680000       4.006104 
      23       197.670000       3.998048 
      23       197.740000       3.963552 
      23       197.700000       3.947855 
      23       197.770000       3.979250 
      23       197.710000       4.001148 
      23       197.670000       4.007933 
      24       197.630000       4.006077 
      24       197.660000       3.997617 
      24       197.740000       3.958583 
      24       197.700000       3.928627 
      24       197.730000       3.958583 
      25       197.750000       3.997618 
      25       197.730000       4.006091 
      25       197.780000       4.008389 
      25       197.800000       4.006977 
      25       197.790000       4.008389 
      26       197.760000       4.006091 
      26       197.810000       3.997618 
      26       197.770000       3.958583 
      26       197.790000       3.928627 
      26       197.730000       3.958583 
      26       197.780000       3.997618 
      26       197.810000       4.006091 
      26       197.800000       4.008389 
      26       197.810000       4.006977 
      26       197.760000       4.008416 
      27       197.760000       4.006977 
      27       197.740000       4.008416 
      27       197.710000       4.006977 
      27       197.770000       4.008416 
      27       197.730000       4.006977 
      27       197.710000       4.008416 
      27       197.740000       4.006977 
      27       197.740000       4.008416 
      28       197.760000       4.006977 
      28       197.800000       4.008416 
      28       197.780000       4.006964 
      28       197.780000       4.007973 
      28       197.790000       4.001578 
      28       197.740000       3.984192 
      28       197.770000       3.966210 
      29       197.780000       3.973850 
      29       197.810000       3.958153 
      29       197.820000       3.947412 
      29       197.820000       3.979236 
      29       197.820000       4.001148 
      29       197.740000       4.007959 
      29       197.800000       4.006964 
      29       197.790000       4.008416 
      29       197.750000       4.006977 
      30       197.770000       4.008389 
      30       197.810000       4.006091 
      30       197.780000       3.997618 
      30       197.740000       3.958583 
      30       197.790000       3.928627 
      30       197.800000       3.958583 
      30       197.740000       3.997617 
      30       197.720000       4.006077 
      30       197.770000       4.007932 
      31       197.750000       4.001121 
      31       197.780000       3.978363 
      31       197.800000       3.937057 
      31       197.780000       3.915158 
      31       202.600000       3.918259 
      31       202.730000       3.957710 
      31       202.730000       3.997564 
      31       202.780000       4.005204 
      31       202.770000       3.997591 
      31       202.810000       3.958583 
      32       202.810000       3.928627 
      32       202.780000       3.958583 
      32       202.740000       3.997618 
      32       202.720000       4.006091 
      32       202.670000       4.008389 
      32       202.680000       4.006977 
      33       202.610000       4.008416 
      33       202.690000       4.006977 
      33       202.640000       4.008416 
      33       202.540000       4.006977 
      33       202.610000       4.008416 
      34       202.610000       4.006977 
      34       202.570000       4.008416 
      34       202.550000       4.006977 
      34       202.560000       4.008416 
      34       202.570000       4.006977 
      34       202.580000       4.008416 
      34       202.610000       4.006977 
      34       202.520000       4.008416 
      34       202.520000       4.006977 
      35       202.520000       4.008416 
      35       202.520000       4.006977 
      35       202.540000       4.008416 
      35       202.450000       4.006977 
      35       202.490000       4.008416 
      35       202.530000       4.006977 
      35       202.440000       4.008416 
      36       202.460000       4.006977 
      36       202.430000       4.008416 
      36       202.450000       4.006977 
      36       202.390000       4.008416 
      36       202.450000       4.006977 
      36       202.470000       4.008416 
      37       202.470000       4.006977 
      37       202.430000       4.008416 
      37       202.430000       4.006977 
      37       202.390000       4.008389 
      37       202.370000       4.006104 
      37       202.450000       3.998048 
      37       202.410000       3.963552 
      37       202.410000       3.947855 
      37       202.460000       3.979250 
      37       202.440000       4.001148 
      37       202.420000       4.007959 
      38       202.390000       4.006964 
      39       202.380000       4.008389 
      39       202.300000       4.006104 
      39       202.350000       3.998048 
      39       202.330000       3.963552 
      40       202.290000       3.947842 
      40       202.390000       3.978793 
      40       202.320000       3.995319 
      40       202.300000       3.978793 
      41       202.280000       3.947842 
      41       202.270000       3.963552 
      41       202.330000       3.998048 
      41       202.280000       4.006104 
      42       202.270000       4.008389 
      42       202.220000       4.006977 
      42       202.240000       4.008416 
      42       202.300000       4.006977 
      42       202.270000       4.008416 
      42       202.280000       4.006977 
      42       202.220000       4.008416 
      42       202.280000       4.006977 
      43       202.250000       4.008416 
      43       202.250000       4.006977 
      43       202.210000       4.008416 
      43       202.210000       4.006977 
      43       202.210000       4.008389 
      43       202.220000       4.006104 
      44       202.170000       3.998048 
      44       202.220000       3.963552 
      44       202.250000       3.947855 
      44       202.170000       3.979250 
      44       202.190000       4.001148 
      45       202.210000       4.007959 
      45       202.150000       4.006964 
      45       202.220000       4.008415 
      45       202.190000       4.006964 
      45       202.200000       4.007972 
      46       202.130000       4.001565 
      46       202.160000       3.983776 
      46       202.180000       3.961684 
      46       202.140000       3.960022 
      46       202.120000       3.961684 
      46       202.120000       3.983776 
      46       202.190000       4.001565 
      46       202.120000       4.007946 
      47       202.100000       4.006091 
      47       202.130000       3.998047 
      47       202.140000       3.963552 
      47       202.080000       3.947855 
      48       202.100000       3.979250 
      48       202.110000       4.001148 
      48       202.180000       4.007959 
      48       202.110000       4.006950 
      48       202.130000       4.007972 
      48       202.130000       4.001578 
      48       202.090000       3.984219 
      48       202.070000       3.967083 
      48       202.080000       3.984219 
      49       202.100000       4.001578 
      49       202.080000       4.007973 
      49       202.080000       4.006964 
      49       202.120000       4.008416 
      49       202.100000       4.006977 
      49       202.080000       4.008416 
      49       202.090000       4.006977 
      49       202.060000       4.008416 
      49       202.040000       4.006977 
      50       202.080000       4.008416 
      50       202.070000       4.006977 
      50       202.120000       4.008416 
      50       202.080000       4.006964 
      50       202.040000       4.007959 
      50       202.040000       4.001148 
      51       202.080000       3.979250 
      51       202.040000       3.947855 
      51       201.990000       3.963552 
      51       202.080000       3.998048 
      51       202.030000       4.006104 
      51       202.030000       4.008389 
      51       202.020000       4.006977 
      51       202.050000       4.008416 
      51       202.100000       4.006977 
      51       202.030000       4.008416 
      52       201.960000       4.006977 
      52       202.030000       4.008416 
      52       202.050000       4.006977 
      52       202.050000       4.008416 
      52       202.040000       4.006964 
      52       202.050000       4.007959 
      52       202.010000       4.001148 
      52       202.040000       3.979250 
      52       202.050000       3.947855 
      52       202.010000       3.963552 
      53       202.060000       3.998048 
      53       201.950000       4.006104 
      53       201.960000       4.008389 
      53       202.020000       4.006964 
      53       201.960000       4.007973 
      53       201.990000       4.001578 
      53       202.040000       3.984219 
      53       201.960000       3.967083 
      53       201.990000       3.984219 
      53       201.960000       4.001578 
      54       202.010000       4.007946 
      54       201.970000       4.006091 
      54       201.980000       3.998047 
      54       202.030000       3.963552 
      54       201.970000       3.947855 
      54       201.970000       3.979250 
      54       201.970000       4.001148 
      54       201.970000       4.007959 
      54       201.930000       4.006964 
      54       201.940000       4.008416 
      54       202.000000       4.006977 
      55       201.960000       4.008416 
      55       201.990000       4.006977 
      55       201.950000       4.008416 
      55       201.970000       4.006977 
      55       201.930000       4.008416 
      55       202.000000       4.006977 
      55       201.960000       4.008416 
      55       201.900000       4.006977 
      56       201.920000       4.008416 
      56       201.950000       4.006977 
      56       201.940000       4.008389 
      56       201.910000       4.006118 
      57       201.980000       3.998504 
      57       201.980000       3.969381 
      58       201.870000       3.977021 
      58       201.920000       4.038372 
      58       201.930000       4.046012 
      58       201.930000       4.016889 
      58       201.880000       4.009275 
      58       201.970000       4.007004 
      59       201.910000       4.008416 
      59       201.840000       4.006977 
      59       201.820000       4.008416 
      59       201.920000       4.006977 
      59       201.890000       4.008416 
      59       201.850000       4.006977 
      60       201.870000       4.008416 
      60       201.910000       4.006977 
      60       201.820000       4.008416 
      60       201.880000       4.006977 
      60       201.900000       4.008416 
      60       201.890000       4.006977 
      61       201.890000       4.008416 
