

 time    ||    gripping force   ||   raspberry measurement 

      0       0.050000       -794.572222 
      0       0.280000       -794.572222 
      0       0.050000       -794.572222 
      1       0.210000       -786.626500 
      1       0.050000       -778.760235 
      1       0.250000       -770.972633 
      1       0.190000       -763.262906 
      1       0.350000       -755.630277 
      1       0.460000       -748.073974 
      2       1.510000       -740.593230 
      2       2.010000       -733.186130 
      2       5.560000       -725.749203 
      2       35.410000       -722.234734 
      2       47.990000       -679.419468 
      2       60.360000       -487.531741 
      2       75.710000       -171.152144 
      2       95.080000       20.741422 
      2       125.800000       63.523052 
      2       151.240000       67.017868 
      3       156.730000       67.190700 
      3       152.770000       67.252356 
      3       150.260000       67.190554 
      3       146.800000       67.108941 
      3       145.630000       67.070885 
      3       144.520000       67.041702 
      3       143.400000       67.016651 
      3       142.220000       66.988465 
      3       140.400000       67.028482 
      4       136.120000       67.129428 
      4       133.700000       67.386098 
      4       131.150000       67.946787 
      4       129.830000       68.629134 
      4       129.880000       69.267437 
      4       122.530000       69.790638 
      5       121.210000       70.030852 
      5       116.820000       70.045996 
      5       115.170000       69.933800 
      5       113.610000       69.716647 
      5       110.160000       69.496041 
      5       109.420000       69.442273 
      6       107.080000       69.462272 
      6       105.860000       69.401337 
      6       103.170000       69.284328 
      6       102.720000       69.210338 
      6       102.610000       69.195553 
      6       102.610000       69.191925 
      6       101.870000       69.183371 
      6       99.450000       69.143047 
      6       98.070000       69.098196 
      7       97.530000       69.070858 
      7       97.320000       69.051560 
      7       97.000000       69.053358 
      7       96.370000       69.008870 
      7       91.930000       68.942176 
      7       90.860000       68.925856 
      7       90.490000       68.851071 
      7       90.420000       68.641648 
      9       83.660000       68.434690 
      9       83.530000       68.349831 
      10       83.710000       68.375838 
      10       83.550000       68.356433 
      10       83.560000       68.301367 
      10       83.610000       68.254662 
      11       83.000000       68.174523 
      11       82.670000       68.122050 
      11       82.560000       68.166430 
      11       82.570000       68.280213 
      11       82.740000       68.351461 
      11       82.420000       68.290944 
      12       82.310000       68.213480 
      12       82.180000       68.185157 
      12       82.100000       68.143544 
      12       82.120000       68.103596 
      13       82.050000       68.095096 
      13       82.070000       68.092798 
      13       82.020000       68.094209 
      13       82.040000       68.092771 
      13       81.920000       68.094209 
      13       82.030000       68.092771 
      14       81.520000       68.094209 
      14       81.600000       68.092771 
      14       81.550000       68.094209 
      14       81.470000       68.092771 
      15       81.420000       68.094209 
      15       81.470000       68.092771 
      15       81.490000       68.094209 
      15       81.450000       68.092771 
      16       81.400000       68.094209 
      16       81.390000       68.092771 
      16       81.380000       68.094209 
      16       81.440000       68.092771 
      17       81.210000       68.094209 
      17       80.970000       68.092798 
      17       78.560000       68.095096 
      18       78.330000       68.103569 
      18       77.830000       68.142603 
      18       77.810000       68.172559 
      18       77.850000       68.142603 
      18       77.870000       68.103569 
      19       77.840000       68.095096 
      19       77.880000       68.092798 
      19       77.900000       68.094209 
      19       77.860000       68.092771 
      19       77.820000       68.094209 
      19       77.840000       68.092771 
      20       77.810000       68.094209 
      20       77.860000       68.092771 
      20       77.870000       68.094209 
      20       77.860000       68.092771 
      20       77.860000       68.094209 
      20       77.810000       68.092771 
      20       77.870000       68.094209 
      21       77.910000       68.092771 
      21       77.840000       68.094209 
      21       77.820000       68.092771 
      21       77.860000       68.094209 
      21       77.850000       68.092771 
      22       77.850000       68.094209 
      22       77.870000       68.092771 
      22       77.810000       68.094209 
      22       77.730000       68.092771 
      23       77.730000       68.094209 
      23       77.680000       68.092771 
      23       77.750000       68.094209 
      23       77.820000       68.092771 
      24       77.720000       68.094209 
      24       77.810000       68.092771 
      24       77.770000       68.094209 
      24       77.690000       68.092771 
      25       77.650000       68.094209 
      25       77.790000       68.092771 
      25       77.660000       68.094209 
      25       77.770000       68.092771 
      25       77.680000       68.094209 
      25       77.710000       68.092757 
      25       77.670000       68.093766 
      25       77.750000       68.087372 
      26       77.680000       68.070012 
      26       77.730000       68.052863 
      26       77.720000       68.069569 
      26       77.690000       68.081973 
      26       77.720000       68.069569 
      26       77.660000       68.052863 
      26       77.660000       68.070012 
      26       77.680000       68.087372 
      26       77.660000       68.093766 
      27       77.690000       68.092757 
      27       77.650000       68.094209 
      27       77.670000       68.092771 
      27       77.620000       68.094209 
      27       77.640000       68.092771 
      27       77.630000       68.094209 
      27       77.700000       68.092771 
      27       77.620000       68.094183 
      27       77.630000       68.091898 
      27       77.640000       68.083828 
      28       77.650000       68.048903 
      28       77.640000       68.028249 
      28       77.700000       68.040819 
      28       77.680000       68.046174 
      28       77.650000       68.059187 
      28       77.610000       68.043933 
      28       77.680000       68.033192 
      28       77.610000       68.064586 
      28       77.600000       68.081529 
      28       77.640000       68.069113 
      28       77.650000       68.047464 
      28       77.660000       68.045775 
      29       77.630000       68.046148 
      29       77.620000       68.053345 
      29       77.570000       68.013894 
      29       77.660000       67.963715 
      29       77.620000       67.976741 
      29       77.660000       68.017438 
      29       77.630000       68.063270 
      30       77.640000       68.081489 
      30       77.640000       68.069112 
      30       77.680000       68.047437 
      30       77.580000       68.044929 
      31       77.620000       68.036679 
      31       77.590000       68.021175 
      31       77.540000       68.007570 
      31       77.540000       68.045372 
      31       77.610000       68.081959 
      31       77.660000       68.093323 
      31       77.610000       68.092744 
      31       77.590000       68.094209 
      31       77.630000       68.092757 
      31       77.590000       68.093753 
      32       77.600000       68.086942 
      32       77.620000       68.065030 
      32       77.650000       68.033205 
      32       77.650000       68.043947 
      32       77.580000       68.059644 
      32       77.640000       68.052003 
      32       77.610000       68.069985 
      32       77.640000       68.087358 
      33       77.560000       68.093310 
      33       77.580000       68.086928 
      33       77.570000       68.065043 
      33       77.600000       68.033649 
      33       77.580000       68.049346 
      33       77.600000       68.083841 
      33       77.590000       68.091898 
      33       77.580000       68.094183 
      34       77.650000       68.092771 
      34       77.610000       68.094209 
      34       78.160000       68.092771 
      34       78.460000       68.094209 
      34       78.670000       68.092771 
      35       79.200000       68.094209 
      35       79.240000       68.092771 
      35       79.230000       68.094209 
      35       79.220000       68.092771 
      35       79.190000       68.094183 
      35       79.520000       68.091898 
      35       79.740000       68.083841 
      35       79.770000       68.049346 
      36       80.100000       68.033635 
      36       80.100000       68.064587 
      36       80.060000       68.081113 
      36       80.100000       68.064587 
      36       80.060000       68.033635 
      37       80.030000       68.049332 
      37       80.040000       68.083385 
      37       80.040000       68.086068 
      37       80.030000       68.065003 
      37       80.020000       68.033205 
      38       80.070000       68.043947 
      38       80.280000       68.059644 
      38       80.360000       68.051990 
      38       80.370000       68.069542 
      38       80.430000       68.081959 
      39       80.480000       68.069126 
      39       80.520000       68.047464 
      39       80.600000       68.045815 
      39       80.610000       68.047477 
      39       80.580000       68.069569 
      39       80.580000       68.087358 
      40       80.580000       68.093766 
      40       80.570000       68.092757 
      40       80.600000       68.094209 
      40       80.680000       68.092771 
      40       80.670000       68.094209 
      41       80.650000       68.092771 
      41       80.570000       68.094209 
      41       80.650000       68.092771 
      41       80.640000       68.094209 
      41       80.680000       68.092771 
      41       80.640000       68.094209 
      42       80.630000       68.092771 
      42       80.630000       68.094209 
      42       80.590000       68.092771 
      42       80.560000       68.094209 
      42       80.600000       68.092771 
      42       80.550000       68.094209 
      42       80.540000       68.092757 
      42       80.600000       68.093753 
      42       80.610000       68.086942 
      42       80.600000       68.065043 
      43       80.630000       68.033622 
      43       80.600000       68.048473 
      43       80.600000       68.073473 
      43       80.560000       68.048473 
      43       80.600000       68.033622 
      43       80.600000       68.065043 
      43       80.610000       68.086942 
      43       80.570000       68.093753 
      44       80.580000       68.092744 
      44       80.540000       68.093766 
      44       80.530000       68.087372 
      44       80.570000       68.070012 
      44       80.550000       68.052877 
      45       80.540000       68.070012 
      45       80.560000       68.087372 
      45       80.540000       68.093766 
      45       80.530000       68.092757 
      45       80.580000       68.094209 
      45       80.520000       68.092771 
      45       80.520000       68.094209 
      46       80.530000       68.092771 
      46       80.570000       68.094209 
      46       80.510000       68.092771 
      46       80.520000       68.094209 
      46       80.560000       68.092771 
      46       80.530000       68.094209 
      46       80.560000       68.092771 
      47       80.560000       68.094209 
      47       80.520000       68.092757 
      47       80.560000       68.093766 
      47       80.560000       68.087358 
      47       80.520000       68.069569 
      47       80.510000       68.047477 
      47       80.510000       68.045815 
      47       80.560000       68.047464 
      47       80.500000       68.069126 
      48       80.510000       68.081959 
      48       80.510000       68.069569 
      48       80.530000       68.052863 
      48       80.570000       68.069985 
      48       80.520000       68.086498 
      48       80.500000       68.083384 
      48       80.510000       68.048889 
      49       80.550000       68.028249 
      49       80.550000       68.040846 
      49       80.530000       68.047048 
      49       80.580000       68.069556 
      49       80.520000       68.087358 
      49       80.520000       68.093766 
      50       80.510000       68.092757 
      50       80.540000       68.094209 
      50       80.520000       68.092771 
      50       80.530000       68.094209 
      50       80.490000       68.092771 
      50       80.540000       68.094209 
      50       80.460000       68.092771 
      50       80.460000       68.094209 
      50       80.570000       68.092771 
      50       80.560000       68.094209 
      51       80.530000       68.092771 
      51       80.470000       68.094209 
      51       80.530000       68.092771 
      51       80.520000       68.094209 
      51       80.490000       68.092771 
      52       80.440000       68.094209 
      52       80.520000       68.092771 
      52       80.490000       68.094209 
      52       80.520000       68.092771 
      52       80.430000       68.094209 
      52       80.530000       68.092771 
      52       80.490000       68.094209 
      53       80.510000       68.092771 
      53       80.450000       68.094209 
      53       80.470000       68.092771 
      53       80.410000       68.094209 
      53       80.420000       68.092771 
      53       80.480000       68.094209 
      54       80.480000       68.092771 
      54       80.440000       68.094209 
      54       80.450000       68.092771 
      54       80.500000       68.094209 
      54       80.450000       68.092771 
      54       80.420000       68.094209 
      54       80.410000       68.092771 
      55       80.410000       68.094209 
      55       80.420000       68.092771 
      55       80.320000       68.094209 
      55       80.510000       68.092771 
      55       80.420000       68.094209 
      55       80.380000       68.092771 
      55       80.410000       68.094209 
      55       80.410000       68.092771 
      55       80.400000       68.094209 
      55       80.420000       68.092771 
      56       80.400000       68.094209 
      56       80.380000       68.092771 
      56       80.400000       68.094209 
      56       80.410000       68.092771 
      56       80.340000       68.094209 
      56       80.400000       68.092757 
      56       80.430000       68.093766 
      57       80.360000       68.087372 
      57       80.380000       68.070012 
      57       80.340000       68.052876 
      57       80.370000       68.069972 
      57       80.440000       68.086055 
      57       80.370000       68.077999 
      57       80.370000       68.025135 
      57       80.400000       67.993754 
      57       80.430000       68.040819 
      57       80.410000       68.080656 
      57       80.400000       68.082511 
      58       80.430000       68.044336 
      58       80.370000       68.013964 
      58       80.350000       68.038521 
      58       80.340000       68.053372 
      58       80.410000       68.022394 
      58       80.310000       68.005894 
      58       80.420000       68.023280 
      58       80.370000       68.064170 
      58       80.390000       68.086915 
      58       80.390000       68.093752 
      58       80.390000       68.092757 
      59       80.410000       68.094182 
      59       80.370000       68.091884 
      59       80.390000       68.083411 
      59       80.390000       68.044363 
      59       80.380000       68.013964 
      59       80.370000       68.038547 
      59       80.330000       68.054218 
      59       80.360000       68.031876 
      59       80.310000       68.038507 
      60       80.360000       68.034990 
      60       80.350000       68.006280 
      60       80.420000       68.016622 
      60       80.360000       68.022850 
      60       80.370000       68.048446 
      60       80.350000       68.083371 
      60       80.330000       68.086498 
      60       80.350000       68.069985 
      60       80.310000       68.052876 
