

 time    ||    gripping force   ||   raspberry measurement 

      0       69.840000       3.056810 
      0       19.770000       3.086766 
      0       16.950000       3.056810 
      0       16.450000       3.017776 
      0       16.050000       3.009302 
      0       15.370000       3.007004 
      0       13.460000       3.008416 
      0       12.940000       3.006977 
      0       12.510000       3.008416 
      1       11.640000       3.006977 
      1       12.170000       3.008414 
      1       12.050000       3.006855 
      1       12.030000       3.004265 
      1       11.660000       2.952932 
      1       11.570000       2.721286 
      1       11.630000       2.299006 
      1       11.610000       2.011356 
      1       11.550000       1.967676 
      1       11.110000       1.987828 
      2       10.960000       1.962681 
      2       10.730000       1.947815 
      2       10.590000       1.978793 
      2       10.590000       1.995319 
      2       10.690000       1.978793 
      2       10.740000       1.947801 
      2       10.740000       1.962209 
      2       10.680000       1.981394 
      2       10.790000       1.927657 
      2       10.730000       1.858667 
      2       10.840000       1.864895 
      2       10.810000       1.903930 
      2       10.850000       1.936157 
      2       10.890000       1.978336 
      2       10.870000       2.001121 
      2       10.840000       2.007959 
      2       10.940000       2.006937 
      3       10.870000       2.007503 
      3       10.930000       1.995306 
      3       11.010000       1.949653 
      3       10.720000       1.883764 
      3       10.890000       1.899461 
      3       10.730000       1.968451 
      3       10.580000       2.000262 
      3       10.580000       2.007892 
      3       10.670000       2.005620 
      3       10.690000       1.991762 
      3       10.700000       1.928557 
      3       10.660000       1.859566 
      3       10.690000       1.875197 
      3       10.680000       1.945139 
      3       10.730000       1.969682 
      3       10.670000       1.883749 
      3       10.730000       1.792720 
      3       10.700000       1.813387 
      3       10.720000       1.861281 
      4       10.720000       1.926341 
      4       10.740000       1.962972 
      4       10.760000       1.946068 
      4       10.740000       1.957657 
      4       10.790000       1.968008 
      4       10.830000       1.936614 
      4       10.760000       1.920074 
      4       10.790000       1.936600 
      4       10.720000       1.967578 
      4       10.780000       1.952728 
      4       10.780000       1.928170 
      4       10.800000       1.958556 
      4       10.760000       1.997174 
      4       10.850000       2.000692 
      4       10.810000       1.984192 
      4       10.790000       1.967083 
      4       10.840000       1.984219 
      4       10.820000       2.001578 
      4       10.890000       2.007973 
      4       10.830000       2.006964 
      4       10.910000       2.008389 
      4       10.880000       2.006104 
      4       10.850000       1.998034 
      4       10.870000       1.963096 
      4       10.890000       1.942026 
      5       10.840000       1.950057 
      5       10.890000       1.941140 
      5       10.850000       1.952298 
      5       10.920000       1.949640 
      5       10.750000       1.926315 
      5       13.550000       1.959968 
      5       56.420000       1.995292 
      5       97.510000       1.996704 
      5       120.880000       1.957670 
      5       120.210000       1.917802 
      5       110.090000       1.909303 
      5       90.680000       1.907031 
      6       90.060000       1.909303 
      6       90.930000       1.917802 
      6       92.380000       1.957697 
      6       93.460000       1.997591 
      6       92.720000       2.006091 
      6       92.510000       2.008431 
      7       92.820000       2.008456 
      7       93.180000       2.029664 
      7       93.420000       2.144896 
      7       93.430000       2.470351 
      7       93.390000       2.907722 
      7       93.410000       3.182526 
      8       93.270000       3.201413 
      8       93.230000       3.097566 
      8       94.330000       3.024973 
      8       94.820000       3.015615 
      8       94.880000       3.036184 
      9       94.860000       3.067538 
      9       94.740000       3.051841 
      9       94.710000       3.017346 
      9       94.590000       3.009289 
      9       94.550000       3.006977 
      9       94.620000       3.007530 
      9       94.570000       2.996179 
      10       96.160000       2.960022 
      10       96.620000       2.927189 
      10       96.560000       2.960022 
      10       96.550000       2.996179 
      10       96.470000       3.007529 
      10       96.480000       3.006951 
      11       96.510000       3.008415 
      11       96.470000       3.006977 
      11       96.410000       3.008389 
      11       96.450000       3.006091 
      11       96.330000       2.997618 
      12       96.330000       2.958583 
      12       96.280000       2.928627 
      12       96.310000       2.958583 
      12       96.270000       2.997618 
      12       96.290000       3.006091 
      12       96.280000       3.008389 
      12       96.280000       3.006977 
      12       96.260000       3.008416 
      12       96.240000       3.006977 
      13       96.170000       3.008416 
      13       96.180000       3.007004 
      14       96.080000       3.009289 
      14       96.180000       3.017346 
      14       97.310000       3.051841 
      14       97.310000       3.067538 
      16       98.420000       3.036144 
      16       98.460000       3.014245 
      17       98.360000       3.007434 
      17       98.320000       3.008403 
      18       98.280000       3.006104 
      18       98.330000       2.998048 
      20       98.270000       2.963552 
      20       98.210000       2.947855 
      20       98.230000       2.979250 
      20       98.220000       3.001148 
      21       98.200000       3.007960 
      21       98.200000       3.006991 
      21       99.330000       3.009302 
      21       100.770000       3.017776 
      21       101.300000       3.056810 
      22       101.280000       3.086793 
      22       101.230000       3.057696 
      22       101.260000       3.028574 
      22       101.180000       3.057696 
      22       101.150000       3.086793 
      24       101.020000       3.056810 
      24       101.050000       3.017802 
      24       101.010000       3.010189 
      24       101.030000       3.017829 
      25       101.020000       3.057697 
      25       100.950000       3.097591 
      25       100.940000       3.106090 
      25       100.910000       3.108362 
      26       100.910000       3.106091 
      26       100.930000       3.097618 
      26       100.880000       3.058583 
      26       100.880000       3.028601 
      26       100.910000       3.057697 
      26       100.930000       3.086793 
      27       100.870000       3.056810 
      27       100.870000       3.017776 
      27       100.890000       3.009302 
      27       100.870000       3.007004 
      28       100.810000       3.008416 
      29       100.800000       3.007004 
      29       100.830000       3.009302 
      29       100.820000       3.017776 
      30       100.810000       3.056810 
      30       100.800000       3.086766 
      30       100.830000       3.056810 
      30       100.830000       3.017802 
      30       100.810000       3.010189 
      30       100.750000       3.017829 
      30       100.790000       3.057697 
      30       100.760000       3.097564 
      31       100.790000       3.105204 
      31       100.740000       3.097564 
      31       100.770000       3.057696 
      32       100.750000       3.017802 
      32       100.790000       3.009316 
      32       100.740000       3.007461 
      33       100.730000       3.014245 
      34       100.710000       3.036144 
      34       100.650000       3.067538 
      34       100.730000       3.051841 
      34       100.700000       3.017346 
      34       100.730000       3.009289 
      34       100.690000       3.007004 
      35       100.730000       3.008416 
      35       100.750000       3.007004 
      35       100.790000       3.009302 
      36       100.670000       3.017802 
      36       100.640000       3.057696 
      36       100.680000       3.097564 
      36       100.690000       3.105204 
      36       100.700000       3.097591 
      36       100.680000       3.058569 
      36       100.690000       3.028171 
      37       100.700000       3.052727 
      37       100.690000       3.067565 
      38       100.660000       3.036131 
      38       100.620000       3.013815 
      38       100.650000       3.002478 
      38       100.590000       2.989645 
      38       100.670000       2.991737 
      38       100.610000       3.029942 
      39       100.660000       3.054942 
      39       100.630000       3.072521 
      39       100.640000       3.053157 
      39       100.640000       3.028157 
      41       100.670000       3.057683 
      41       100.580000       3.086792 
      42       100.580000       3.056810 
      42       100.640000       3.017802 
      42       100.580000       3.010188 
      42       100.590000       3.017802 
      44       100.570000       3.056810 
      44       100.530000       3.086766 
      44       100.570000       3.056810 
      44       100.540000       3.017776 
      45       100.550000       3.009302 
      45       100.500000       3.007004 
      45       100.500000       3.008416 
      46       100.510000       3.006977 
      46       100.500000       3.008416 
      46       100.460000       3.006977 
      47       100.490000       3.008416 
      47       100.510000       3.006977 
      48       100.460000       3.008416 
      48       100.490000       3.006977 
      48       100.460000       3.008416 
      48       100.480000       3.006977 
      48       100.430000       3.008416 
      48       100.470000       3.006964 
      50       100.480000       3.007973 
      50       100.430000       3.001578 
      51       100.470000       2.984219 
      52       100.450000       2.967083 
      52       100.460000       2.984219 
      52       100.460000       3.001578 
      53       100.480000       3.007986 
      53       100.440000       3.007420 
      53       100.450000       3.014231 
      53       100.430000       3.035714 
      53       100.440000       3.062596 
      53       100.470000       3.033499 
      54       100.420000       3.007504 
      54       100.460000       3.055012 
      54       100.430000       3.094862 
      54       100.460000       3.096691 
      56       100.440000       3.057670 
      56       100.450000       3.017829 
      56       100.410000       3.010189 
      56       100.460000       3.017829 
      56       100.460000       3.057697 
      56       100.480000       3.097591 
      57       100.440000       3.106090 
      57       100.390000       3.108362 
      58       100.500000       3.106090 
      58       100.430000       3.097591 
      59       100.370000       3.057697 
      59       100.440000       3.017829 
      60       100.430000       3.010189 
      60       100.410000       3.017802 
      60       100.420000       3.056810 
      60       100.410000       3.086752 
