

 time    ||    gripping force   ||   raspberry measurement 

      0       0.010000       61.898135 
      0       0.070000       61.898135 
      0       0.110000       61.898135 
      0       0.090000       61.898135 
      0       0.180000       61.898135 
      0       0.040000       -802.073913 
      0       0.190000       -802.073913 
      0       0.470000       -802.073913 
      0       0.260000       -802.073913 
      0       0.040000       -802.073913 
      0       0.020000       -802.073913 
      0       0.150000       -802.073913 
      0       0.080000       -802.073913 
      0       0.030000       -802.073913 
      0       0.020000       -802.073913 
      0       0.020000       -802.073913 
      0       0.060000       -802.073913 
      1       0.150000       -802.073913 
      1       0.270000       -802.073913 
      1       0.150000       -794.053174 
      1       0.080000       -786.112642 
      1       0.320000       -786.112642 
      1       0.480000       -786.112642 
      1       0.620000       -786.112642 
      1       3.520000       -786.112642 
      1       28.080000       -786.112642 
      1       39.700000       -778.251516 
      1       71.190000       -770.468996 
      1       82.800000       -762.763126 
      1       92.000000       -762.763126 
      1       92.650000       -762.763126 
      1       91.650000       -755.029249 
      1       91.210000       -755.029249 
      1       90.930000       -755.029249 
      1       90.290000       -755.029249 
      1       89.990000       -755.029249 
      1       89.850000       -755.029249 
      1       89.510000       -755.029249 
      1       89.190000       -751.475336 
      2       89.130000       -708.179550 
      2       88.960000       -708.179550 
      2       88.560000       -708.179550 
      2       89.170000       -514.138257 
      2       102.890000       -194.207215 
      2       111.510000       -0.150224 
      2       113.640000       -0.150224 
      2       113.070000       43.148662 
      2       112.650000       46.704431 
      2       112.090000       46.810432 
      2       110.960000       46.816635 
      2       107.630000       46.859307 
      2       99.740000       47.065980 
      2       87.700000       47.442028 
      2       72.580000       47.755287 
      2       55.230000       47.886770 
      2       43.840000       47.909707 
      3       38.870000       47.916115 
      3       39.010000       47.916115 
      3       41.180000       47.916115 
      3       45.180000       47.952994 
      3       54.880000       48.130071 
      3       61.490000       48.442001 
      3       66.050000       48.442001 
      3       66.740000       48.690309 
      3       66.230000       48.782228 
      3       64.580000       48.782228 
      3       62.650000       48.782228 
      3       56.730000       48.759820 
      3       51.600000       48.708295 
      3       45.530000       48.623976 
      3       43.800000       48.414551 
      4       42.620000       48.130847 
      4       42.960000       47.881011 
      4       44.100000       47.613414 
      4       45.730000       47.284414 
      4       47.230000       47.042391 
      4       48.560000       47.002899 
      4       50.460000       47.002899 
      4       50.700000       47.200570 
      4       50.720000       47.525361 
      4       50.650000       47.740451 
      4       50.690000       47.787546 
      4       50.620000       47.711324 
      4       50.600000       47.711324 
      4       50.630000       47.461685 
      4       50.640000       47.140440 
      5       50.640000       46.977622 
      5       50.610000       46.956091 
      5       50.590000       46.936269 
      5       50.610000       46.924216 
      5       50.630000       46.942097 
      5       50.530000       46.985579 
      5       50.660000       46.985579 
      5       50.570000       46.985579 
      5       50.550000       47.038099 
      5       50.600000       47.159001 
      5       50.610000       47.266667 
      5       50.560000       47.226703 
      5       50.550000       47.156955 
      5       50.520000       47.138017 
      5       50.590000       47.207587 
      6       50.510000       47.261297 
      6       50.530000       47.240673 
      6       50.490000       47.240673 
      6       50.600000       47.229130 
      6       50.570000       47.255415 
      6       50.500000       47.273963 
      6       50.510000       47.244218 
      6       50.500000       47.239468 
      6       50.520000       47.231635 
      6       50.500000       47.222897 
      6       50.440000       47.230722 
      6       50.450000       47.227796 
      6       50.480000       47.185442 
      6       50.520000       47.150266 
      6       50.470000       47.150266 
      7       50.480000       47.139705 
      7       50.510000       47.149336 
      7       50.450000       47.149336 
      7       50.440000       47.109666 
      7       50.420000       47.074933 
      7       50.450000       47.067100 
      7       50.480000       47.088292 
      7       50.450000       47.104336 
      7       50.450000       47.090920 
      7       50.420000       47.014745 
      7       50.420000       46.954242 
      7       50.400000       47.024684 
      7       50.460000       47.130275 
      7       50.410000       47.156923 
      7       50.390000       47.149576 
      7       50.450000       47.149576 
      8       50.370000       47.179778 
      8       50.430000       47.179209 
      8       50.450000       47.164552 
      8       50.420000       47.152828 
      8       50.440000       47.192305 
      8       50.370000       47.247817 
      8       50.390000       47.257268 
      8       50.370000       47.236602 
      8       50.420000       47.138486 
      8       50.390000       47.047997 
      8       50.290000       47.066808 
      8       50.360000       47.112474 
      8       50.290000       47.172178 
      8       50.190000       47.251348 
      8       50.240000       47.251348 
      9       50.210000       47.299891 
      9       50.170000       47.299891 
      9       50.200000       47.293536 
      9       50.180000       47.229932 
      9       50.130000       47.147056 
      9       50.150000       47.162723 
      9       50.190000       47.184179 
      9       50.190000       47.184179 
      9       50.220000       47.135398 
      9       50.190000       47.149244 
      9       50.170000       47.197178 
      9       50.120000       47.204389 
      9       50.220000       47.204389 
      9       50.190000       47.183780 
      9       50.200000       47.153284 
      9       50.100000       47.178880 
      10       50.160000       47.250502 
      10       50.120000       47.250502 
      10       50.110000       47.283734 
      10       50.200000       47.221805 
      10       50.190000       47.120174 
      10       50.110000       47.112464 
      10       49.630000       47.181950 
      10       49.530000       47.158139 
      10       49.040000       47.158139 
      10       49.130000       47.049298 
      10       49.090000       46.976198 
      10       49.250000       46.976198 
      10       49.340000       47.027812 
      10       49.570000       47.126745 
      10       49.530000       47.131327 
      11       49.610000       47.131327 
      11       49.520000       47.111994 
      11       49.540000       47.164538 
      11       49.630000       47.219547 
      11       49.560000       47.233585 
      11       49.530000       47.224936 
      11       49.610000       47.252369 
      11       49.590000       47.239690 
      11       49.560000       47.160480 
      11       49.610000       47.063583 
      11       49.580000       46.980707 
      11       49.560000       46.963694 
      11       49.580000       46.963694 
      11       49.570000       47.027702 
      11       49.580000       47.072108 
      12       49.630000       47.070270 
      12       49.590000       47.088292 
      12       49.550000       47.101179 
      12       49.640000       47.094174 
      12       49.590000       47.101639 
      12       49.620000       47.157822 
      12       49.540000       47.189454 
      12       49.590000       47.189454 
      12       49.610000       47.163249 
      12       49.570000       47.127206 
      12       49.570000       47.127206 
      12       49.600000       47.151582 
      12       49.620000       47.213775 
      12       49.580000       47.282365 
      12       49.660000       47.261273 
      13       49.580000       47.228629 
      13       49.580000       47.229889 
      13       49.590000       47.229889 
      13       49.660000       47.147039 
      13       49.580000       47.098649 
      13       49.660000       47.154613 
      13       49.580000       47.194007 
      13       49.590000       47.181537 
      13       49.670000       47.135757 
      13       49.620000       47.090951 
      13       49.640000       47.068153 
      13       49.610000       47.129446 
      13       49.600000       47.168064 
      13       49.610000       47.074767 
      13       49.600000       47.074767 
      14       49.620000       47.028315 
      14       49.550000       47.028315 
      14       49.630000       47.096696 
      14       49.650000       47.096696 
      14       49.610000       47.204883 
      14       49.540000       47.205098 
      14       49.580000       47.205098 
      14       49.610000       47.205098 
      14       49.620000       47.117515 
      14       49.580000       47.096683 
      14       49.690000       47.115213 
      14       49.570000       47.115213 
      14       49.650000       47.115213 
      14       49.630000       47.068456 
      14       49.580000       47.044880 
      14       49.610000       47.032521 
      15       49.570000       47.028324 
      15       49.620000       47.055402 
      15       49.640000       47.074393 
      15       49.640000       47.049187 
      15       49.600000       47.058709 
      15       49.610000       47.052758 
      15       49.620000       47.032297 
      15       49.570000       47.063086 
      15       49.650000       47.063086 
      15       49.690000       47.101704 
      15       49.630000       47.101704 
      15       49.700000       47.101704 
      15       49.620000       47.104805 
      15       49.620000       47.083793 
      15       49.610000       47.053271 
      16       49.620000       47.078437 
      16       49.610000       47.145143 
      16       49.590000       47.160840 
      16       49.600000       47.160840 
      16       49.590000       47.097248 
      16       49.700000       47.058643 
      16       49.800000       47.088749 
      16       49.780000       47.118674 
      16       49.760000       47.099021 
      16       49.920000       47.036271 
      16       49.920000       47.044798 
      16       49.900000       47.044798 
      16       49.920000       47.084693 
      16       49.870000       47.124573 
      16       49.880000       47.124573 
      17       49.910000       47.124573 
      17       49.950000       47.198536 
      17       49.940000       47.198536 
      17       49.890000       47.198536 
      17       49.860000       47.223549 
      17       49.930000       47.205747 
      17       49.910000       47.151831 
      17       49.910000       47.073078 
      17       49.870000       47.023259 
      17       49.890000       47.014786 
      17       49.830000       47.023286 
      17       49.860000       47.023286 
      17       49.920000       47.073938 
      17       49.890000       47.161756 
      17       49.880000       47.161756 
      18       49.920000       47.243759 
      18       49.850000       47.243759 
      18       49.900000       47.259456 
      18       49.860000       47.180581 
      18       49.880000       47.079834 
      18       49.870000       47.079834 
      18       49.930000       47.036286 
      18       49.900000       47.036286 
      18       49.850000       47.084763 
      18       49.860000       47.198963 
      18       49.910000       47.270641 
      18       49.830000       47.214676 
      18       49.840000       47.214676 
      18       49.900000       47.151888 
      18       49.840000       47.129529 
      19       49.920000       47.084649 
      19       49.900000       47.040785 
      19       49.860000       47.040785 
      19       49.820000       47.007119 
      19       49.840000       47.038553 
      19       49.860000       47.079683 
      19       49.860000       47.109818 
      19       49.980000       47.109818 
      19       49.830000       47.109818 
      19       49.880000       47.190382 
      19       49.880000       47.200720 
      19       49.940000       47.099919 
      19       49.930000       47.031360 
      19       49.920000       47.023728 
      19       49.910000       47.062724 
      20       49.890000       47.107533 
      20       49.910000       47.134818 
      20       49.850000       47.152424 
      20       49.900000       47.152424 
      20       49.870000       47.131675 
      20       49.820000       47.131675 
      20       49.900000       47.111245 
      20       49.880000       47.155499 
      20       49.880000       47.258195 
      20       49.880000       47.275128 
      20       49.870000       47.254655 
      20       49.870000       47.262156 
      20       49.900000       47.203517 
      20       49.850000       47.128688 
      20       49.820000       47.173481 
      20       49.930000       47.173481 
      21       49.900000       47.250485 
      21       49.820000       47.250485 
      21       49.840000       47.225015 
      21       49.800000       47.151902 
      21       49.840000       47.119701 
      21       49.910000       47.119701 
      21       49.930000       47.112447 
      21       49.850000       47.118385 
      21       49.850000       47.136147 
      21       49.900000       47.136147 
      21       49.860000       47.136147 
      21       49.920000       47.157796 
      21       49.800000       47.157796 
      21       49.840000       47.154099 
      21       49.890000       47.154099 
      22       50.050000       47.129569 
      22       50.050000       47.083767 
      22       50.300000       47.113902 
      22       50.350000       47.215479 
      22       50.310000       47.253197 
      22       50.320000       47.174242 
      22       50.350000       47.048854 
      22       50.280000       46.954655 
      22       50.360000       46.931453 
      22       50.220000       46.972096 
      22       50.300000       47.052384 
      22       50.260000       47.093067 
      22       50.260000       47.071222 
      22       50.300000       47.071222 
      22       50.400000       46.994092 
      23       50.300000       46.951584 
      23       50.390000       47.033144 
      23       50.370000       47.033144 
      23       50.420000       47.173809 
      23       50.400000       47.200264 
      23       50.390000       47.110677 
      23       50.390000       47.079753 
      23       50.370000       47.103530 
      23       50.340000       47.111561 
      23       50.370000       47.123731 
      23       50.400000       47.123731 
      23       50.290000       47.123731 
      23       50.370000       47.123731 
      23       50.430000       47.159941 
      23       50.300000       47.193620 
      23       50.380000       47.170256 
      24       50.350000       47.166309 
      24       50.370000       47.162639 
      24       50.320000       47.162639 
      24       50.330000       47.098591 
      24       50.370000       47.073552 
      24       50.340000       47.146459 
      24       50.400000       47.146459 
      24       50.280000       47.181533 
      24       50.340000       47.119551 
      24       50.370000       47.080292 
      24       50.300000       47.080526 
      24       50.330000       47.079873 
      24       50.400000       47.079873 
      24       50.350000       47.051416 
      24       50.290000       47.080735 
      25       50.310000       47.080735 
      25       50.280000       47.080735 
      25       50.370000       47.154059 
      25       50.310000       47.205247 
      25       50.330000       47.150515 
      25       50.230000       47.057797 
      25       50.320000       47.025960 
      25       50.350000       47.025960 
      25       50.310000       47.041197 
      25       50.330000       47.072552 
      25       50.370000       47.062240 
      25       50.280000       47.062240 
      25       50.290000       47.051942 
      25       50.310000       47.083793 
      25       50.330000       47.106135 
      26       50.370000       47.106135 
      26       50.200000       47.117902 
      26       50.360000       47.135730 
      26       50.270000       47.153699 
      26       50.300000       47.153699 
      26       50.240000       47.145186 
      26       50.330000       47.150568 
      26       50.330000       47.119617 
      26       50.290000       47.047499 
      26       50.250000       47.047499 
      26       50.300000       47.078451 
      26       50.270000       47.151371 
      26       50.260000       47.130911 
      26       50.330000       47.082854 
      26       50.230000       47.100863 
      27       50.260000       47.100863 
      27       50.330000       47.159525 
      27       50.280000       47.211975 
      27       50.280000       47.185926 
      27       50.230000       47.150142 
      27       50.230000       47.137543 
      27       50.320000       47.058224 
      27       50.300000       47.058224 
      27       50.250000       46.980361 
      27       50.290000       47.030417 
      27       50.320000       47.153297 
      27       50.260000       47.246484 
      27       50.270000       47.282339 
      27       50.260000       47.227690 
      27       50.280000       47.216559 
      28       50.230000       47.283669 
      28       50.290000       47.283669 
      28       50.250000       47.273892 
      28       50.270000       47.216034 
      28       50.270000       47.165867 
      28       50.230000       47.131732 
      28       50.270000       47.131732 
      28       50.230000       47.163209 
      28       50.200000       47.183638 
      28       50.270000       47.183638 
      28       50.250000       47.128630 
      28       50.230000       47.041657 
      28       50.240000       47.039413 
      28       50.240000       47.055123 
      28       50.250000       47.060899 
      29       50.210000       47.060899 
      29       50.250000       47.138985 
      29       50.190000       47.208265 
      29       50.190000       47.203116 
      29       50.250000       47.155888 
      29       50.220000       47.169923 
      29       50.230000       47.169923 
      29       50.230000       47.199836 
      29       50.210000       47.195889 
      29       50.210000       47.138902 
      29       50.190000       47.093236 
      29       50.220000       47.137613 
      29       50.200000       47.180981 
      29       50.200000       47.180981 
      29       50.250000       47.142112 
      29       50.240000       47.142112 
      30       50.170000       47.106595 
      30       50.220000       47.129086 
      30       50.240000       47.129086 
      30       50.250000       47.129086 
      30       50.270000       47.129086 
      30       50.250000       47.124570 
      30       50.160000       47.090535 
      30       50.150000       47.074881 
      30       50.220000       47.170739 
      30       50.210000       47.291737 
      30       50.150000       47.270654 
      30       50.110000       47.270654 
      30       50.240000       47.188238 
      30       50.230000       47.099021 
      30       50.210000       47.052895 
      31       50.220000       47.060080 
      31       50.230000       47.066697 
      31       50.240000       47.099104 
      31       50.130000       47.154555 
      31       50.210000       47.194064 
      31       50.160000       47.194064 
      31       50.210000       47.181082 
      31       50.170000       47.216059 
      31       50.160000       47.259485 
      31       50.120000       47.259485 
      31       50.190000       47.229502 
      31       50.190000       47.242045 
      31       50.190000       47.255857 
      31       50.160000       47.255857 
      31       50.210000       47.255857 
      32       50.150000       47.180245 
      32       50.210000       47.081540 
      32       50.130000       47.056110 
      32       50.150000       47.159995 
      32       50.100000       47.159995 
      32       50.210000       47.159995 
      32       50.160000       47.263068 
      32       50.130000       47.223606 
      32       50.160000       47.206677 
      32       50.210000       47.227617 
      32       50.090000       47.162723 
      32       50.150000       47.162723 
      32       50.210000       47.103592 
      32       50.140000       47.103592 
      32       50.090000       47.157713 
      33       50.170000       47.206590 
      33       50.160000       47.163555 
      33       50.150000       47.163555 
      33       50.120000       47.113389 
      33       50.150000       47.064469 
      33       50.110000       47.038597 
      33       50.160000       47.038597 
      33       50.100000       47.038597 
      33       50.130000       47.087351 
      33       50.140000       47.087351 
      33       50.090000       47.142968 
      33       50.090000       47.146489 
      33       50.110000       47.176637 
      33       50.090000       47.176637 
      33       50.080000       47.229348 
      34       50.070000       47.192734 
      34       50.060000       47.090011 
      34       50.090000       47.064551 
      34       50.000000       47.041987 
      34       50.060000       46.978088 
      34       50.080000       46.978088 
      34       50.070000       46.954158 
      34       50.060000       46.995048 
      34       50.070000       47.059082 
      34       50.030000       47.112432 
      34       50.110000       47.092253 
      34       50.080000       47.086533 
      34       50.060000       47.144218 
      34       50.050000       47.160936 
      34       50.110000       47.164858 
      34       50.060000       47.174379 
      35       50.090000       47.139288 
      35       50.120000       47.139288 
      35       50.130000       47.120630 
      35       50.070000       47.114635 
      35       50.070000       47.123297 
      35       50.080000       47.088183 
      35       50.080000       47.067292 
      35       50.050000       47.122222 
      35       50.070000       47.141156 
      35       50.080000       47.141156 
      35       50.090000       47.088692 
      35       50.080000       47.036702 
      35       50.040000       46.994190 
      35       50.090000       47.052882 
      35       50.100000       47.052882 
      36       50.060000       47.164455 
      36       50.100000       47.212418 
      36       50.080000       47.212418 
      36       50.070000       47.252343 
      36       50.040000       47.251374 
      36       50.020000       47.220612 
      36       50.090000       47.220612 
      36       50.030000       47.204310 
      36       50.060000       47.178020 
      36       50.030000       47.189525 
      36       50.010000       47.208888 
      36       50.010000       47.138886 
      36       50.070000       47.082105 
      36       50.060000       47.082105 
      36       50.050000       47.082105 
      37       50.030000       47.084184 
      37       50.010000       47.165893 
      37       50.030000       47.244160 
      37       50.000000       47.195875 
      37       50.010000       47.195875 
      37       50.040000       47.094109 
      37       50.030000       47.091022 
      37       50.030000       47.091022 
      37       50.110000       47.175692 
      37       49.960000       47.175692 
      37       50.000000       47.231257 
      37       49.470000       47.197195 
      37       49.480000       47.186493 
      37       49.160000       47.237959 
      37       49.080000       47.226384 
      37       49.280000       47.181955 
      38       49.240000       47.181955 
      38       49.320000       47.194134 
      38       49.400000       47.194134 
      38       49.430000       47.219546 
      38       49.420000       47.203962 
      38       49.520000       47.154116 
      38       49.450000       47.147454 
      38       49.500000       47.092706 
      38       49.560000       46.993733 
      38       49.450000       46.991009 
      38       49.480000       46.991009 
      38       49.490000       47.075665 
      38       49.570000       47.130344 
      38       49.480000       47.085551 
      39       49.460000       47.028617 
      39       49.540000       47.025504 
      39       49.520000       47.064508 
      39       49.490000       47.064508 
      39       49.530000       47.107463 
      39       49.540000       47.067182 
      39       49.610000       47.035815 
      39       49.510000       47.035815 
      39       49.610000       47.035815 
      39       49.560000       47.035815 
      39       49.650000       47.070780 
      39       49.580000       47.070780 
      39       49.490000       47.070780 
      39       49.600000       47.070780 
      39       49.530000       47.066240 
      40       49.650000       47.082534 
      40       49.570000       47.141476 
      40       49.640000       47.152397 
      40       49.520000       47.124103 
      40       49.590000       47.124559 
      40       49.640000       47.092709 
      40       49.580000       47.092709 
      40       49.530000       47.080249 
      40       49.640000       47.080249 
      40       49.660000       47.108350 
      40       49.540000       47.062280 
      40       49.600000       47.017447 
      40       49.640000       47.017447 
      40       49.660000       47.017447 
      40       49.550000       47.017447 
      41       49.650000       47.060026 
      41       49.650000       47.060026 
      41       49.560000       47.100332 
      41       49.630000       47.112919 
      41       49.570000       47.121432 
      41       49.680000       47.151427 
      41       49.590000       47.153257 
      41       49.600000       47.124116 
      41       49.630000       47.124117 
      41       49.640000       47.087323 
      41       49.710000       47.087323 
      41       49.640000       47.056495 
      41       49.670000       47.056495 
      41       49.640000       47.073894 
      41       49.630000       47.063596 
      42       49.690000       47.067709 
      42       49.620000       47.151401 
      42       49.620000       47.151401 
      42       49.680000       47.206159 
      42       49.690000       47.164844 
      42       49.650000       47.128673 
      42       49.690000       47.125362 
      42       49.670000       47.125362 
      42       49.610000       47.098644 
      42       49.650000       47.026333 
      42       49.720000       47.005873 
      42       49.620000       47.037074 
      42       49.740000       47.082503 
      42       49.760000       47.106095 
      42       49.830000       47.106095 
      42       49.860000       47.117875 
      43       49.740000       47.134844 
      43       49.810000       47.142928 
      43       49.730000       47.097705 
      43       49.840000       47.082451 
      43       49.760000       47.129986 
      43       49.830000       47.159955 
      43       49.790000       47.187849 
      43       49.770000       47.206094 
      43       49.830000       47.206094 
      43       49.770000       47.206094 
      43       49.780000       47.212462 
      43       49.810000       47.212462 
      43       49.730000       47.209721 
      43       49.780000       47.209721 
      43       49.810000       47.190933 
      44       49.790000       47.190933 
      44       49.740000       47.190933 
      44       49.800000       47.109776 
      44       49.760000       47.034544 
      44       49.810000       47.097691 
      44       49.810000       47.190353 
      44       49.840000       47.148379 
      44       49.880000       47.048276 
      44       49.880000       46.993360 
      44       49.870000       47.029917 
      44       49.910000       47.135411 
      44       49.780000       47.151760 
      44       49.820000       47.143484 
      44       49.930000       47.130722 
      44       49.920000       47.107170 
      44       49.840000       47.064000 
      45       49.900000       47.038583 
      45       49.960000       47.087324 
      45       49.860000       47.142069 
      45       49.910000       47.142069 
      45       49.870000       47.135288 
      45       49.890000       47.124160 
      45       49.910000       47.141130 
      45       49.870000       47.141130 
      45       49.880000       47.172095 
      45       49.960000       47.172095 
      45       49.860000       47.172095 
      45       49.920000       47.156411 
      45       49.920000       47.122775 
      45       49.920000       47.124604 
      45       49.870000       47.159081 
      46       49.920000       47.182809 
      46       49.990000       47.121459 
      46       49.870000       47.121459 
      46       49.880000       47.082452 
      46       49.940000       47.082452 
      46       49.960000       47.082452 
      46       49.880000       47.106259 
      46       49.910000       47.120973 
      46       50.010000       47.174867 
      46       49.930000       47.253602 
      46       49.890000       47.305206 
      46       49.870000       47.249588 
      46       50.000000       47.249588 
      46       49.910000       47.249588 
      46       49.890000       47.145655 
      46       49.900000       47.060899 
      47       49.950000       46.982532 
      47       49.930000       46.969480 
      47       49.970000       46.990562 
      47       49.940000       47.030846 
      47       49.910000       47.127730 
      47       49.960000       47.183141 
      47       49.860000       47.156896 
      47       49.910000       47.095837 
      47       49.950000       47.066351 
      47       49.980000       47.058711 
      47       49.990000       47.121889 
      47       50.010000       47.211505 
      47       50.040000       47.217277 
      47       49.980000       47.217277 
      47       50.070000       47.217277 
      48       50.010000       47.157783 
      48       50.060000       47.157783 
      48       50.030000       47.072539 
      48       50.070000       47.031413 
      48       50.020000       47.052882 
      48       50.030000       47.127271 
      48       50.110000       47.177897 
      48       50.030000       47.199006 
      48       50.080000       47.242444 
      48       50.060000       47.226761 
      48       50.130000       47.180678 
      48       50.060000       47.179239 
      48       50.090000       47.162227 
      48       50.110000       47.144810 
      48       50.030000       47.144810 
      49       49.990000       47.138845 
      49       50.050000       47.078894 
      49       50.160000       47.065424 
      49       50.000000       47.129446 
      49       50.050000       47.129446 
      49       50.090000       47.129446 
      49       50.040000       47.104859 
      49       50.070000       47.057798 
      49       50.080000       47.057798 
      49       50.110000       47.071670 
      49       50.020000       47.118744 
      49       50.130000       47.181963 
      49       50.050000       47.152301 
      49       50.120000       47.103174 
      49       50.110000       47.163529 
      50       50.000000       47.236185 
      50       50.100000       47.236185 
      50       50.070000       47.227646 
      50       50.080000       47.177467 
      50       50.040000       47.093622 
      50       50.070000       47.093622 
      50       50.080000       47.039013 
      50       50.100000       47.062710 
      50       50.120000       47.091806 
      50       50.030000       47.067210 
      50       50.130000       47.052398 
      50       50.130000       47.084679 
      50       50.140000       47.116516 
      50       50.080000       47.161783 
      50       50.070000       47.202120 
      51       50.040000       47.202120 
      51       50.110000       47.210634 
      51       50.070000       47.212932 
      51       50.100000       47.211520 
      51       50.070000       47.212960 
      51       50.070000       47.211574 
      51       50.070000       47.214732 
      51       50.060000       47.214732 
      51       50.030000       47.233104 
      51       49.990000       47.309304 
      51       50.100000       47.365698 
      51       50.080000       47.365698 
      51       50.080000       47.365698 
      51       50.170000       47.365698 
      51       50.010000       47.285510 
      52       50.160000       47.285510 
      52       50.050000       47.191906 
      52       50.280000       47.174767 
      52       49.990000       47.138553 
      52       50.210000       47.112048 
      52       50.120000       47.159126 
      52       50.100000       47.194436 
      52       50.150000       47.182006 
      52       50.070000       47.141533 
      52       50.170000       47.118385 
      52       50.060000       47.107021 
      52       50.150000       47.094174 
      52       50.050000       47.095824 
      52       50.110000       47.128657 
      52       50.090000       47.130359 
      53       50.080000       47.119244 
      53       50.140000       47.119244 
      53       50.060000       47.119244 
      53       50.100000       47.128148 
      53       50.030000       47.185577 
      53       50.130000       47.231647 
      53       50.080000       47.190949 
      53       50.120000       47.151888 
      53       50.150000       47.153270 
      53       50.120000       47.153270 
      53       50.200000       47.124086 
      53       50.080000       47.059596 
      53       50.200000       46.988764 
      53       50.140000       47.004501 
      53       50.120000       47.079710 
      54       50.070000       47.144783 
      54       50.130000       47.220435 
      54       50.150000       47.241558 
      54       50.160000       47.194467 
      54       50.110000       47.164095 
      54       50.120000       47.131688 
      54       50.160000       47.100057 
      54       50.040000       47.102553 
      54       50.110000       47.163678 
      54       50.090000       47.219051 
      54       50.100000       47.227327 
      54       50.070000       47.227327 
      54       50.100000       47.227327 
      54       50.120000       47.190854 
      54       50.120000       47.175792 
      55       50.200000       47.195783 
      55       50.030000       47.245655 
      55       50.140000       47.228489 
      55       50.050000       47.113845 
      55       50.200000       47.005391 
      55       50.100000       47.005391 
      55       50.200000       47.005391 
      55       50.100000       47.029114 
      55       50.080000       47.112916 
      55       50.110000       47.112916 
      55       50.100000       47.129029 
      55       50.140000       47.118761 
      55       50.080000       47.122748 
      55       50.150000       47.122748 
      55       50.110000       47.161366 
      56       50.050000       47.161366 
      56       50.140000       47.191309 
      56       50.170000       47.161327 
      56       50.100000       47.121459 
      56       50.030000       47.103960 
      56       50.150000       47.074838 
      56       50.070000       47.092376 
      56       50.090000       47.092376 
      56       50.120000       47.191739 
      56       50.090000       47.235286 
      56       50.090000       47.188221 
      56       50.100000       47.188221 
      56       50.120000       47.136244 
      56       50.060000       47.088723 
      56       50.110000       47.126428 
      56       50.050000       47.196195 
      57       50.050000       47.149669 
      57       50.120000       47.057368 
      57       50.070000       47.021904 
      57       50.100000       47.033641 
      57       50.050000       47.110674 
      57       50.130000       47.182769 
      57       50.110000       47.168523 
      57       50.100000       47.156800 
      57       50.060000       47.129972 
      57       50.100000       47.085109 
      57       50.040000       47.109832 
      57       50.070000       47.119574 
      57       50.080000       47.089272 
      57       50.140000       47.065802 
      58       50.090000       47.065802 
      58       50.130000       47.142612 
      58       50.040000       47.292593 
      58       50.100000       47.311019 
      58       50.080000       47.176196 
      58       50.060000       47.145701 
      58       50.090000       47.219617 
      58       50.100000       47.252353 
      58       50.100000       47.246971 
      58       50.120000       47.187726 
      58       50.060000       47.137683 
      58       50.080000       47.152341 
      58       50.080000       47.148797 
      58       50.040000       47.111134 
      58       50.060000       47.111134 
      58       50.140000       47.137129 
      59       50.080000       47.156314 
      59       50.030000       47.091017 
      59       50.160000       47.029531 
      59       50.080000       47.031802 
      59       50.080000       47.099463 
      59       50.160000       47.194449 
      59       50.130000       47.155857 
      59       50.060000       47.027815 
      59       50.130000       47.010693 
      59       50.210000       47.073048 
      59       50.000000       47.073048 
      59       50.070000       47.099863 
      59       50.100000       47.093651 
      59       50.090000       47.093651 
      59       50.090000       47.094923 
      60       50.100000       47.117858 
      60       50.080000       47.117858 
      60       50.140000       47.081911 
      60       50.100000       47.037683 
      60       50.080000       47.058157 
      60       50.070000       47.077990 
      60       50.070000       47.071183 
      60       50.160000       47.094108 
      60       50.090000       47.129446 
      60       50.070000       47.142082 
      60       50.120000       47.093582 
      60       50.050000       47.073135 
      60       50.100000       47.146889 
      60       50.110000       47.186919 
      60       50.030000       47.143358 
      61       50.080000       47.116587 
