

 time    ||    gripping force   ||   raspberry measurement 

      0       0.060000       -794.906818 
      0       0.070000       -794.906818 
      0       0.000000       -794.906818 
      0       0.040000       -794.906818 
      0       0.030000       -794.906818 
      0       0.020000       -794.906818 
      0       0.010000       -794.906818 
      0       0.030000       -794.906818 
      0       0.010000       -794.906818 
      0       0.020000       -794.906813 
      0       0.010000       -794.905632 
      0       0.030000       -794.799277 
      0       0.000000       -791.277300 
      0       0.020000       -748.371096 
      0       0.010000       -556.081500 
      0       0.010000       -239.056329 
      0       0.010000       -46.763619 
      0       0.010000       -3.839432 
      1       0.030000       -0.310784 
      1       0.070000       -0.181048 
      1       0.040000       -0.152126 
      1       0.010000       -0.107257 
      1       0.010000       -0.066920 
      1       0.010000       -0.057964 
      1       0.070000       -0.050293 
      1       0.020000       -0.028394 
      1       0.040000       0.002168 
      1       0.050000       -0.022595 
      1       0.010000       -0.085177 
      1       0.000000       -0.091129 
      1       0.030000       -0.039511 
      1       0.050000       -0.009999 
      1       0.010000       0.007970 
      1       0.010000       -0.012227 
      1       0.050000       -0.046708 
      1       0.040000       -0.049809 
      1       0.040000       -0.032853 
      1       0.040000       -0.010345 
      1       0.020000       -0.003310 
      1       0.010000       0.018352 
      1       0.050000       0.025799 
      1       0.070000       -0.010815 
      2       0.080000       -0.068261 
      2       0.000000       -0.084818 
      2       0.010000       -0.106357 
      2       0.020000       -0.122954 
      2       0.000000       -0.115757 
      2       0.020000       -0.138252 
      2       0.050000       -0.169023 
      2       0.010000       -0.166475 
      2       0.040000       -0.104476 
      2       0.020000       -0.038735 
      2       0.170000       0.012925 
      2       0.130000       0.035671 
      2       0.040000       0.031750 
      2       0.060000       -0.017169 
      2       0.050000       -0.089288 
      3       0.120000       -0.106341 
      3       0.090000       -0.054407 
      3       0.100000       -0.073679 
      3       0.030000       -0.216238 
      3       0.010000       -0.307974 
      3       0.050000       -0.260676 
      3       0.020000       -0.200462 
      3       0.020000       -0.201498 
      3       0.020000       -0.188805 
      3       0.050000       -0.201484 
      3       0.080000       -0.179778 
      4       0.050000       -0.087586 
      4       0.110000       -0.008214 
      4       0.100000       -0.008184 
      4       0.070000       -0.022995 
      4       0.140000       -0.015327 
      4       0.200000       -0.033283 
      4       0.100000       -0.049822 
      4       0.230000       -0.046708 
      4       0.220000       -0.012213 
      4       0.180000       0.008427 
      4       0.200000       -0.004143 
      5       0.230000       -0.009485 
      5       0.250000       -0.022055 
      5       0.100000       -0.001415 
      5       0.210000       0.033067 
      5       0.180000       0.035765 
      5       0.200000       0.014712 
      5       0.180000       -0.016682 
      5       0.230000       -0.001831 
      5       0.250000       0.023168 
      6       0.330000       -0.001858 
      6       0.270000       -0.017569 
      6       0.460000       0.003914 
      6       0.200000       -0.012629 
      6       37.320000       -0.046708 
      6       44.790000       -0.049406 
      6       50.770000       -0.028797 
      6       54.710000       -0.002788 
      6       61.900000       -0.041379 
      6       60.800000       -0.100432 
      7       69.580000       -0.070059 
      7       70.410000       0.002624 
      7       69.990000       0.024900 
      7       69.190000       -0.006302 
      7       68.840000       -0.053533 
      7       68.600000       -0.077080 
      7       68.430000       -0.088014 
      8       68.290000       -0.029558 
      8       68.130000       0.026727 
      8       68.100000       0.049345 
      8       67.840000       0.084246 
      8       67.490000       0.175825 
      8       66.160000       0.301285 
      8       63.350000       0.469059 
      8       60.870000       0.705658 
      8       57.390000       0.901130 
      8       56.630000       0.963950 
      8       55.700000       0.997604 
      8       55.400000       1.033039 
      9       53.990000       1.035764 
      9       51.840000       1.014699 
      9       50.890000       0.982861 
      9       50.640000       0.982377 
      9       50.490000       0.972935 
      9       50.420000       0.894466 
      9       50.410000       0.832681 
      9       50.300000       0.846472 
      9       49.790000       0.848623 
      9       47.900000       0.718472 
      10       44.890000       0.473095 
      10       44.520000       0.287222 
      10       44.220000       0.231160 
      10       43.860000       0.212690 
      10       42.240000       0.188925 
      10       41.900000       0.144253 
      10       41.460000       0.116784 
      10       41.110000       0.088413 
      11       38.620000       0.070317 
      11       38.300000       0.072657 
      11       36.410000       0.105655 
      11       36.250000       0.120125 
      11       31.680000       0.087830 
      12       27.490000       0.064847 
      12       27.100000       0.052549 
      13       26.910000       0.034373 
      13       25.890000       0.016200 
      13       24.970000       0.023190 
      13       24.330000       0.002924 
      13       24.350000       -0.021855 
      13       24.300000       0.008445 
      13       24.340000       0.047017 
      14       23.120000       0.054923 
      14       23.030000       0.056210 
      14       22.990000       0.048905 
      14       23.000000       0.025885 
      14       23.020000       -0.015293 
      15       22.960000       -0.037671 
      15       22.900000       -0.044064 
      15       22.940000       -0.042638 
      15       22.920000       -0.043649 
      15       23.000000       -0.041788 
      15       22.870000       -0.042794 
      15       22.560000       -0.040942 
      15       22.680000       -0.041957 
      15       21.840000       -0.040113 
      15       21.710000       -0.041136 
      16       21.420000       -0.039301 
      16       21.030000       -0.040332 
      16       20.880000       -0.038544 
      16       20.890000       -0.040859 
      16       20.880000       -0.053746 
      16       20.910000       -0.110462 
      17       20.860000       -0.154554 
      17       20.840000       -0.107812 
      17       20.860000       -0.049480 
      17       20.900000       -0.035690 
      18       20.890000       -0.032633 
      18       20.970000       -0.033691 
      19       20.880000       -0.031930 
      19       20.890000       -0.033048 
      19       20.920000       -0.031719 
      19       20.840000       -0.037732 
      19       20.300000       -0.054541 
      19       19.990000       -0.070959 
      19       19.630000       -0.053286 
      19       19.390000       -0.035567 
      20       18.940000       -0.028881 
      20       18.760000       -0.029591 
      20       18.590000       -0.027858 
      20       18.500000       -0.029003 
      20       18.290000       -0.027289 
      20       18.010000       -0.028440 
      20       17.670000       -0.026731 
      20       17.600000       -0.027888 
      21       17.560000       -0.026185 
      21       17.570000       -0.027347 
      21       17.540000       -0.025650 
      21       17.560000       -0.026831 
      21       17.450000       -0.025564 
      22       17.110000       -0.031639 
      22       16.550000       -0.048508 
      22       16.190000       -0.064987 
      22       16.310000       -0.047373 
      22       16.890000       -0.029714 
      22       17.810000       -0.023086 
      22       17.490000       -0.023854 
      22       17.830000       -0.022178 
      22       17.700000       -0.023394 
      23       17.880000       -0.022174 
      23       17.450000       -0.028695 
      23       17.630000       -0.050088 
      23       17.430000       -0.080668 
      23       17.520000       -0.064321 
      23       17.580000       -0.029527 
      24       17.470000       -0.021256 
      24       17.600000       -0.018768 
      24       17.590000       -0.019540 
      24       17.570000       -0.012601 
      24       17.560000       0.009205 
      24       17.590000       0.040193 
      24       17.570000       0.024251 
      24       17.570000       -0.010142 
      25       17.590000       -0.018016 
      25       17.550000       -0.020098 
      25       17.570000       -0.018499 
      25       17.580000       -0.019739 
      25       17.590000       -0.018117 
      25       17.590000       -0.019360 
      25       17.530000       -0.017743 
      25       17.480000       -0.018989 
      25       17.620000       -0.017402 
      26       17.610000       -0.019490 
      26       17.530000       -0.027271 
      26       17.660000       -0.061148 
      26       17.610000       -0.076077 
      26       17.550000       -0.044236 
      26       17.630000       -0.022127 
      26       17.650000       -0.015588 
      26       17.560000       -0.021324 
      27       17.620000       -0.038284 
      27       17.550000       -0.054878 
      27       17.650000       -0.037791 
      27       17.570000       -0.025133 
      27       17.560000       -0.037162 
      28       17.640000       -0.053329 
      28       17.560000       -0.035818 
      28       17.620000       -0.018274 
      28       17.600000       -0.011761 
      28       17.590000       -0.012642 
      28       17.630000       -0.011078 
      28       17.580000       -0.012391 
      29       17.580000       -0.010843 
      29       17.580000       -0.012159 
      29       17.500000       -0.010613 
      29       17.610000       -0.011931 
      29       17.610000       -0.010388 
      29       17.630000       -0.011708 
      29       17.560000       -0.010167 
      30       17.610000       -0.011489 
      30       17.640000       -0.009950 
      30       17.580000       -0.011275 
      30       17.550000       -0.009738 
      31       17.600000       -0.011065 
      31       17.600000       -0.009530 
      31       17.590000       -0.010859 
      31       17.570000       -0.009326 
      31       17.600000       -0.010657 
      31       17.600000       -0.009153 
      31       17.640000       -0.011323 
      31       17.580000       -0.019186 
      31       17.560000       -0.053144 
      32       17.580000       -0.068153 
      32       17.580000       -0.036391 
      32       17.580000       -0.014347 
      32       17.580000       -0.007461 
      32       17.530000       -0.008372 
      32       17.620000       -0.006851 
      32       17.590000       -0.008206 
      32       17.610000       -0.006700 
      33       17.570000       -0.008057 
      33       17.590000       -0.006553 
      33       17.560000       -0.007911 
      33       17.560000       -0.006408 
      33       17.580000       -0.007768 
      33       17.530000       -0.006266 
      33       17.470000       -0.007628 
      34       17.530000       -0.006154 
      34       17.460000       -0.008368 
      34       17.570000       -0.016699 
      34       17.530000       -0.056014 
      34       17.670000       -0.094510 
      34       17.540000       -0.096635 
      34       17.620000       -0.073989 
      34       17.490000       -0.032356 
      35       17.580000       -0.009501 
      35       17.560000       -0.002637 
      35       17.550000       -0.003596 
      35       17.520000       -0.002123 
      35       17.600000       -0.003539 
      35       17.510000       -0.002518 
      36       17.560000       -0.009236 
      36       17.540000       -0.030823 
      36       17.530000       -0.061595 
      36       17.480000       -0.045439 
      36       17.440000       -0.010835 
      36       17.520000       -0.002750 
      36       17.530000       -0.000487 
      37       17.540000       -0.002718 
      37       17.570000       -0.010667 
      37       17.460000       -0.044710 
      37       17.450000       -0.059803 
      37       17.420000       -0.028125 
      37       17.510000       -0.006177 
      37       17.530000       0.000189 
      37       17.450000       -0.006117 
      37       17.510000       -0.027723 
      38       17.460000       -0.058526 
      38       17.490000       -0.042400 
      38       17.420000       -0.007826 
      38       17.500000       0.000228 
      38       17.510000       0.002488 
      38       17.640000       0.001052 
      38       17.840000       0.002040 
      38       18.010000       -0.004311 
      38       18.490000       -0.021453 
      38       19.060000       -0.038203 
      39       19.590000       -0.020857 
      39       19.900000       -0.003462 
      39       20.790000       0.002903 
      39       20.930000       0.001875 
      39       21.080000       0.003293 
      39       21.080000       0.001810 
      39       21.080000       0.002352 
      39       21.010000       -0.009321 
      40       20.980000       -0.049517 
      40       21.030000       -0.095643 
      40       21.000000       -0.063606 
      40       20.980000       -0.010236 
      40       21.030000       0.001898 
      40       21.000000       -0.005246 
      40       20.980000       -0.043799 
      40       20.960000       -0.073017 
      40       20.990000       -0.042631 
      41       20.970000       -0.003586 
      41       20.970000       0.004000 
      41       20.990000       -0.003191 
      41       20.960000       -0.038135 
      41       20.930000       -0.063132 
      41       20.940000       -0.069505 
      41       21.020000       -0.088435 
      41       21.040000       -0.091442 
      41       21.120000       -0.099516 
      42       21.110000       -0.058466 
      42       21.110000       -0.014109 
      42       21.080000       -0.039130 
      42       21.130000       -0.076944 
      42       21.040000       -0.083699 
      42       21.140000       -0.075324 
      42       21.010000       -0.035940 
      42       21.230000       -0.005485 
      43       20.970000       -0.029742 
      43       21.200000       -0.044147 
      43       20.590000       -0.013037 
      43       21.420000       0.003454 
      43       20.810000       -0.012941 
      43       21.250000       -0.043454 
      43       20.850000       -0.027466 
      43       21.110000       0.006933 
      43       21.160000       0.014002 
      43       21.070000       0.006724 
      43       21.130000       -0.027468 
      43       20.940000       -0.042759 
      43       20.990000       -0.012116 
      43       21.120000       -0.000580 
      44       21.040000       -0.036821 
      44       20.970000       -0.097355 
      44       21.090000       -0.121157 
      44       20.990000       -0.115095 
      44       21.060000       -0.069573 
      44       21.120000       -0.070683 
      44       21.050000       -0.117405 
      44       21.070000       -0.069172 
      44       21.060000       -0.006471 
      44       21.040000       -0.021383 
      44       21.070000       -0.036310 
      44       21.060000       -0.019972 
      44       21.080000       -0.059280 
      44       21.020000       -0.122958 
      44       21.000000       -0.120895 
      45       21.000000       -0.109053 
      45       21.300000       -0.124801 
      45       20.940000       -0.089829 
      45       21.230000       -0.053521 
      45       20.900000       -0.111885 
      45       21.000000       -0.159619 
      45       21.170000       -0.116269 
      45       21.070000       -0.074816 
      45       21.090000       -0.057526 
      45       21.040000       -0.038914 
      46       21.020000       -0.021973 
      46       21.060000       -0.044062 
      46       21.080000       -0.084736 
      46       21.000000       -0.128850 
      46       21.120000       -0.140253 
      46       20.890000       -0.102629 
      46       21.100000       -0.040237 
      46       21.070000       -0.008915 
      46       21.120000       0.018389 
      46       21.000000       0.030923 
      47       21.050000       0.012990 
      47       21.040000       -0.028485 
      47       21.050000       -0.060530 
      47       20.980000       -0.103914 
      47       21.040000       -0.132996 
      47       21.070000       -0.102848 
      47       20.960000       -0.072164 
      47       21.080000       -0.091312 
      47       21.030000       -0.091797 
      47       21.050000       -0.067336 
      47       21.050000       -0.090179 
      47       21.010000       -0.087028 
      47       21.080000       -0.056476 
      48       21.050000       -0.048347 
      48       21.020000       -0.045654 
      48       20.980000       -0.047885 
      48       21.070000       -0.061126 
      48       21.050000       -0.122649 
      48       21.020000       -0.184378 
      48       21.050000       -0.143039 
      48       21.040000       -0.030757 
      48       21.010000       0.041936 
      48       21.060000       0.050756 
      48       21.020000       0.028595 
      48       20.970000       -0.017915 
      48       21.020000       -0.064208 
      49       21.010000       -0.109366 
      49       21.030000       -0.125059 
      49       21.030000       -0.097235 
      49       21.030000       -0.023030 
      49       21.150000       0.017534 
      49       21.540000       0.001462 
      49       20.500000       0.018277 
      49       21.100000       0.052284 
      49       21.100000       0.059738 
      49       21.100000       0.061376 
      49       21.030000       0.058513 
      49       21.030000       0.049513 
      49       21.090000       0.009523 
      50       21.080000       -0.030081 
      50       21.060000       -0.038660 
      50       21.090000       -0.046745 
      50       21.050000       -0.078674 
      50       21.060000       -0.156851 
      50       21.070000       -0.217856 
      50       21.030000       -0.218773 
      51       21.100000       -0.172228 
      51       21.070000       -0.099530 
      51       21.110000       -0.084775 
      51       21.100000       -0.088778 
      51       21.020000       -0.055919 
      51       21.070000       -0.033214 
      51       21.070000       -0.020794 
      51       21.050000       0.002384 
      51       21.070000       0.043292 
      51       21.070000       0.065391 
      51       21.040000       0.071506 
      52       21.050000       0.069779 
      52       21.100000       0.069667 
      52       21.090000       0.057734 
      52       21.030000       0.021334 
      52       21.090000       -0.012235 
      52       21.090000       0.010553 
      52       21.000000       0.008120 
      52       21.110000       -0.023333 
      52       21.060000       -0.049850 
      52       21.000000       -0.120709 
      52       20.970000       -0.156748 
      53       21.040000       -0.060268 
      53       21.080000       0.017037 
      53       20.990000       0.010318 
      53       21.090000       0.022577 
      53       21.040000       0.033463 
      53       21.080000       0.011383 
      53       21.090000       0.025507 
      53       21.000000       0.034470 
      53       21.160000       -0.055854 
      53       21.090000       -0.149371 
      53       21.020000       -0.087966 
      54       21.110000       0.013076 
      54       21.100000       0.016166 
      54       21.060000       -0.021363 
      54       21.070000       -0.047683 
      54       21.090000       -0.065021 
      54       21.030000       -0.047872 
      54       21.050000       -0.035526 
      54       21.040000       -0.051958 
      54       21.090000       -0.082531 
      54       21.040000       -0.071472 
      55       21.060000       -0.059710 
      55       21.080000       -0.080780 
      55       21.020000       -0.063156 
      55       21.020000       -0.023042 
      55       21.030000       0.007829 
      55       21.070000       0.034311 
      55       21.030000       -0.005913 
      55       21.060000       -0.083967 
      55       20.990000       -0.128323 
      55       21.050000       -0.126246 
      55       21.020000       -0.069427 
      55       21.050000       -0.032924 
      55       21.050000       -0.044023 
      56       20.990000       -0.073799 
      56       21.020000       -0.057495 
      56       21.030000       -0.022796 
      56       21.070000       -0.015469 
      56       21.040000       -0.023742 
      56       21.080000       -0.072774 
      56       21.080000       -0.148322 
      56       21.020000       -0.181016 
      56       20.990000       -0.127296 
      56       21.080000       -0.057723 
      56       21.050000       -0.062022 
      56       21.030000       -0.084849 
      56       21.070000       -0.053454 
      56       21.050000       -0.009382 
      57       21.070000       0.016873 
      57       21.010000       0.025146 
      57       21.070000       -0.023933 
      57       21.020000       -0.048508 
      57       21.060000       0.008762 
      57       21.040000       0.022774 
      57       21.080000       -0.091785 
      57       21.050000       -0.175733 
      57       21.090000       -0.102843 
      57       21.040000       -0.039024 
      57       21.090000       -0.067723 
      57       20.970000       -0.091135 
      57       21.040000       -0.022683 
      58       21.030000       -0.023454 
      58       21.120000       -0.082993 
      58       21.040000       -0.042272 
      58       21.100000       0.006864 
      58       21.030000       -0.060954 
      58       21.050000       -0.106552 
      58       21.040000       -0.042466 
      58       21.080000       -0.036327 
      58       21.070000       -0.069151 
      58       21.080000       -0.043710 
      58       21.000000       -0.020160 
      59       21.080000       -0.072332 
      59       21.030000       -0.135002 
      59       21.050000       -0.109289 
      59       21.070000       -0.058505 
      59       21.070000       -0.055658 
      59       21.100000       -0.032953 
      59       21.050000       0.006898 
      59       21.050000       0.033429 
      59       20.920000       0.050896 
      59       21.020000       0.033410 
      60       21.000000       0.014600 
      60       21.000000       -0.007034 
      60       20.990000       -0.067140 
      60       21.000000       -0.138481 
      60       21.010000       -0.128521 
      60       21.020000       -0.095908 
      60       21.000000       -0.073500 
      60       21.000000       -0.026758 
      60       21.000000       0.037916 
      60       21.030000       0.012184 
      60       21.030000       -0.093458 
      60       21.010000       -0.155097 
      60       21.020000       -0.130059 
      60       21.010000       -0.090579 
      61       20.890000       -0.081298 
