

 time    ||    gripping force   ||   raspberry measurement 

      0       0.130000       -795.938889 
      0       0.150000       -795.938889 
      0       0.080000       -795.938889 
      0       0.290000       -795.938889 
      0       0.080000       -795.938889 
      0       0.040000       -795.938889 
      0       0.060000       -795.938889 
      0       0.080000       -795.938889 
      0       0.310000       -795.938889 
      0       0.250000       -795.938884 
      1       0.250000       -787.978325 
      1       0.620000       -779.993224 
      1       0.690000       -776.470375 
      1       0.700000       -733.553869 
      1       6.700000       -541.222997 
      1       27.680000       -224.162058 
      1       57.960000       -31.936067 
      1       86.190000       10.911059 
      1       84.950000       14.487628 
      2       85.860000       14.649130 
      2       78.800000       14.641776 
      2       74.910000       14.672745 
      2       76.240000       14.682501 
      3       73.440000       14.580481 
      3       73.370000       14.497513 
      4       73.280000       14.568816 
      4       73.070000       14.706877 
      4       73.130000       14.799277 
      4       73.060000       14.830264 
      5       72.690000       14.973399 
      5       72.660000       15.340006 
      6       72.560000       15.684673 
      6       72.460000       15.832268 
      6       72.460000       15.897277 
      6       72.480000       15.939024 
      6       72.440000       15.946719 
      6       72.390000       15.939106 
      7       72.280000       15.900098 
      7       72.340000       15.870116 
      7       72.250000       15.899212 
      7       72.260000       15.928335 
      8       72.160000       15.899212 
      8       72.210000       15.870116 
      8       72.130000       15.900098 
      8       72.170000       15.939133 
      8       72.150000       15.947606 
      8       72.110000       15.949877 
      8       72.050000       15.947606 
      9       72.080000       15.939106 
      9       72.100000       15.899212 
      9       72.010000       15.859318 
      9       72.000000       15.850818 
      12       71.790000       15.848519 
      12       71.680000       15.849931 
      12       71.830000       15.848493 
      12       71.730000       15.849945 
      13       71.750000       15.848949 
      13       71.820000       15.855760 
      14       71.680000       15.877659 
      14       71.580000       15.909080 
      16       71.540000       15.894242 
      16       71.590000       15.869659 
      17       71.530000       15.899198 
      17       71.520000       15.928308 
      18       71.500000       15.898326 
      18       71.380000       15.859318 
      18       71.440000       15.851704 
      18       71.400000       15.859318 
      19       71.360000       15.898325 
      19       71.390000       15.928281 
      19       71.450000       15.898325 
      19       71.370000       15.859291 
      20       71.340000       15.850817 
      20       71.410000       15.848519 
      20       71.370000       15.849931 
      20       71.380000       15.848493 
      20       71.400000       15.849931 
      21       71.410000       15.848493 
      21       71.340000       15.849931 
      21       71.340000       15.848493 
      21       71.270000       15.849931 
      21       71.310000       15.848519 
      21       71.300000       15.850817 
      21       71.330000       15.859291 
      22       71.270000       15.898325 
      22       71.360000       15.928281 
      23       71.250000       15.898325 
      23       71.310000       15.859291 
      23       71.320000       15.850817 
      23       71.310000       15.848519 
      23       71.300000       15.849932 
      23       71.320000       15.848519 
      25       71.270000       15.850817 
      25       71.200000       15.859291 
      26       71.210000       15.898325 
      26       71.290000       15.928281 
      27       71.180000       15.898325 
      27       71.200000       15.859291 
      27       71.190000       15.850817 
      27       71.220000       15.848519 
      28       71.160000       15.849931 
      28       71.170000       15.848493 
      28       71.150000       15.849931 
      28       71.150000       15.848493 
      28       71.190000       15.849931 
      28       71.140000       15.848519 
      29       71.160000       15.850817 
      29       71.130000       15.859291 
      30       71.130000       15.898325 
      30       71.090000       15.928281 
      31       71.140000       15.898325 
      31       71.190000       15.859291 
      32       71.080000       15.850817 
      32       71.050000       15.848519 
      33       71.120000       15.849931 
      33       71.100000       15.848493 
      34       71.160000       15.849931 
      34       70.940000       15.848493 
      34       71.140000       15.849931 
      34       71.080000       15.848493 
      35       71.050000       15.849931 
      35       71.130000       15.848493 
      35       71.040000       15.849931 
      35       71.020000       15.848493 
      35       71.070000       15.849931 
      36       71.000000       15.848493 
      36       71.040000       15.849931 
      36       70.970000       15.848493 
      36       71.080000       15.849931 
      36       71.070000       15.848493 
      36       71.040000       15.849931 
      37       71.000000       15.848493 
      37       71.030000       15.849945 
      37       71.070000       15.848949 
      37       71.030000       15.855760 
      37       71.010000       15.877659 
      37       71.040000       15.909053 
      37       71.000000       15.893356 
      37       71.010000       15.858861 
      38       71.030000       15.850804 
      38       71.040000       15.848519 
      38       70.980000       15.849931 
      38       71.010000       15.848493 
      39       70.970000       15.849931 
      39       71.030000       15.848493 
      40       71.000000       15.849931 
      40       70.940000       15.848493 
      40       70.910000       15.849931 
      40       70.970000       15.848493 
      41       70.960000       15.849931 
      41       70.900000       15.848519 
      43       70.970000       15.850818 
      43       70.950000       15.859318 
      43       71.000000       15.899212 
      43       70.890000       15.939079 
      43       70.940000       15.946720 
      43       70.940000       15.939106 
      44       70.920000       15.900098 
      44       70.880000       15.870143 
      44       70.960000       15.900098 
      44       70.880000       15.939106 
      45       70.940000       15.946720 
      45       70.930000       15.939106 
      46       70.920000       15.900098 
      46       70.830000       15.870116 
      47       70.930000       15.899212 
      47       70.890000       15.928308 
      47       70.910000       15.898325 
      47       70.840000       15.859291 
      47       70.940000       15.850817 
      47       70.880000       15.848519 
      47       70.860000       15.849931 
      48       70.910000       15.848493 
      48       70.880000       15.849931 
      48       70.940000       15.848493 
      49       70.840000       15.849931 
      50       70.900000       15.848519 
      51       70.890000       15.850817 
      51       70.850000       15.859291 
      52       70.900000       15.898325 
      52       70.880000       15.928281 
      53       70.830000       15.898325 
      53       70.870000       15.859291 
      53       70.800000       15.850817 
      53       70.920000       15.848506 
      53       70.890000       15.849488 
      54       70.950000       15.843094 
      54       70.850000       15.825734 
      54       70.880000       15.808625 
      54       70.880000       15.826620 
      55       70.830000       15.853892 
      55       70.890000       15.897882 
      55       70.780000       15.928268 
      55       70.790000       15.898325 
      56       70.890000       15.859291 
      56       70.730000       15.850831 
      57       70.890000       15.848976 
      57       70.780000       15.855760 
      57       70.820000       15.877659 
      57       70.800000       15.909053 
      57       70.880000       15.893356 
      57       70.800000       15.858888 
      58       70.800000       15.851691 
      58       70.870000       15.859317 
      58       70.780000       15.898325 
      58       70.880000       15.928268 
      59       70.780000       15.897882 
      59       70.850000       15.853892 
      60       70.730000       15.826621 
      60       70.830000       15.808652 
      60       70.790000       15.826621 
      60       70.830000       15.853892 
