

 time    ||    gripping force   ||   raspberry measurement 

      0       0.070000       0.023884 
      0       0.160000       -802.292727 
      0       0.140000       -802.292727 
      0       0.110000       -802.292727 
      0       0.150000       -802.292727 
      0       0.150000       -802.292727 
      0       0.050000       -802.292727 
      0       0.130000       -802.292727 
      0       0.100000       -802.292727 
      0       0.080000       -802.292727 
      0       0.680000       -802.292727 
      0       0.220000       -802.292727 
      0       0.740000       -802.292727 
      0       0.530000       -802.292727 
      0       0.330000       -802.292727 
      0       0.030000       -802.292727 
      0       0.250000       -802.292722 
      0       0.370000       -802.292722 
      0       0.420000       -802.291530 
      1       0.200000       -794.162356 
      1       0.130000       -790.608000 
      1       0.010000       -747.306815 
      1       0.010000       -747.306815 
      1       0.080000       -747.306815 
      1       0.110000       -553.241325 
      1       0.090000       -233.270388 
      1       0.370000       -39.189201 
      1       0.440000       -39.189201 
      1       0.300000       4.115085 
      1       0.380000       4.115085 
      1       0.600000       4.115085 
      1       0.510000       7.671309 
      1       0.700000       7.777659 
      1       0.410000       7.785662 
      1       17.510000       7.785662 
      2       32.210000       7.807566 
      2       47.990000       7.838987 
      2       60.740000       7.824150 
      2       85.900000       7.799566 
      2       94.010000       7.829105 
      2       97.110000       7.858215 
      2       95.140000       7.858215 
      2       103.490000       7.828206 
      2       112.760000       7.828206 
      2       112.570000       7.828206 
      2       112.360000       7.828206 
      2       111.490000       7.828206 
      2       108.930000       7.828206 
      2       99.610000       7.788312 
      2       89.850000       7.769926 
      2       65.830000       7.769926 
      2       48.710000       7.730032 
      3       34.660000       7.700051 
      3       27.990000       7.730127 
      3       25.880000       7.773151 
      3       26.110000       7.830257 
      3       26.460000       8.051712 
      3       26.700000       8.051712 
      3       27.150000       8.427372 
      3       28.220000       8.742518 
      3       29.330000       9.026879 
      3       31.290000       9.351323 
      3       33.290000       9.583991 
      3       35.640000       9.659823 
      3       38.050000       9.626060 
      3       39.880000       9.405129 
      3       39.660000       9.405129 
      4       39.520000       9.014266 
      4       38.630000       8.639127 
      4       37.100000       8.305934 
      4       35.550000       8.095426 
      4       34.610000       8.095426 
      4       34.290000       8.095426 
      4       33.810000       8.093310 
      4       33.500000       8.166451 
      4       32.940000       8.204423 
      4       32.480000       8.241716 
      4       31.990000       8.239392 
      4       31.780000       8.280392 
      4       31.680000       8.390014 
      4       30.370000       8.473552 
      4       30.120000       8.531267 
      5       28.990000       8.589209 
      5       28.360000       8.591785 
      5       27.810000       8.565983 
      5       27.570000       8.563132 
      5       27.430000       8.563132 
      5       27.350000       8.595548 
      5       27.370000       8.597171 
      5       27.340000       8.583881 
      5       27.360000       8.567117 
      5       27.420000       8.519678 
      5       27.430000       8.519678 
      5       27.450000       8.436263 
      5       27.410000       8.363695 
      5       27.530000       8.363695 
      5       27.520000       8.248403 
      6       27.520000       8.142354 
      6       27.530000       8.220567 
      6       27.490000       8.358227 
      6       27.620000       8.358227 
      6       27.880000       8.350919 
      6       28.340000       8.251131 
      6       28.840000       8.124178 
      6       29.190000       8.074564 
      6       29.520000       8.074564 
      6       29.560000       8.095941 
      6       29.670000       8.175794 
      6       29.840000       8.175794 
      6       29.970000       8.233008 
      6       30.130000       8.157842 
      6       30.260000       8.084742 
      7       30.180000       8.084742 
      7       30.170000       8.084742 
      7       30.130000       8.102721 
      7       30.140000       8.121945 
      7       30.140000       8.121945 
      7       30.150000       8.131861 
      7       30.150000       8.148847 
      7       30.140000       8.222860 
      7       30.130000       8.274785 
      7       30.100000       8.247974 
      7       30.070000       8.269500 
      7       30.140000       8.329061 
      7       30.110000       8.323263 
      7       30.090000       8.298653 
      7       30.130000       8.318307 
      8       30.120000       8.309847 
      8       30.130000       8.249318 
      8       30.060000       8.251199 
      8       30.090000       8.314252 
      8       30.040000       8.349382 
      8       30.110000       8.362662 
      8       30.130000       8.405850 
      8       30.090000       8.439762 
      8       30.050000       8.435403 
      8       30.130000       8.367658 
      8       30.080000       8.340387 
      8       30.120000       8.346159 
      8       30.040000       8.337632 
      8       30.100000       8.354702 
      8       30.040000       8.361356 
      9       30.040000       8.321532 
      9       30.050000       8.321532 
      9       30.060000       8.266388 
      9       30.080000       8.323803 
      9       30.060000       8.433477 
      9       30.080000       8.416064 
      9       30.020000       8.347061 
      9       30.080000       8.316522 
      9       30.120000       8.259642 
      9       30.040000       8.223805 
      9       30.030000       8.223805 
      9       30.000000       8.240330 
      9       30.070000       8.224633 
      9       30.010000       8.204992 
      9       30.060000       8.204992 
      10       30.050000       8.254149 
      10       30.080000       8.307565 
      10       30.060000       8.284197 
      10       30.050000       8.196839 
      10       30.040000       8.091095 
      10       30.090000       8.101433 
      10       30.100000       8.186927 
      10       29.990000       8.235443 
      10       30.010000       8.287785 
      10       30.040000       8.290969 
      10       30.040000       8.256514 
      10       29.940000       8.296825 
      10       30.040000       8.296825 
      10       30.090000       8.318334 
      10       30.020000       8.312549 
      11       30.010000       8.312549 
      11       29.990000       8.326448 
      11       29.990000       8.326448 
      11       30.080000       8.326448 
      11       30.210000       8.333105 
      11       30.170000       8.360087 
      11       30.150000       8.389999 
      11       30.210000       8.389999 
      11       30.190000       8.373039 
      11       30.200000       8.260045 
      11       30.190000       8.171384 
      11       30.210000       8.171384 
      11       30.270000       8.205822 
      11       30.320000       8.252883 
      11       30.360000       8.252883 
      12       30.370000       8.229106 
      12       30.400000       8.204952 
      12       30.360000       8.248347 
      12       30.380000       8.278895 
      12       30.330000       8.232193 
      12       30.320000       8.196022 
      12       30.380000       8.198084 
      12       30.320000       8.195120 
      12       30.370000       8.157344 
      12       30.440000       8.138213 
      12       30.400000       8.151090 
      12       30.310000       8.244430 
      12       30.420000       8.370244 
      12       30.480000       8.391380 
      12       30.340000       8.294583 
      12       30.400000       8.241746 
      13       30.430000       8.299925 
      13       30.380000       8.350600 
      13       30.340000       8.305750 
      13       30.400000       8.187427 
      13       30.390000       8.101893 
      13       30.370000       8.101893 
      13       30.410000       8.160139 
      13       30.420000       8.245673 
      13       30.380000       8.247531 
      13       30.340000       8.293254 
      13       30.420000       8.293254 
      13       30.390000       8.369372 
      13       30.370000       8.352416 
      13       30.370000       8.322877 
      13       30.330000       8.335334 
      14       30.400000       8.335334 
      14       30.370000       8.304935 
      14       30.350000       8.278067 
      14       30.380000       8.316523 
      14       30.380000       8.328689 
      14       30.370000       8.336719 
      14       30.310000       8.360446 
      14       30.400000       8.325491 
      14       30.350000       8.274439 
      14       30.390000       8.206682 
      14       30.410000       8.206682 
      14       30.390000       8.159766 
      14       30.350000       8.201323 
      14       30.350000       8.251129 
      14       30.350000       8.296395 
      15       30.370000       8.384656 
      15       30.340000       8.411524 
      15       30.360000       8.381126 
      15       30.360000       8.339846 
      15       30.310000       8.339846 
      15       30.330000       8.339846 
      15       30.350000       8.260501 
      15       30.350000       8.210392 
      15       30.310000       8.242975 
      15       30.250000       8.249728 
      15       30.270000       8.172615 
      15       30.110000       8.145330 
      15       30.040000       8.159988 
      15       29.990000       8.133699 
      15       29.930000       8.133699 
      16       29.850000       8.114295 
      16       29.860000       8.131874 
      16       29.850000       8.156901 
      16       29.910000       8.196006 
      16       29.890000       8.196006 
      16       29.940000       8.209325 
      16       29.830000       8.249789 
      16       29.850000       8.335292 
      16       29.850000       8.356358 
      16       29.860000       8.234088 
      16       29.830000       8.121551 
      16       29.910000       8.144028 
      16       29.850000       8.216036 
      16       29.880000       8.258298 
      16       29.890000       8.221408 
      16       29.800000       8.167742 
      17       29.880000       8.154703 
      17       29.850000       8.154703 
      17       29.880000       8.217461 
      17       29.900000       8.244316 
      17       29.810000       8.173084 
      17       29.900000       8.156974 
      17       29.870000       8.218307 
      17       29.870000       8.218307 
      17       29.820000       8.251513 
      17       29.860000       8.199013 
      17       29.830000       8.129176 
      17       29.880000       8.124593 
      17       29.920000       8.114817 
      17       29.840000       8.062743 
      17       29.910000       8.062743 
      18       29.940000       8.043142 
      18       29.980000       8.064033 
      18       29.880000       8.129698 
      18       30.020000       8.181417 
      18       30.020000       8.181236 
      18       29.900000       8.171175 
      18       29.950000       8.171175 
      18       29.990000       8.216604 
      18       29.990000       8.216604 
      18       29.930000       8.216604 
      18       29.950000       8.215526 
      18       29.910000       8.215526 
      18       30.030000       8.178065 
      18       30.100000       8.119611 
      18       30.210000       8.045827 
      19       30.260000       8.020205 
      19       30.180000       8.052029 
      19       30.260000       8.088795 
      19       30.230000       8.152860 
      19       30.280000       8.208894 
      19       30.240000       8.201710 
      19       30.220000       8.201710 
      19       30.180000       8.185183 
      19       30.190000       8.185183 
      19       30.240000       8.177929 
      19       30.230000       8.168140 
      19       30.220000       8.168140 
      19       30.230000       8.118294 
      19       30.180000       8.039971 
      19       30.170000       8.039971 
      20       30.230000       7.991025 
      20       30.230000       7.992436 
      20       30.190000       8.037647 
      20       30.150000       8.108961 
      20       29.990000       8.119154 
      20       29.930000       8.109048 
      20       29.920000       8.109048 
      20       29.980000       8.109048 
      20       29.950000       8.167575 
      20       29.910000       8.200474 
      20       29.900000       8.200474 
      20       29.930000       8.147448 
      20       29.940000       8.158373 
      20       29.900000       8.239749 
      20       30.010000       8.282465 
      21       29.930000       8.178427 
      21       29.970000       8.078152 
      21       29.950000       8.078152 
      21       29.880000       8.129608 
      21       29.890000       8.270824 
      21       29.870000       8.379643 
      21       29.940000       8.332178 
      21       29.900000       8.208482 
      21       29.910000       8.167729 
      21       29.880000       8.167225 
      21       29.910000       8.139431 
      21       29.910000       8.069971 
      21       29.960000       8.069971 
      21       29.880000       8.043971 
      21       29.910000       8.068142 
      21       29.950000       8.072668 
      22       29.870000       8.128636 
      22       29.870000       8.128636 
      22       29.960000       8.178868 
      22       29.890000       8.151018 
      22       29.980000       8.117562 
      22       29.890000       8.112439 
      22       29.910000       8.146255 
      22       29.920000       8.146036 
      22       29.850000       8.146036 
      22       29.840000       8.130114 
      22       29.910000       8.103913 
      22       29.950000       8.090663 
      22       29.920000       8.103080 
      22       29.840000       8.121062 
      22       29.890000       8.118365 
      23       29.900000       8.152900 
      23       29.930000       8.180627 
      23       29.910000       8.147974 
      23       29.960000       8.163672 
      23       29.910000       8.199479 
      23       29.930000       8.159615 
      23       30.030000       8.139974 
      23       29.980000       8.213311 
      23       30.160000       8.213311 
      23       30.170000       8.247929 
      23       30.150000       8.247929 
      23       30.210000       8.179741 
      23       30.190000       8.108080 
      23       30.130000       8.050230 
      23       30.140000       8.064638 
      24       30.100000       8.064638 
      24       30.140000       8.110695 
      24       30.140000       8.112575 
      24       30.160000       8.134908 
      24       30.110000       8.173955 
      24       30.120000       8.190469 
      24       30.120000       8.165482 
      24       30.120000       8.093628 
      24       30.190000       8.093628 
      24       30.150000       8.077251 
      24       30.150000       8.116896 
      24       30.190000       8.135027 
      24       30.140000       8.087316 
      24       30.110000       8.071395 
      24       30.130000       8.092672 
      24       30.170000       8.094663 
      25       30.160000       8.056860 
      25       30.120000       8.031861 
      25       30.100000       8.013932 
      25       30.030000       8.013932 
      25       29.910000       8.030918 
      25       29.920000       8.066802 
      25       29.930000       8.132635 
      25       29.950000       8.193205 
      25       29.940000       8.069361 
      25       29.970000       7.938371 
      25       30.010000       8.034919 
      25       29.950000       8.034919 
      25       29.930000       8.171211 
      25       29.980000       8.148429 
      25       29.970000       8.158648 
      26       29.940000       8.177513 
      26       29.920000       8.124216 
      26       29.890000       8.129163 
      26       29.920000       8.133119 
      26       29.950000       8.157869 
      26       29.920000       8.185597 
      26       29.940000       8.162702 
      26       29.950000       8.170898 
      26       29.920000       8.210113 
      26       29.960000       8.198676 
      26       29.980000       8.082454 
      26       29.910000       7.991595 
      26       29.980000       7.991595 
      26       29.920000       8.020638 
      26       29.900000       8.174851 
      27       29.950000       8.232078 
      27       29.920000       8.232078 
      27       29.880000       8.083009 
      27       29.930000       8.008098 
      27       29.960000       8.097335 
      27       29.930000       8.174311 
      27       29.920000       8.169472 
      27       29.960000       8.115582 
      27       29.980000       8.090566 
      27       29.900000       8.024633 
      27       29.940000       7.954757 
      27       29.880000       7.962397 
      27       29.900000       7.998594 
      27       29.990000       8.036360 
      27       29.950000       8.085557 
      28       29.910000       8.148869 
      28       29.910000       8.120093 
      28       29.920000       8.081712 
      28       29.950000       8.188741 
      28       29.910000       8.321363 
      28       29.930000       8.286025 
      28       29.920000       8.183815 
      28       29.950000       8.162316 
      28       29.970000       8.166808 
      28       29.960000       8.140304 
      28       29.960000       8.080768 
      28       29.890000       8.080768 
      28       29.980000       8.092312 
      28       29.960000       8.146185 
      28       29.920000       8.146185 
      28       29.940000       8.100365 
      29       30.000000       8.053900 
      29       29.960000       8.074387 
      29       29.880000       8.162781 
      29       29.880000       8.198526 
      29       29.900000       8.147504 
      29       29.920000       8.139461 
      29       29.960000       8.139461 
      29       29.980000       8.154185 
      29       30.030000       8.110778 
      29       30.090000       8.089282 
      29       30.140000       8.164487 
      29       30.140000       8.203092 
      29       30.080000       8.161347 
      29       30.140000       8.136400 
      29       30.060000       8.124081 
      30       30.100000       8.122571 
      30       30.060000       8.160378 
      30       30.110000       8.226056 
      30       30.130000       8.226056 
      30       30.090000       8.195316 
      30       30.130000       8.151710 
      30       30.090000       8.153167 
      30       30.120000       8.153167 
      30       30.080000       8.153167 
      30       30.140000       8.169592 
      30       30.070000       8.140663 
      30       30.120000       8.083010 
      30       30.150000       8.033620 
      30       30.080000       8.074922 
      30       30.100000       8.105255 
      31       30.110000       8.076281 
      31       30.100000       8.094057 
      31       30.080000       8.085167 
      31       30.070000       8.021492 
      31       30.110000       8.007220 
      31       30.070000       7.998555 
      31       30.120000       7.990274 
      31       30.140000       8.004800 
      31       30.110000       8.041342 
      31       30.070000       8.099412 
      31       30.060000       8.145701 
      31       30.160000       8.086470 
      31       30.090000       8.051186 
      31       30.110000       8.076655 
      31       30.050000       8.108049 
      32       30.140000       8.154715 
      32       30.090000       8.154715 
      32       30.050000       8.191342 
      32       30.000000       8.195079 
      32       29.940000       8.162729 
      32       29.940000       8.162356 
      32       29.890000       8.189212 
      32       29.920000       8.247084 
      32       29.930000       8.247084 
      32       29.870000       8.280628 
      32       29.890000       8.280628 
      32       29.890000       8.280628 
      32       29.920000       8.253816 
      32       29.870000       8.293670 
      32       29.890000       8.293670 
      33       29.890000       8.367613 
      33       29.870000       8.330819 
      33       29.910000       8.330819 
      33       29.910000       8.225995 
      33       29.850000       8.172588 
      33       29.900000       8.168137 
      33       29.920000       8.060015 
      33       29.890000       7.911832 
      33       29.880000       7.926933 
      33       29.940000       8.026901 
      33       29.890000       8.026901 
      33       29.840000       8.060931 
      33       29.910000       8.108078 
      33       29.890000       8.108078 
      33       29.920000       8.108078 
      34       29.920000       8.148692 
      34       29.880000       8.114417 
      34       29.890000       8.114417 
      34       29.880000       8.098142 
      34       29.880000       8.142212 
      34       29.890000       8.152804 
      34       29.860000       8.176338 
      34       29.950000       8.246008 
      34       29.890000       8.299091 
      34       29.930000       8.250964 
      34       29.900000       8.250964 
      34       30.010000       8.195579 
      34       29.960000       8.173901 
      34       29.990000       8.150739 
      34       29.910000       8.120151 
      34       29.920000       8.145356 
      35       29.850000       8.213338 
      35       29.960000       8.213338 
      35       29.880000       8.243460 
      35       29.970000       8.230903 
      35       29.950000       8.216496 
      35       29.870000       8.174939 
      35       29.940000       8.186483 
      35       30.020000       8.222417 
      35       30.040000       8.165830 
      35       30.090000       8.152558 
      35       30.100000       8.192242 
      35       30.130000       8.208558 
      35       30.130000       8.160462 
      35       30.130000       8.140444 
      35       30.110000       8.218777 
      36       30.090000       8.274355 
      36       30.110000       8.274355 
      36       30.130000       8.247087 
      36       30.040000       8.259105 
      36       30.080000       8.284737 
      36       30.090000       8.251474 
      36       30.080000       8.251474 
      36       30.140000       8.217535 
      36       30.060000       8.211123 
      36       30.140000       8.230487 
      36       30.060000       8.178360 
      36       30.100000       8.127900 
      36       30.080000       8.130862 
      36       30.160000       8.087494 
      36       30.060000       8.078998 
      37       30.100000       8.209834 
      37       30.070000       8.288170 
      37       30.070000       8.256503 
      37       30.100000       8.276560 
      37       30.060000       8.279280 
      37       30.090000       8.143918 
      37       30.040000       8.057099 
      37       30.100000       8.057099 
      37       30.060000       8.057099 
      37       30.060000       8.057099 
      37       30.090000       8.115178 
      37       30.060000       8.155625 
      37       30.100000       8.132318 
      37       30.100000       8.186970 
      38       30.010000       8.269429 
      38       30.020000       8.324147 
      38       30.020000       8.348721 
      38       30.010000       8.276613 
      38       29.960000       8.188795 
      38       30.040000       8.128275 
      38       29.980000       8.128275 
      38       30.020000       8.080310 
      38       29.950000       8.121120 
      38       30.010000       8.206637 
      38       30.060000       8.227772 
      38       30.030000       8.171246 
      38       30.020000       8.171246 
      38       30.030000       8.170040 
      38       30.010000       8.277846 
      38       29.990000       8.317016 
      39       30.030000       8.229438 
      39       29.980000       8.144957 
      39       30.020000       8.097669 
      39       29.980000       8.097669 
      39       30.000000       8.127941 
      39       30.020000       8.146962 
      39       30.000000       8.160597 
      39       30.010000       8.183772 
      39       29.990000       8.222833 
      39       30.000000       8.238960 
      39       29.990000       8.208009 
      39       30.030000       8.191026 
      39       29.970000       8.201737 
      39       29.980000       8.203978 
      39       29.990000       8.134948 
      40       29.990000       8.083922 
      40       29.980000       8.116966 
      40       29.940000       8.128286 
      40       29.960000       8.132234 
      40       29.960000       8.148001 
      40       30.020000       8.147005 
      40       29.970000       8.205420 
      40       29.940000       8.250464 
      40       30.010000       8.218430 
      40       29.930000       8.139378 
      40       30.010000       8.139378 
      40       29.990000       8.139378 
      40       29.980000       8.103221 
      40       30.000000       8.103221 
      40       30.050000       8.138103 
      41       30.040000       8.203979 
      41       29.910000       8.203979 
      41       29.930000       8.198609 
      41       30.030000       8.172587 
      41       29.960000       8.195482 
      41       29.970000       8.185553 
      41       29.950000       8.185553 
      41       30.010000       8.126005 
      41       29.960000       8.126005 
      41       30.000000       8.054717 
      41       29.990000       8.059669 
      41       29.910000       8.086511 
      41       29.960000       8.072668 
      41       29.940000       8.110321 
      41       30.020000       8.164944 
      42       29.950000       8.187908 
      42       29.910000       8.187908 
      42       29.960000       8.229065 
      42       30.000000       8.268516 
      42       30.010000       8.270327 
      42       29.910000       8.233535 
      42       29.940000       8.135015 
      42       30.000000       8.135015 
      42       29.900000       8.135015 
      42       29.930000       8.135015 
      42       29.950000       8.056556 
      42       29.950000       8.056556 
      42       29.980000       8.074524 
      42       29.940000       8.162246 
      42       29.950000       8.276196 
      43       29.950000       8.284515 
      43       29.920000       8.165942 
      43       29.970000       8.069058 
      43       29.940000       8.091936 
      43       29.920000       8.088792 
      43       29.910000       8.049358 
      43       29.940000       8.073572 
      43       29.910000       8.156457 
      43       29.950000       8.248816 
      43       29.940000       8.247461 
      43       29.940000       8.224247 
      43       29.930000       8.257830 
      43       29.970000       8.313382 
      43       30.010000       8.313382 
      43       29.930000       8.395964 
      44       29.890000       8.431179 
      44       29.990000       8.336776 
      44       30.020000       8.257418 
      44       29.980000       8.325988 
      44       29.940000       8.318721 
      44       29.970000       8.223431 
      44       29.970000       8.241650 
      44       29.970000       8.304408 
      44       29.960000       8.304408 
      44       30.010000       8.299965 
      44       29.970000       8.268974 
      44       29.930000       8.205405 
      44       29.940000       8.205405 
      44       29.970000       8.150687 
      45       29.980000       8.173209 
      45       30.060000       8.252360 
      45       30.010000       8.339875 
      45       30.000000       8.367519 
      45       30.010000       8.367519 
      45       29.990000       8.347472 
      45       30.010000       8.219650 
      45       29.920000       8.219650 
      45       30.040000       8.077709 
      45       30.030000       8.083025 
      45       30.000000       8.083025 
      45       30.040000       8.183339 
      45       30.030000       8.231816 
      45       30.040000       8.231816 
      45       30.010000       8.202127 
      46       30.030000       8.166869 
      46       30.030000       8.163602 
      46       30.070000       8.200961 
      46       30.070000       8.221839 
      46       30.020000       8.221839 
      46       30.050000       8.230155 
      46       30.000000       8.229466 
      46       30.020000       8.253027 
      46       29.990000       8.334823 
      46       30.040000       8.433076 
      46       30.020000       8.433076 
      46       29.970000       8.378301 
      46       30.040000       8.239527 
      46       30.040000       8.125538 
      46       29.960000       8.125538 
      47       29.940000       8.101060 
      47       30.000000       8.212896 
      47       30.020000       8.282438 
      47       29.980000       8.204368 
      47       30.010000       8.123821 
      47       30.060000       8.093708 
      47       30.090000       8.121559 
      47       29.990000       8.134976 
      47       30.020000       8.167268 
      47       29.990000       8.237149 
      47       30.000000       8.260942 
      47       30.070000       8.298113 
      47       29.990000       8.298113 
      47       30.000000       8.308451 
      47       30.020000       8.251071 
      48       29.990000       8.189779 
      48       30.000000       8.165485 
      48       29.990000       8.165485 
      48       30.020000       8.266869 
      48       30.000000       8.400244 
      48       29.970000       8.442971 
      48       29.990000       8.442971 
      48       30.000000       8.353165 
      48       30.000000       8.192023 
      48       30.030000       8.134574 
      48       29.960000       8.134574 
      48       30.050000       8.178951 
      48       30.020000       8.178951 
      48       29.970000       8.178951 
      48       29.950000       8.178951 
      48       30.030000       8.168182 
      49       30.020000       8.204939 
      49       30.010000       8.204939 
      49       30.010000       8.308828 
      49       30.000000       8.347468 
      49       30.060000       8.280574 
      49       30.030000       8.151672 
      49       30.010000       8.152887 
      49       30.020000       8.233132 
      49       29.960000       8.182412 
      49       30.030000       8.135487 
      49       29.940000       8.135487 
      49       29.880000       8.091357 
      49       29.960000       8.035126 
      49       29.950000       8.065928 
      49       29.990000       8.140760 
      50       29.960000       8.187452 
      50       29.980000       8.247434 
      50       29.900000       8.284723 
      50       29.920000       8.262675 
      50       29.950000       8.270926 
      50       29.940000       8.311066 
      50       29.930000       8.311676 
      50       29.910000       8.257401 
      50       29.980000       8.287023 
      50       29.950000       8.287023 
      50       29.960000       8.346132 
      50       29.990000       8.390096 
      50       29.950000       8.453718 
      50       29.960000       8.431236 
      50       29.970000       8.344443 
      51       29.990000       8.290527 
      51       30.010000       8.280711 
      51       30.000000       8.280711 
      51       30.020000       8.276641 
      51       30.010000       8.257799 
      51       30.010000       8.257799 
      51       30.020000       8.176239 
      51       30.040000       8.096951 
      51       30.010000       8.152569 
      51       30.000000       8.284212 
      51       30.020000       8.284212 
      51       29.950000       8.372639 
      51       29.980000       8.372639 
      51       30.020000       8.425397 
      51       30.020000       8.459102 
      52       29.970000       8.420011 
      52       30.040000       8.348443 
      52       30.000000       8.244318 
      52       29.970000       8.128399 
      52       30.060000       8.128399 
      52       29.980000       8.092438 
      52       30.050000       8.186567 
      52       30.030000       8.305267 
      52       30.010000       8.344744 
      52       30.020000       8.269832 
      52       30.010000       8.170470 
      52       30.020000       8.184282 
      52       30.030000       8.220576 
      52       30.000000       8.166839 
      52       29.990000       8.146620 
      52       30.000000       8.180711 
      53       30.030000       8.220589 
      53       30.070000       8.220589 
      53       29.960000       8.236747 
      53       30.010000       8.203594 
      53       30.040000       8.203594 
      53       30.010000       8.246229 
      53       30.020000       8.340277 
      53       30.010000       8.400407 
      53       29.840000       8.438450 
      53       30.160000       8.422792 
      53       29.880000       8.382899 
      53       29.950000       8.350229 
      53       30.070000       8.303537 
      53       30.040000       8.267366 
      53       30.010000       8.269431 
      54       30.030000       8.330101 
      54       30.010000       8.380074 
      54       29.960000       8.364126 
      54       30.140000       8.286926 
      54       29.950000       8.238629 
      54       30.000000       8.225980 
      54       30.040000       8.287022 
      54       29.940000       8.287022 
      54       30.040000       8.357245 
      54       29.940000       8.357245 
      54       30.080000       8.293184 
      54       29.990000       8.193821 
      54       30.020000       8.196783 
      54       30.020000       8.202318 
      54       30.020000       8.205795 
      55       30.020000       8.286996 
      55       30.070000       8.310623 
      55       29.990000       8.290167 
      55       30.090000       8.289171 
      55       30.120000       8.317890 
      55       29.990000       8.314763 
      55       30.020000       8.314763 
      55       30.050000       8.267658 
      55       29.970000       8.261027 
      55       30.160000       8.268085 
      55       29.920000       8.256098 
      55       30.140000       8.249291 
      55       30.060000       8.304049 
      55       30.040000       8.353246 
      55       30.100000       8.333671 
      56       30.000000       8.320083 
      56       30.080000       8.360100 
      56       30.070000       8.403438 
      56       30.050000       8.370382 
      56       29.990000       8.234493 
      56       30.000000       8.197933 
      56       30.050000       8.285555 
      56       29.950000       8.343943 
      56       30.040000       8.365416 
      56       30.040000       8.365416 
      56       30.020000       8.365416 
      56       29.970000       8.403951 
      56       30.050000       8.370329 
      56       30.040000       8.318448 
      56       29.990000       8.369900 
      57       30.070000       8.369900 
      57       29.970000       8.399049 
      57       30.010000       8.348444 
      57       30.050000       8.351575 
      57       30.050000       8.351575 
      57       30.030000       8.351575 
      57       30.070000       8.351575 
      57       29.960000       8.351575 
      57       30.010000       8.351575 
      57       30.120000       8.418280 
      57       30.000000       8.456026 
      57       30.080000       8.412868 
      57       30.030000       8.412868 
      57       30.080000       8.326491 
      57       29.970000       8.297725 
      58       30.020000       8.325559 
      58       30.020000       8.273511 
      58       30.030000       8.273511 
      58       30.050000       8.217121 
      58       29.990000       8.270857 
      58       30.090000       8.377066 
      58       30.060000       8.408881 
      58       30.020000       8.377100 
      58       30.040000       8.399053 
      58       29.950000       8.399053 
      58       30.030000       8.404878 
      58       30.010000       8.348900 
      58       30.050000       8.351575 
      58       30.030000       8.351575 
      58       30.030000       8.417810 
      59       30.000000       8.449700 
      59       30.050000       8.376584 
      59       30.020000       8.223375 
      59       30.040000       8.138688 
      59       30.070000       8.241314 
      59       30.050000       8.387298 
      59       29.980000       8.387298 
      59       30.030000       8.414749 
      59       30.090000       8.377500 
      59       30.010000       8.333632 
      59       30.020000       8.314822 
      59       30.040000       8.314822 
      59       30.000000       8.403592 
      59       30.000000       8.481845 
      59       30.010000       8.425976 
      59       29.920000       8.337149 
      60       30.020000       8.268142 
      60       30.020000       8.179438 
      60       30.010000       8.170938 
      60       30.080000       8.217463 
      60       30.070000       8.248484 
      60       30.070000       8.334451 
      60       30.020000       8.334451 
      60       30.070000       8.432191 
      60       30.000000       8.454143 
      60       30.020000       8.396341 
      60       30.090000       8.313922 
      60       29.990000       8.329615 
      60       30.010000       8.329615 
      60       30.000000       8.329615 
      60       29.970000       8.351462 
      61       30.000000       8.306361 
