

 time    ||    gripping force   ||   raspberry measurement 

      0       18.280000       -794.114894 
      0       24.330000       -794.114894 
      0       16.100000       -794.114894 
      0       3.390000       -794.114894 
      0       3.570000       -794.114894 
      0       14.910000       -794.114894 
      0       23.560000       -794.114894 
      1       20.390000       -786.173745 
      1       8.010000       -778.312007 
      1       6.860000       -770.528882 
      1       9.030000       -762.822424 
      1       11.520000       -755.088895 
      1       17.980000       -751.566435 
      1       26.100000       -708.653556 
      1       24.980000       -516.325393 
      1       15.050000       -199.211157 
      1       14.450000       -6.894592 
      2       14.520000       35.834029 
      2       15.150000       39.079268 
      2       15.750000       39.163504 
      2       16.650000       39.421032 
      2       16.870000       39.581385 
      2       17.210000       39.510171 
      2       17.140000       39.292872 
      2       17.060000       39.198823 
      2       17.060000       39.336002 
      2       17.020000       39.514669 
      3       17.040000       39.660503 
      3       17.020000       39.718117 
      3       16.960000       39.669513 
      3       16.940000       39.584705 
      3       16.950000       39.601450 
      3       16.960000       39.682845 
      3       16.890000       39.717922 
      3       16.940000       39.711128 
      3       16.930000       39.719225 
      3       16.890000       39.698156 
      3       16.930000       39.663244 
      3       16.860000       39.656034 
      4       16.790000       39.663687 
      4       16.840000       39.703555 
      4       16.880000       39.743449 
      4       16.810000       39.751948 
      4       16.740000       39.754220 
      4       16.780000       39.751949 
      4       16.750000       39.743475 
      5       16.760000       39.704427 
      5       16.800000       39.674002 
      5       16.750000       39.697726 
      5       16.780000       39.703498 
      5       16.810000       39.643976 
      5       16.750000       39.623739 
      5       16.810000       39.665458 
      5       16.760000       39.671217 
      6       16.770000       39.659230 
      6       16.720000       39.653695 
      6       16.730000       39.659230 
      6       16.740000       39.671217 
      6       16.770000       39.665445 
      6       16.720000       39.623309 
      6       16.650000       39.638993 
      6       16.730000       39.683787 
      6       16.730000       39.670357 
      6       16.770000       39.630937 
      6       16.750000       39.600012 
      7       16.760000       39.639476 
      7       16.770000       39.713826 
      7       16.780000       39.745220 
      7       16.740000       39.742952 
      7       16.730000       39.703085 
      7       16.740000       39.657845 
      7       16.800000       39.626451 
      7       16.730000       39.599569 
      7       16.750000       39.638590 
      7       16.710000       39.703471 
      7       16.750000       39.702225 
      7       16.740000       39.687374 
      8       16.690000       39.695054 
      8       16.760000       39.677516 
      8       16.750000       39.665502 
      8       16.710000       39.682458 
      8       16.730000       39.713852 
      8       16.720000       39.703071 
      8       16.750000       39.686488 
      8       16.690000       39.683356 
      8       16.670000       39.617840 
      8       16.720000       39.530605 
      8       16.620000       39.514324 
      8       16.720000       39.547574 
      9       16.710000       39.571704 
      9       16.720000       39.647532 
      9       16.690000       39.692646 
      9       16.680000       39.643089 
      9       16.710000       39.623712 
      9       16.630000       39.665431 
      9       16.680000       39.670344 
      9       16.620000       39.648848 
      9       16.740000       39.609840 
      9       16.670000       39.593726 
      10       16.680000       39.625108 
      10       16.710000       39.647033 
      10       16.650000       39.654704 
      10       16.570000       39.663620 
      10       16.690000       39.702668 
      10       16.640000       39.732624 
      10       16.690000       39.702668 
      10       16.660000       39.663607 
      10       16.610000       39.654287 
      10       16.600000       39.642520 
      10       16.610000       39.611709 
      10       16.640000       39.602187 
      10       16.630000       39.664129 
      11       16.630000       39.676519 
      11       16.620000       39.618462 
      11       16.580000       39.589603 
      11       16.610000       39.606309 
      11       16.590000       39.630369 
      11       16.580000       39.656904 
      11       16.570000       39.600326 
      11       16.570000       39.467329 
      11       16.570000       39.383085 
      11       16.560000       39.470886 
      12       16.570000       39.623721 
      12       16.670000       39.688188 
      12       16.570000       39.698130 
      12       16.630000       39.670733 
      12       16.620000       39.619721 
      12       16.550000       39.545736 
      12       16.630000       39.528763 
      12       16.620000       39.585170 
      12       16.590000       39.598625 
      12       16.620000       39.603598 
      12       16.570000       39.673474 
      12       16.640000       39.726767 
      13       16.620000       39.701298 
      13       16.600000       39.651909 
      13       16.610000       39.595081 
      13       16.600000       39.513881 
      13       16.560000       39.477698 
      13       16.610000       39.513881 
      13       16.610000       39.595082 
      13       16.530000       39.651949 
      13       16.640000       39.702628 
      13       16.630000       39.742965 
      13       16.560000       39.746066 
      13       16.620000       39.723294 
      14       16.700000       39.671633 
      14       17.390000       39.605880 
      14       17.640000       39.543491 
      14       17.720000       39.537276 
      14       18.000000       39.564131 
      14       18.040000       39.627765 
      14       18.020000       39.688729 
      14       18.010000       39.700342 
      14       18.060000       39.699514 
      14       18.010000       39.676616 
      14       18.030000       39.649761 
      15       17.980000       39.615266 
      15       18.020000       39.618367 
      15       17.990000       39.670374 
      15       17.970000       39.694527 
      15       17.890000       39.688729 
      15       17.960000       39.633607 
      15       18.000000       39.594170 
      15       17.950000       39.606753 
      15       18.020000       39.631349 
      15       18.000000       39.670388 
      16       17.940000       39.682002 
      16       17.990000       39.703111 
      16       17.970000       39.719682 
      16       17.980000       39.712067 
      16       17.960000       39.730023 
      16       17.950000       39.746563 
      16       17.950000       39.743462 
      16       17.980000       39.709370 
      16       17.980000       39.692840 
      16       17.910000       39.714739 
      16       17.900000       39.703555 
      16       17.950000       39.692370 
      17       18.020000       39.714242 
      17       18.020000       39.696826 
      17       18.040000       39.651989 
      17       18.040000       39.602213 
      17       18.060000       39.558788 
      17       18.020000       39.603582 
      17       18.070000       39.649221 
      17       17.990000       39.616151 
      17       18.020000       39.609371 
      17       17.990000       39.620165 
      17       18.010000       39.612538 
      17       18.060000       39.635906 
      17       18.060000       39.677475 
      18       18.040000       39.723321 
      18       18.040000       39.741137 
      18       18.010000       39.724637 
      18       18.070000       39.693257 
      18       18.010000       39.704011 
      18       17.980000       39.719682 
      18       17.990000       39.711194 
      18       17.950000       39.719642 
      18       17.990000       39.702681 
      18       17.960000       39.677046 
      18       18.010000       39.651617 
      19       17.970000       39.616525 
      19       18.000000       39.632805 
      19       18.020000       39.655949 
      19       17.910000       39.693725 
      19       17.980000       39.692716 
      19       18.030000       39.662774 
      19       18.020000       39.655134 
      19       18.000000       39.652862 
      19       18.000000       39.654274 
      19       17.990000       39.652822 
      20       17.960000       39.653831 
      20       17.990000       39.647463 
      20       17.960000       39.630950 
      20       17.940000       39.623323 
      20       17.930000       39.673958 
      20       17.940000       39.713813 
      20       17.990000       39.710281 
      20       17.960000       39.713813 
      20       17.970000       39.673958 
      20       17.990000       39.623350 
      20       17.940000       39.631837 
      21       17.930000       39.658288 
      21       17.950000       39.703085 
      21       17.950000       39.742536 
      21       17.970000       39.740720 
      21       17.960000       39.700883 
      21       17.920000       39.653792 
      21       17.950000       39.684327 
      21       17.980000       39.727708 
      21       17.920000       39.703111 
      21       17.990000       39.673989 
      21       17.960000       39.698612 
      21       17.900000       39.714296 
      21       17.940000       39.692384 
      21       17.910000       39.703984 
      22       17.910000       39.719668 
      22       17.870000       39.710738 
      22       17.960000       39.713813 
      22       18.170000       39.673502 
      22       17.820000       39.617494 
      22       17.970000       39.601783 
      22       17.880000       39.588301 
      22       17.960000       39.607665 
