Human trial picking the raspberry twin 

 time    ||     output compensated 

      0       -799.745652 
      0       -799.745652 
      0       -799.745652 
      0       -799.745652 
      0       -799.745652 
      0       -799.745652 
      0       -799.745652 
      0       -799.745652 
      0       -799.745652 
      0       -799.745647 
      0       -799.744458 
      0       -799.637394 
      0       -796.091955 
      0       -752.900485 
      0       -559.339230 
      0       -240.247655 
      0       -46.748193 
      0       -3.577402 
      0       -0.059252 
      0       0.008321 
      0       -0.007459 
      0       0.012159 
      0       0.060637 
      0       0.045782 
      0       0.005958 
      0       -0.027664 
      0       -0.001213 
      0       0.085720 
      0       0.115258 
      0       0.098732 
      0       0.054768 
      0       0.014444 
      0       0.005059 
      0       -0.007569 
      0       -0.048318 
      0       -0.096243 
      0       -0.073874 
      0       -0.047406 
      0       -0.018320 
      0       0.083504 
      0       0.105276 
      0       -0.003385 
      0       -0.075226 
      0       -0.007485 
      0       0.032353 
      0       0.013545 
      0       0.016246 
      0       0.046224 
      0       0.055667 
      0       -0.008008 
      0       -0.040678 
      1       -0.063603 
      1       -0.125370 
      1       -0.122291 
      1       -0.046091 
      1       0.025584 
      1       0.009917 
      1       -0.066231 
      1       -0.057731 
      1       -0.005284 
      1       0.021128 
      1       0.020742 
      1       -0.011608 
      1       -0.007857 
      1       0.029186 
      1       0.080418 
      1       0.126930 
      1       0.163736 
      1       0.148442 
      1       0.112631 
      1       0.088377 
      1       0.013527 
      1       -0.103896 
      1       -0.168404 
      1       -0.149180 
      1       -0.122738 
      1       -0.091327 
      1       0.018456 
      1       0.094122 
      1       0.070991 
      1       0.073540 
      1       0.061992 
      1       0.001405 
      1       0.006900 
      1       0.006703 
      1       -0.043766 
      1       -0.095410 
      1       -0.069388 
      1       -0.035323 
      1       -0.042574 
      1       -0.039280 
      1       -0.033218 
      1       -0.046867 
      1       -0.073041 
      1       -0.021784 
      1       0.022860 
      1       0.057521 
      1       0.082898 
      1       0.041364 
      1       -0.049744 
      1       -0.141909 
      1       -0.151032 
      1       -0.087274 
      1       -0.074898 
      2       -0.069319 
      2       -0.076226 
      2       -0.083217 
      2       -0.055516 
      2       0.018443 
      2       0.057895 
      2       0.026943 
      2       -0.013337 
      2       -0.036692 
      2       -0.029937 
      2       -0.051046 
      2       -0.085945 
      2       -0.092739 
      2       -0.080560 
      2       -0.026850 
      2       0.009903 
      2       -0.014138 
      2       -0.029510 
      2       -0.072713 
      2       -0.111889 
      2       -0.056613 
      2       0.024095 
      2       0.015630 
      2       -0.059691 
      2       -0.100166 
      2       -0.092229 
      2       -0.005070 
      2       0.026708 
      2       -0.025717 
      2       -0.049961 
      2       -0.028580 
      2       -0.039366 
      2       -0.049168 
      2       -0.016306 
      2       0.015402 
      2       0.060475 
      2       0.104272 
      2       0.124948 
      2       0.118397 
      2       0.070180 
      2       0.061090 
      2       0.066605 
      2       0.043343 
      2       0.052253 
      2       0.043138 
      2       -0.054716 
      2       -0.115522 
      2       -0.083698 
      3       -0.085124 
      3       -0.056272 
      3       -0.002125 
      3       0.022820 
      3       0.007452 
      3       -0.081756 
      3       -0.138618 
      3       -0.111483 
      3       -0.070531 
      3       -0.043101 
      3       -0.045904 
      3       -0.070142 
      3       -0.119691 
      3       -0.107244 
      3       -0.020260 
      3       0.043953 
      3       0.037200 
      3       0.020080 
      3       0.008231 
      3       -0.014782 
      3       -0.054741 
      3       -0.067737 
      3       -0.045557 
      3       -0.039992 
      3       -0.060226 
      3       -0.005275 
      3       0.037123 
      3       0.002406 
      3       -0.085648 
      3       -0.091726 
      3       0.017356 
      3       0.124539 
      3       0.104675 
      3       0.038449 
      3       0.028691 
      3       -0.004365 
      3       -0.020326 
      3       0.003393 
      3       -0.006480 
      3       -0.003620 
      3       -0.001130 
      3       -0.038192 
      3       -0.098802 
      3       -0.124639 
      3       -0.140534 
      3       -0.158782 
      3       -0.129562 
      3       -0.019733 
      3       0.015631 
      3       -0.036083 
      3       -0.140760 
      3       -0.193558 
      3       -0.166650 
      3       -0.097727 
      4       -0.043737 
      4       0.020380 
      4       0.042600 
      4       0.045105 
      4       0.082178 
      4       0.142722 
      4       0.170912 
      4       0.180822 
      4       0.125251 
      4       0.013147 
      4       -0.045090 
      4       -0.002144 
      4       0.056038 
      4       0.060727 
      4       0.025570 
      4       -0.072806 
      4       -0.139380 
      4       -0.094666 
      4       -0.017282 
      4       0.005821 
      4       -0.018931 
      4       -0.032171 
      4       0.016182 
      4       0.035426 
      4       0.017899 
      4       -0.024541 
      4       -0.049006 
      4       0.005056 
      4       0.082294 
      4       0.104002 
      4       0.073361 
      4       0.040535 
      4       0.070907 
      4       0.085105 
      4       0.006730 
      4       -0.107871 
      4       -0.081856 
      4       0.007107 
      4       0.000074 
      4       -0.003566 
      4       0.061766 
      4       0.096558 
      4       0.070421 
      4       0.037199 
      4       0.058229 
      4       0.040214 
      4       -0.051072 
      4       -0.129552 
      4       -0.133167 
      4       -0.134931 
      4       -0.146912 
      4       -0.075268 
      5       -0.011255 
      5       -0.035303 
      5       -0.037372 
      5       -0.002223 
      5       -0.052520 
      5       -0.100070 
      5       -0.096763 
      5       -0.064377 
      5       -0.030786 
      5       -0.012525 
      5       -0.055568 
      5       -0.058907 
      5       -0.106774 
      5       -0.177941 
      5       -0.137131 
      5       -0.087072 
      5       -0.088668 
      5       -0.102592 
      5       -0.073925 
      5       -0.009818 
      5       0.055111 
      5       0.016754 
      5       -0.076876 
      5       -0.079793 
      5       -0.054497 
      5       -0.082015 
      5       -0.096158 
      5       -0.085127 
      5       -0.069955 
      5       -0.091495 
      5       -0.064337 
      5       0.010777 
      5       0.064866 
      5       0.096588 
      5       0.062748 
      5       0.020980 
      5       0.050835 
      5       0.041965 
      5       -0.028588 
      5       -0.005594 
      5       0.093253 
      5       0.137269 
      5       0.090526 
      5       0.049370 
      5       0.037227 
      5       0.037428 
      5       0.036029 
      5       0.041998 
      5       0.058738 
      5       0.074238 
      5       0.045893 
      5       -0.017973 
      5       -0.083901 
      5       -0.059988 
      5       -0.022207 
      5       -0.070690 
      5       -0.076709 
      5       -0.049729 
      6       -0.054151 
      6       -0.033997 
      6       -0.018256 
      6       -0.014399 
      6       -0.026287 
      6       -0.010059 
      6       0.010077 
      6       0.011661 
      6       0.013012 
      6       0.007415 
      6       0.065198 
      6       0.114458 
      6       0.105102 
      6       0.059489 
      6       0.017354 
      6       -0.010487 
      6       -0.018211 
      6       -0.044393 
      6       -0.069932 
      6       -0.048525 
      6       0.024411 
      6       0.060432 
      6       0.100378 
      6       0.167992 
      6       0.196637 
      6       0.188371 
      6       0.203903 
      6       0.214170 
      6       0.199749 
      6       0.181213 
      6       0.196379 
      6       0.211628 
      6       0.218963 
      6       0.230579 
      6       0.303794 
      6       0.500529 
      6       0.806727 
      7       1.072479 
      7       1.194129 
      7       1.228711 
      7       1.303739 
      7       1.500528 
      7       1.806727 
      7       2.072493 
      7       2.194585 
      7       2.234539 
      7       2.332852 
      7       2.557904 
      7       2.830881 
      7       2.995472 
      7       3.086963 
      7       3.229652 
      7       3.400828 
      7       3.534135 
      7       3.636271 
      7       3.793300 
      7       3.939742 
      7       4.004927 
      7       4.010687 
      7       3.995557 
      7       3.993786 
      7       4.073601 
      7       4.173048 
      7       4.220640 
      7       4.267289 
      7       4.309842 
      7       4.344062 
      7       4.452478 
      7       4.594143 
      7       4.669449 
      7       4.741211 
      7       4.790434 
      7       4.754651 
      7       4.666873 
      7       4.571291 
      7       4.512766 
      7       4.585672 
      7       4.720126 
      7       4.717482 
      7       4.703211 
      8       4.719702 
      8       4.765157 
      8       4.936199 
      8       5.010184 
      8       4.907102 
      8       4.831857 
      8       4.784634 
      8       4.721551 
      8       4.581091 
      8       4.409053 
      8       4.286186 
      8       4.229222 
      8       4.219364 
      8       4.216905 
      8       4.214297 
      8       4.163030 
      8       3.924203 
      8       3.369465 
      8       2.383283 
      8       1.044680 
      8       0.370891 
      8       0.661306 
      8       0.929262 
      8       0.796762 
      8       0.431389 
      8       0.020679 
      8       -0.392398 
      8       -0.750944 
      9       -1.088289 
      9       -1.412735 
      9       -1.592661 
      9       -1.633071 
      9       -1.659152 
      9       -1.686973 
      9       -1.731838 
      9       -1.772162 
      9       -1.780675 
      9       -1.782947 
      9       -1.780675 
      9       -1.754454 
      9       -1.697414 
      9       -1.640944 
      9       -1.616120 
      9       -1.597710 
      9       -1.599982 
      9       -1.608482 
      9       -1.648376 
      9       -1.688270 
      10       -1.696770 
      10       -1.699068 
      10       -1.697656 
      10       -1.699095 
      10       -1.697657 
      10       -1.699095 
      10       -1.697657 
      10       -1.699095 
      10       -1.697657 
      10       -1.699095 
      10       -1.697657 
      10       -1.699095 
      10       -1.697657 
      10       -1.699108 
      10       -1.698100 
      10       -1.704494 
      10       -1.721854 
      10       -1.738989 
      10       -1.721854 
      10       -1.704494 
      10       -1.698100 
      10       -1.699108 
      10       -1.697657 
      10       -1.699095 
      10       -1.697657 
      11       -1.699095 
      11       -1.697657 
      11       -1.699095 
      11       -1.697657 
      11       -1.699095 
      11       -1.697657 
      11       -1.699095 
      11       -1.697657 
      11       -1.699095 
      11       -1.697657 
      11       -1.699095 
      12       -1.697657 
      12       -1.699095 
      12       -1.697657 
      12       -1.699108 
      12       -1.698100 
      12       -1.704494 
      12       -1.721854 
      12       -1.738989 
      12       -1.721854 
      12       -1.704494 
      12       -1.698099 
      12       -1.699082 
      12       -1.696770 
      12       -1.688297 
      12       -1.649263 
      12       -1.619320 
      12       -1.649719 
      12       -1.694126 
      12       -1.725936 
      12       -1.758190 
      13       -1.742520 
      13       -1.708025 
      13       -1.682968 
      13       -1.663877 
      13       -1.648636 
      13       -1.630725 
      13       -1.615842 
      13       -1.598260 
      13       -1.583701 
      13       -1.566440 
      13       -1.552199 
      13       -1.535240 
      13       -1.520873 
      13       -1.498935 
      13       -1.462691 
      13       -1.421890 
      13       -1.441822 
      13       -1.477094 
      13       -1.454759 
      13       -1.423863 
      13       -1.403320 
      13       -1.390286 
      14       -1.374946 
      14       -1.362620 
      14       -1.347570 
      14       -1.335518 
      14       -1.320739 
      14       -1.308956 
      14       -1.294442 
      14       -1.282922 
      14       -1.268669 
      14       -1.257406 
      14       -1.243408 
      14       -1.232398 
      14       -1.218650 
      14       -1.207887 
      14       -1.194384 
      14       -1.183865 
      14       -1.170602 
      14       -1.160320 
      14       -1.147293 
      14       -1.137244 
      14       -1.124447 
      14       -1.114627 
      14       -1.102056 
      15       -1.092434 
      15       -1.079234 
      15       -1.060053 
      15       -1.010809 
      15       -0.971044 
      15       -0.990990 
      15       -1.019698 
      15       -1.017038 
      15       -0.999330 
      16       -0.950719 
      16       -0.911556 
      16       -0.932097 
      16       -0.961393 
      16       -0.959317 
      16       -0.942186 
      16       -0.894147 
      16       -0.855549 
      16       -0.876650 
      16       -0.906527 
      16       -0.905851 
      16       -0.899067 
      16       -0.888679 
      16       -0.881190 
      16       -0.870103 
      16       -0.853013 
      16       -0.805839 
      16       -0.768124 
      17       -0.790099 
      17       -0.820842 
      17       -0.821023 
      17       -0.815088 
      17       -0.805539 
      17       -0.798908 
      17       -0.789495 
      17       -0.783024 
      17       -0.773770 
      17       -0.767456 
      17       -0.758357 
      17       -0.752198 
      17       -0.743252 
      17       -0.737243 
      17       -0.728447 
      17       -0.722586 
      17       -0.713923 
      17       -0.707769 
      17       -0.693949 
      17       -0.665329 
      17       -0.627596 
      17       -0.636860 
      17       -0.664642 
      17       -0.665971 
      17       -0.661574 
      17       -0.653560 
      18       -0.648449 
      18       -0.640540 
      18       -0.635559 
      18       -0.627779 
      18       -0.622926 
      18       -0.615299 
      18       -0.611408 
      18       -0.613270 
      18       -0.641287 
      18       -0.650414 
      18       -0.612830 
      18       -0.584995 
      18       -0.571551 
      18       -0.556982 
      18       -0.511904 
      18       -0.467289 
      18       -0.454202 
      18       -0.447384 
      18       -0.444309 
      18       -0.438467 
      19       -0.436358 
      19       -0.440409 
      19       -0.475501 
      19       -0.510241 
      19       -0.513553 
      19       -0.510667 
      19       -0.503311 
      19       -0.489890 
      19       -0.446347 
      19       -0.412227 
      19       -0.437761 
      19       -0.472027 
      19       -0.475696 
      19       -0.473214 
      20       -0.467057 
      20       -0.462934 
      20       -0.446217 
      20       -0.396146 
      20       -0.322460 
      20       -0.320659 
      20       -0.384329 
      20       -0.428943 
      20       -0.433893 
      20       -0.431829 
      20       -0.425262 
      20       -0.412621 
      20       -0.369837 
      20       -0.336044 
      20       -0.357021 
      21       -0.368991 
