Human trial picking the raspberry twin 

 time    ||     output     ||     loadcell

      0.000000       -796.931250       0.030000 
      0.016724       -796.931250       0.050000 
      0.031921       -796.931250       0.100000 
      0.045930       -796.931250       0.060000 
      0.061619       -796.931250       0.090000 
      0.077502       -796.931250       0.020000 
      0.092999       -796.931250       0.070000 
      0.108214       -796.931250       0.100000 
      0.123763       -796.931250       0.100000 
      0.138927       -796.931245       0.080000 
      0.154367       -796.930060       0.020000 
      0.168616       -796.823398       0.050000 
      0.184376       -793.291215       0.140000 
      0.200460       -750.260428       0.080000 
      0.229501       -557.410203       0.140000 
      0.245391       -239.458591       0.030000 
      0.260253       -46.631678       0.020000 
      0.275763       -3.635386       0.070000 
      0.290629       -0.103633       0.130000 
      0.305873       0.032542       0.140000 
      0.320265       0.037810       0.010000 
      0.337181       0.017149       0.020000 
      0.352306       -0.009693       0.080000 
      0.367444       -0.046030       0.060000 
      0.383416       -0.044188       0.060000 
      0.399145       -0.006605       0.000000 
      0.415608       0.032429       0.050000 
      0.430886       0.033289       0.010000 
      0.446388       0.004179       0.040000 
      0.461732       0.003763       0.070000 
      0.477386       0.028346       0.040000 
      0.492777       0.014048       0.010000 
      0.507364       -0.017776       0.080000 
      0.523069       -0.014662       0.080000 
      0.538522       -0.030776       0.050000 
      0.553244       -0.041530       0.070000 
      0.569831       -0.009719       0.100000 
      0.585220       0.011776       0.050000 
      0.600626       0.014048       0.010000 
      0.615744       -0.001220       0.080000 
      0.632020       -0.001650       0.110000 
      0.646425       0.008662       0.030000 
      0.662626       -0.011978       0.040000 
      0.677810       -0.044188       0.090000 
      0.694231       -0.040671       0.120000 
      0.708799       0.013605       0.060000 
      0.724837       0.045815       0.020000 
      0.740693       0.008635       0.020000 
      0.758667       -0.060342       0.050000 
      0.772891       -0.070227       0.090000 
      0.787758       -0.038832       0.180000 
      0.801677       -0.022719       0.100000 
      0.818060       0.019420       0.160000 
      0.833021       0.057016       0.130000 
      0.848416       0.056156       0.020000 
      0.863631       0.008635       0.050000 
      0.879011       -0.070670       0.050000 
      0.893203       -0.113222       0.200000 
      0.909762       -0.094451       0.140000 
      0.924996       -0.032119       0.100000 
      0.940825       0.021591       0.060000 
      0.956602       0.008178       0.020000 
      0.970934       -0.042000       0.030000 
      0.986419       -0.054986       0.040000 
      1.018096       -0.059929       0.040000 
      1.033236       -0.065727       0.040000 
      1.049416       -0.025873       0.020000 
      1.065122       0.027016       0.000000 
      1.081278       0.027433       0.020000 
      1.097202       -0.020904       0.040000 
      1.113643       -0.046500       0.020000 
      1.127867       -0.039276       0.010000 
      1.144011       -0.051885       0.000000 
      1.159082       -0.045074       0.010000 
      1.175741       -0.011562       0.020000 
      1.188922       0.014047       0.020000 
      1.205212       0.022091       0.030000 
      1.220328       0.032859       0.050000 
      1.237229       0.009548       0.110000 
      1.253175       -0.035688       0.010000 
      1.268377       -0.019991       0.050000 
      1.284523       0.028333       0.110000 
      1.300351       0.037385       0.130000 
      1.316164       0.017579       0.010000 
      1.330772       -0.004294       0.020000 
      1.346242       -0.021846       0.080000 
      1.362361       -0.004750       0.070000 
      1.377305       0.011750       0.060000 
      1.393270       0.008232       0.000000 
      1.408823       -0.030372       0.070000 
      1.424816       -0.060315       0.010000 
      1.440751       -0.030346       0.050000 
      1.455720       0.009119       0.060000 
      1.472512       0.022561       0.110000 
      1.487488       0.044087       0.090000 
      1.501989       0.063301       0.110000 
      1.517783       0.066941       0.100000 
      1.533740       0.051201       0.150000 
      1.550658       -0.020478       0.140000 
      1.564941       -0.128932       0.080000 
      1.580898       -0.148187       0.020000 
      1.595890       -0.066228       0.100000 
      1.610925       -0.008435       0.090000 
      1.627967       -0.032615       0.160000 
      1.643935       -0.071597       0.140000 
      1.658936       -0.084153       0.110000 
      1.674955       -0.095310       0.140000 
      1.690947       -0.071126       0.130000 
      1.706123       -0.015106       0.120000 
      1.721094       0.017135       0.160000 
      1.736720       0.042744       0.150000 
      1.752736       0.052087       0.020000 
      1.767722       0.014517       0.100000 
      1.783960       -0.035258       0.190000 
      1.799181       -0.019991       0.210000 
      1.815220       0.027890       0.170000 
      1.830102       0.031959       0.040000 
      1.845129       -0.007492       0.070000 
      1.861079       -0.054543       0.120000 
      1.875065       -0.089025       0.160000 
      1.890001       -0.065298       0.190000 
      1.906177       0.008205       0.190000 
      1.921340       0.045788       0.100000 
      1.937482       0.013134       0.030000 
      1.952474       -0.046970       0.030000 
      1.967716       -0.079613       0.070000 
      1.982740       -0.105222       0.130000 
      2.013476       -0.114095       0.040000 
      2.030871       -0.070280       0.040000 
      2.045613       0.013174       0.010000 
      2.060902       0.070428       0.060000 
      2.076119       0.058884       0.050000 
      2.091233       0.007294       0.020000 
      2.106839       -0.003837       0.040000 
      2.122645       -0.005705       0.040000 
      2.138543       0.003347       0.150000 
      2.154476       0.033732       0.140000 
      2.169225       0.038688       0.100000 
      2.184752       0.027490       0.070000 
      2.200263       0.032859       0.140000 
      2.231435       0.004149       0.140000 
      2.247524       -0.060301       0.010000 
      2.264314       -0.064398       0.070000 
      2.279148       -0.009236       0.100000 
      2.294978       0.041346       0.060000 
      2.311177       0.082639       0.020000 
      2.326183       0.076284       0.060000 
      2.341551       0.019916       0.090000 
      2.357979       -0.034815       0.060000 
      2.372893       -0.019951       0.080000 
      2.387761       0.028803       0.060000 
      2.403817       0.043657       0.080000 
      2.419779       0.052144       0.110000 
      2.433742       0.079025       0.030000 
      2.449544       0.062872       0.060000 
      2.464288       0.027074       0.110000 
      2.481198       0.004136       0.160000 
      2.496659       -0.054959       0.030000 
      2.511770       -0.105165       0.010000 
      2.527322       -0.073341       0.050000 
      2.541366       -0.011991       0.100000 
      2.558294       0.037358       0.100000 
      2.573685       0.057016       0.050000 
      2.588643       0.038258       0.060000 
      2.604715       -0.000763       0.050000 
      2.620368       -0.019991       0.090000 
      2.637379       -0.006592       0.130000 
      2.651650       0.008676       0.010000 
      2.667776       -0.006592       0.030000 
      2.685133       -0.020004       0.050000 
      2.700071       -0.001206       0.090000 
      2.714011       0.032859       0.080000 
      2.728975       0.032873       0.130000 
      2.745216       -0.000750       0.010000 
      2.760483       -0.014149       0.050000 
      2.775137       0.023434       0.100000 
      2.790996       0.077723       0.050000 
      2.806356       0.076284       0.050000 
      2.821599       0.024832       0.050000 
      2.837174       -0.016904       0.040000 
      2.853415       -0.015078       0.060000 
      2.867480       -0.036175       0.050000 
      2.882537       -0.065728       0.150000 
      2.899399       -0.049641       0.040000 
      2.915155       -0.013321       0.040000 
      2.929627       -0.002606       0.120000 
      2.946291       -0.055872       0.090000 
      2.961155       -0.110135       0.020000 
      2.976163       -0.092166       0.140000 
      2.991491       -0.028575       0.050000 
      3.007501       0.042271       0.030000 
      3.024057       0.027876       0.060000 
      3.038718       -0.030733       0.030000 
      3.052546       -0.019131       0.080000 
      3.068375       0.033329       0.070000 
      3.083177       0.057056       0.050000 
      3.098272       0.043631       0.120000 
      3.115403       0.022991       0.170000 
      3.130527       0.014504       0.050000 
      3.145331       -0.006619       0.040000 
      3.162287       -0.026706       0.010000 
      3.177846       -0.041144       0.060000 
      3.192827       -0.073798       0.040000 
      3.209695       -0.081881       0.020000 
      3.224845       -0.020961       0.010000 
      3.239937       -0.002580       0.020000 
      3.256025       -0.047386       0.060000 
      3.272079       -0.068439       0.010000 
      3.286603       -0.052329       0.060000 
      3.303491       -0.021377       0.040000 
      3.318916       -0.036658       0.010000 
      3.333338       -0.066197       0.110000 
      3.349880       -0.055443       0.000000 
      3.365537       -0.041587       0.050000 
      3.379651       -0.050473       0.050000 
      3.396085       -0.046513       0.090000 
      3.412066       -0.010150       0.060000 
      3.427522       0.011749       0.030000 
      3.442997       0.013604       0.010000 
      3.473289       -0.006632       0.050000 
      3.489440       -0.026290       0.070000 
      3.505599       -0.036645       0.060000 
      3.520178       -0.060815       0.040000 
      3.535985       -0.094894       0.100000 
      3.551181       -0.089938       0.010000 
      3.566069       -0.036631       0.000000 
      3.581066       0.003263       0.100000 
      3.597042       -0.001663       0.120000 
      3.611030       0.003736       0.000000 
      3.626602       0.033302       0.030000 
      3.642601       0.033315       0.020000 
      3.657266       0.004166       0.020000 
      3.688052       0.003280       0.110000 
      3.704067       0.021644       0.070000 
      3.719534       -0.025460       0.020000 
      3.735599       -0.119477       0.100000 
      3.749479       -0.110591       0.160000 
      3.765750       -0.034377       0.040000 
      3.782168       -0.033960       0.000000 
      3.797883       -0.039716       0.070000 
      3.812855       -0.006216       0.050000 
      3.828771       0.031543       0.010000 
      3.843844       0.022048       0.040000 
      3.858790       -0.049587       0.060000 
      3.874125       -0.099363       0.020000 
      3.890515       -0.050030       0.060000 
      3.905738       0.016675       0.010000 
      3.920998       0.008192       0.030000 
      3.937571       -0.036601       0.010000 
      3.953104       -0.030346       0.010000 
      3.969377       -0.014649       0.110000 
      3.985300       -0.017777       0.070000 
      4.000644       0.014021       0.030000 
      4.015596       0.027460       0.050000 
      4.030981       -0.007049       0.030000 
      4.047041       -0.044671       0.020000 
      4.062305       -0.052316       0.100000 
      4.076749       -0.044701       0.020000 
      4.092759       -0.071583       0.060000 
      4.108977       -0.071570       0.080000 
      4.138618       -0.044272       0.040000 
      4.169465       -0.047386       0.090000 
      4.186171       -0.026760       0.020000 
      4.200594       -0.002163       0.040000 
      4.217366       -0.037061       0.010000 
      4.232246       -0.089494       0.020000 
      4.246970       -0.089038       0.140000 
      4.262595       -0.030789       0.020000 
      4.278116       0.032402       0.110000 
      4.293405       0.056573       0.140000 
      4.307445       0.037801       0.040000 
      4.338422       -0.006163       0.020000 
      4.354208       -0.044201       0.010000 
      4.368971       -0.046929       0.070000 
      4.383344       -0.020934       0.010000 
      4.398673       -0.036631       0.060000 
      4.415312       -0.065741       0.050000 
      4.430499       -0.049641       0.040000 
      4.446267       -0.013308       0.010000 
      4.461165       -0.002163       0.070000 
      4.477251       -0.050514       0.100000 
      4.492715       -0.087267       0.000000 
      4.508528       -0.068456       0.030000 
      4.522971       -0.076539       0.010000 
      4.539571       -0.067057       0.130000 
      4.553249       -0.025487       0.010000 
      4.568022       -0.031676       0.000000 
      4.584377       -0.042000       0.110000 
      4.599334       -0.015106       0.040000 
      4.615478       -0.011991       0.130000 
      4.631156       -0.020891       0.090000 
      4.647356       -0.006619       0.140000 
      4.662617       0.008675       0.140000 
      4.677537       -0.006633       0.090000 
      4.693561       -0.021374       0.050000 
      4.708584       -0.018733       0.060000 
      4.722387       -0.055943       0.010000 
      4.739578       -0.159858       0.040000 
      4.753998       -0.198879       0.040000 
      4.770379       -0.132990       0.140000 
      4.786119       -0.064040       0.240000 
      4.801303       -0.017791       0.070000 
      4.815350       -0.023273       0.060000 
      4.831147       -0.074241       0.120000 
      4.846116       -0.105192       0.130000 
      4.861574       -0.054986       0.100000 
      4.877237       0.003249       0.300000 
      4.893150       0.016249       0.080000 
      4.908354       0.013578       0.250000 
      4.923842       -0.011991       0.260000 
      4.939259       -0.049587       0.350000 
      4.955615       -0.065298       0.200000 
      4.970877       -0.031232       0.060000 
      4.986018       0.003263       0.150000 
      5.001710       -0.007035       0.110000 
      5.017504       -0.020031       0.000000 
      5.033488       -0.001650       0.220000 
      5.048710       0.027473       0.060000 
      5.064214       0.009078       0.170000 
      5.078887       -0.036601       0.030000 
      5.094772       -0.031246       0.130000 
      5.111579       -0.025877       0.020000 
      5.127655       -0.071153       0.020000 
      5.143636       -0.085438       0.170000 
      5.158347       -0.046986       0.080000 
      5.174994       -0.045118       0.050000 
      5.191061       -0.081451       0.100000 
      5.206012       -0.044672       0.020000 
      5.221444       0.022047       0.050000 
      5.237152       0.026574       0.140000 
      5.252224       -0.025860       0.050000 
      5.268446       -0.064841       0.070000 
      5.283010       -0.049144       0.080000 
      5.298484       -0.007075       0.100000 
      5.314606       0.031060       0.100000 
      5.330850       0.016192       0.050000 
      5.346154       -0.079626       0.050000 
      5.361316       -0.168827       0.120000 
      5.376923       -0.137446       0.040000 
      5.391275       -0.042460       0.080000 
      5.407924       0.021134       0.020000 
      5.423432       0.012664       0.050000 
      5.439127       -0.028615       0.030000 
      5.455544       -0.063956       0.090000 
      5.470904       -0.121819       0.080000 
      5.486056       -0.144147       0.080000 
      5.501574       -0.129459       0.110000 
      5.517125       -0.096223       0.180000 
      5.532711       -0.037545       0.060000 
      5.547989       -0.002217       0.060000 
      5.562371       -0.028076       0.090000 
      5.579428       -0.063140       0.020000 
      5.594171       -0.111437       0.050000 
      5.610492       -0.166169       0.070000 
      5.625089       -0.093495       0.010000 
      5.641044       0.011249       0.080000 
      5.657322       0.026117       0.150000 
      5.673069       -0.020944       0.000000 
      5.688583       -0.046487       0.020000 
      5.703009       -0.038846       0.120000 
      5.719476       -0.046929       0.140000 
      5.735525       -0.026290       0.010000 
      5.749493       0.003666       0.070000 
      5.766361       -0.007935       0.040000 
      5.781841       -0.031702       0.030000 
      5.797750       -0.060412       0.060000 
      5.812907       -0.095753       0.080000 
      5.827797       -0.100279       0.000000 
      5.842944       -0.079197       0.010000 
      5.859098       -0.047400       0.040000 
      5.874326       0.007722       0.090000 
      5.889479       0.021148       0.040000 
      5.905237       -0.037075       0.140000 
      5.920338       -0.113248       0.140000 
      5.936638       -0.128919       0.050000 
      5.951963       -0.054986       0.020000 
      5.967340       0.027003       0.140000 
      5.981623       0.056130       0.170000 
      5.997741       0.037788       0.060000 
      6.013588       -0.006176       0.020000 
      6.028453       -0.044644       0.020000 
      6.044138       -0.052315       0.100000 
      6.060202       -0.044688       0.010000 
      6.076100       -0.071167       0.020000 
      6.090321       -0.067084       0.010000 
      6.106049       -0.031759       0.070000 
      6.121837       -0.066684       0.060000 
      6.137189       -0.130732       0.090000 
      6.152974       -0.124503       0.010000 
      6.168770       -0.090411       0.010000 
      6.186177       -0.076982       0.090000 
      6.200510       -0.050501       0.030000 
      6.216081       -0.012058       0.000000 
      6.231494       0.012288       0.030000 
      6.247311       0.001394       0.010000 
      6.262585       -0.052701       0.050000 
      6.278483       -0.096692       0.020000 
      6.293945       -0.034347       0.000000 
      6.308899       0.016648       0.110000 
      6.326152       -0.008378       0.120000 
      6.341137       -0.050084       0.050000 
      6.355413       -0.076096       0.010000 
      6.370476       -0.080056       0.010000 
      6.386247       -0.081494       0.040000 
      6.402530       -0.074644       0.040000 
      6.417073       -0.051026       0.000000 
      6.432545       0.000179       0.010000 
      6.447836       0.059257       0.090000 
      6.462715       0.083038       0.000000 
      6.478022       -0.001220       0.050000 
      6.493273       -0.070627       0.060000 
      6.508978       -0.038416       0.060000 
      6.523914       -0.017807       0.040000 
      6.539204       -0.026746       0.110000 
      6.555089       -0.031299       0.060000 
      6.569474       -0.037505       0.040000 
      6.585357       -0.065784       0.030000 
      6.601380       -0.113706       0.030000 
      6.616385       -0.106105       0.030000 
      6.632352       -0.027247       0.020000 
      6.647157       -0.013848       0.040000 
      6.662593       -0.096707       0.040000 
      6.678910       -0.159885       0.010000 
      6.693936       -0.159016       0.080000 
      6.708825       -0.149117       0.070000 
      6.724896       -0.111920       0.050000 
      6.739283       -0.020975       0.050000 
      6.755590       0.026976       0.100000 
      6.769731       0.021218       0.000000 
      6.785425       0.009481       0.010000 
      6.800521       -0.026277       0.060000 
      6.815418       -0.052315       0.030000 
      6.831219       -0.063070       0.040000 
      6.846326       -0.087267       0.010000 
      6.861502       -0.055913       0.040000 
      6.878320       -0.026843       0.030000 
      6.893954       -0.059944       0.010000 
      6.908607       -0.114675       0.030000 
      6.925334       -0.189011       0.070000 
      6.939652       -0.204695       0.020000 
      6.956501       -0.133030       0.050000 
      6.971814       -0.059514       0.000000 
      6.987115       -0.003506       0.020000 
      7.001600       -0.021001       0.000000 
      7.017553       -0.082312       0.060000 
      7.033037       -0.078780       0.080000 
      7.049227       -0.060829       0.170000 
      7.064926       -0.053215       0.090000 
      7.080927       -0.039786       0.070000 
      7.095802       -0.052799       0.110000 
      7.112090       -0.056329       0.090000 
      7.141838       -0.065811       0.060000 
      7.157118       -0.095767       0.050000 
      7.173695       -0.095350       0.040000 
      7.189152       -0.060842       0.040000 
      7.204607       -0.037075       0.000000 
      7.219154       -0.031259       0.020000 
      7.235934       -0.025860       0.010000 
      7.250608       -0.007036       0.040000 
      7.266344       0.009078       0.040000 
      7.281637       -0.002106       0.050000 
      7.298581       -0.007479       0.040000 
      7.314142       -0.020075       0.010000 
      7.329133       -0.066171       0.060000 
      7.345061       -0.071126       0.060000 
      7.360572       -0.044259       0.050000 
      7.376148       -0.047399       0.030000 
      7.390260       -0.027190       0.800000 
      7.405205       -0.007132       1.240000 
      7.421346       -0.056303       1.280000 
      7.437368       -0.110617       2.930000 
      7.452792       -0.098424       4.660000 
      7.468362       -0.062670       4.170000 
      7.484616       -0.034790       1.380000 
      7.499449       -0.022799       12.180000 
      7.514386       0.012718       22.160000 
      7.530594       0.017065       33.110000 
      7.545440       -0.050930       59.770000 
      7.560376       -0.111034       76.930000 
      7.575104       -0.108337       115.530000 
      7.592278       -0.100736       135.490000 
      7.607258       -0.072456       154.850000 
      7.622279       -0.025917       191.960000 
      7.638639       -0.031219       210.940000 
      7.653687       -0.035687       251.140000 
      7.668323       0.020858       269.840000 
      7.686399       0.089890       286.140000 
      7.700666       0.168479       312.030000 
      7.715637       0.331685       322.270000 
      7.731232       0.622200       345.820000 
      7.745322       0.939158       357.010000 
      7.760758       1.245402       366.390000 
      7.776448       1.542177       373.030000 
      7.791904       1.750811       372.730000 
      7.808708       1.900607       380.570000 
      7.824108       2.085105       386.350000 
      7.839242       2.399762       391.720000 
      7.855596       2.827572       395.880000 
      7.870910       3.208592       392.710000 
      7.887418       3.558925       379.210000 
      7.902467       3.870541       374.490000 
      7.917453       4.200730       379.380000 
      7.933086       4.632904       384.750000 
      7.947333       5.116221       388.650000 
      7.963371       5.582969       389.100000 
      7.978599       5.919236       386.310000 
      7.994750       6.097852       381.020000 
      8.010966       6.280884       379.910000 
      8.027136       6.568699       379.110000 
      8.042671       6.854702       377.570000 
      8.059482       7.012995       375.410000 
      8.074477       7.055618       373.650000 
      8.090844       7.044032       376.950000 
      8.105200       7.028403       388.120000 
      8.119476       7.039158       393.770000 
      8.135063       7.039118       398.450000 
      8.151394       7.027060       411.400000 
      8.166086       7.027419       411.390000 
      8.183043       6.978569       289.290000 
      8.198678       6.881794       187.130000 
      8.214259       6.815848       0.650000 
      8.228340       6.751326       16.820000 
      8.244642       6.718603       7.690000 
      8.259854       6.760738       0.090000 
      8.276072       6.783496       6.270000 
      8.290782       6.789478       13.640000 
      8.306056       6.842231       4.570000 
      8.321407       6.894651       0.030000 
      8.336670       6.873294       8.190000 
      8.351743       6.827291       12.680000 
      8.367522       6.539339       9.740000 
      8.381756       5.423140       0.560000 
      8.397101       3.160176       3.540000 
      8.412598       1.152828       12.170000 
      8.429775       1.161342       8.690000 
      8.445127       1.960480       2.490000 
      8.461206       2.294944       5.770000 
      8.477455       2.291407       10.720000 
      8.492635       2.148762       8.460000 
      8.507804       1.920083       4.900000 
      8.523370       1.604940       7.720000 
      8.538801       1.216981       11.590000 
      8.553260       0.733730       11.550000 
      8.570046       0.138716       4.420000 
      8.585760       -0.385286       4.840000 
      8.600779       -0.767956       10.570000 
      8.616451       -1.084890       9.800000 
      8.631513       -1.404736       5.850000 
      8.646515       -1.701885       4.210000 
      8.661199       -1.902411       7.300000 
      8.677530       -1.990715       8.440000 
      8.693716       -2.015962       5.140000 
      8.708908       -1.986811       3.500000 
      8.724079       -1.983338       7.940000 
      8.739783       -2.055443       9.590000 
      8.755016       -2.124432       5.270000 
      8.772102       -2.099796       4.380000 
      8.786226       -2.043788       5.970000 
      8.801395       -2.012364       9.860000 
      8.817589       -1.931743       7.710000 
      8.832670       -1.857327       5.270000 
      8.848475       -1.864954       7.220000 
      8.864093       -1.905207       10.020000 
      8.880047       -1.951013       7.650000 
      8.895041       -1.968815       5.520000 
      8.911366       -1.951912       7.720000 
      8.927294       -1.916422       9.620000 
      8.941607       -1.917887       6.970000 
      8.956486       -1.951360       5.270000 
      8.972900       -1.981079       7.380000 
      8.987335       -1.998868       8.930000 
      9.004143       -1.997635       8.230000 
      9.019549       -1.964399       4.950000 
      9.035212       -1.958184       5.560000 
      9.051118       -1.955873       8.610000 
      9.067332       -1.954570       7.430000 
      9.082506       -1.941531       5.600000 
      9.096479       -1.885952       6.030000 
      9.112034       -1.847913       7.800000 
      9.128115       -1.856799       7.460000 
      9.143371       -1.877022       5.990000 
      9.159791       -1.885470       5.750000 
      9.175125       -1.905746       8.330000 
      9.190342       -1.916378       8.700000 
      9.204753       -1.899062       6.400000 
      9.221329       -1.929891       6.230000 
      9.236333       -2.032587       7.270000 
      9.251139       -2.062973       8.650000 
      9.266327       -2.040285       7.400000 
      9.282686       -2.027619       6.220000 
      9.298738       -2.019189       7.330000 
      9.314714       -2.055500       8.420000 
      9.330148       -2.154016       6.830000 
      9.345531       -2.169270       5.880000 
      9.360554       -2.068428       7.190000 
      9.375672       -1.993609       8.090000 
      9.391156       -1.951400       6.440000 
      9.407318       -1.906659       5.850000 
      9.421625       -1.862186       6.240000 
      9.437054       -1.842528       7.910000 
      9.452667       -1.856356       7.460000 
      9.469172       -1.877009       5.950000 
      9.485293       -1.885495       6.530000 
      9.500122       -1.906552       8.160000 
      9.516094       -1.924504       7.450000 
      9.533036       -1.914605       6.550000 
      9.548064       -1.858615       7.010000 
      9.564991       -1.810690       7.910000 
      9.580019       -1.848286       7.430000 
      9.595978       -1.871611       6.690000 
      9.611958       -1.868966       7.280000 
      9.628915       -1.899838       8.020000 
      9.644238       -1.920947       7.110000 
      9.660016       -1.984153       6.470000 
      9.675063       -2.045973       6.620000 
      9.689971       -2.004293       7.860000 
      9.705039       -1.958215       7.690000 
      9.720926       -1.980526       6.840000 
      9.734881       -2.005702       6.570000 
      9.749814       -1.956343       7.250000 
      9.764800       -1.913391       7.730000 
      9.780797       -1.961742       6.730000 
      9.794807       -2.030289       6.290000 
      9.810764       -2.024033       6.570000 
      9.825778       -1.984556       7.660000 
      9.841765       -1.946956       7.310000 
      9.857810       -1.881453       6.560000 
      9.873806       -1.829142       6.880000 
      9.890728       -1.841546       7.820000 
      9.905902       -1.898132       7.360000 
      9.920708       -1.928934       6.640000 
      9.935008       -1.956841       7.130000 
      9.950442       -1.974657       7.710000 
      9.966260       -1.976109       7.270000 
      9.982356       -1.955873       6.710000 
      9.997253       -1.936645       7.100000 
      10.013919       -1.931246       7.540000 
      10.028828       -1.925860       6.960000 
      10.045414       -1.907035       6.490000 
      10.061337       -1.890908       6.570000 
      10.077161       -1.901650       7.550000 
      10.093426       -1.901649       7.440000 
      10.108643       -1.890895       6.580000 
      10.124424       -1.906579       6.690000 
      10.139438       -1.919991       7.140000 
      10.155160       -1.900776       7.460000 
      10.170888       -1.862172       7.040000 
      10.186520       -1.847900       6.880000 
      10.202257       -1.880110       7.370000 
      10.231874       -1.911504       6.990000 
      10.247250       -1.885496       6.800000 
      10.264334       -1.872084       7.480000 
      10.279040       -1.901649       7.620000 
      10.294390       -1.920461       7.220000 
      10.309620       -1.912005       6.750000 
      10.324357       -1.915978       7.040000 
      10.340849       -1.952342       7.510000 
      10.355799       -1.974241       7.190000 
      10.371841       -1.976096       6.710000 
      10.387221       -1.955873       6.990000 
      10.403178       -1.936658       7.310000 
      10.418197       -1.931689       7.010000 
      10.433444       -1.931259       6.710000 
      10.449809       -1.931246       6.790000 
      10.465406       -1.931246       7.430000 
      10.480969       -1.931246       7.370000 
      10.496015       -1.931259       6.730000 
      10.511607       -1.931689       6.770000 
      10.525930       -1.936631       7.490000 
      10.541293       -1.954999       7.410000 
      10.556695       -1.965727       7.050000 
      10.572447       -1.930803       6.950000 
      10.589217       -1.891352       7.350000 
      10.604331       -1.883295       7.330000 
      10.619494       -1.885966       7.010000 
      10.635453       -1.906606       6.930000 
      10.649677       -1.925833       7.280000 
      10.666306       -1.930789       7.360000 
      10.681613       -1.930789       6.870000 
      10.696708       -1.925833       6.860000 
      10.712333       -1.906605       7.040000 
      10.727947       -1.885939       7.310000 
      10.743629       -1.882422       7.120000 
      10.758265       -1.880996       6.770000 
      10.774189       -1.887781       6.940000 
      10.788048       -1.909236       7.230000 
      10.804319       -1.935245       7.090000 
      10.818923       -1.895767       6.870000 
      10.834157       -1.825944       7.010000 
      10.849411       -1.808835       7.280000 
      10.863861       -1.813361       7.330000 
      10.880593       -1.844702       6.980000 
      10.896443       -1.910591       6.970000 
      10.911520       -1.909206       7.290000 
      10.926814       -1.847873       7.290000 
      10.942347       -1.832189       6.980000 
      10.957645       -1.890864       7.040000 
      10.972541       -1.911505       7.280000 
      10.987886       -1.874755       7.400000 
      11.004530       -1.888224       6.960000 
      11.020394       -1.920904       6.820000 
      11.036180       -1.930829       7.200000 
      11.050971       -1.937062       7.370000 
      11.065384       -1.960868       7.230000 
      11.081239       -1.996223       6.860000 
      11.097177       -2.006122       6.990000 
      11.111285       -2.008806       7.270000 
      11.127331       -2.011921       7.180000 
      11.142686       -1.961312       6.990000 
      11.158846       -1.926817       7.080000 
      11.174421       -1.953658       7.380000 
      11.189307       -1.979224       7.240000 
      11.204584       -1.994907       7.010000 
      11.220408       -1.971973       7.160000 
      11.236437       -1.925017       7.350000 
      11.251666       -1.920447       7.370000 
      11.267656       -1.888180       7.080000 
      11.283535       -1.810234       6.980000 
      11.299693       -1.812905       7.330000 
      11.313945       -1.837488       7.250000 
      11.329107       -1.820115       7.090000 
      11.345250       -1.837518       7.040000 
      11.361430       -1.877439       7.150000 
      11.377299       -1.909250       7.230000 
      11.392741       -1.946043       7.120000 
      11.407315       -1.945061       7.050000 
      11.421277       -1.916974       7.160000 
      11.436344       -1.911009       7.190000 
      11.452544       -1.927742       7.030000 
      11.468375       -1.929834       6.990000 
      11.482413       -1.938513       7.280000 
      11.498675       -1.959403       7.350000 
      11.514116       -1.996749       7.190000 
      11.528217       -1.993039       7.000000 
      11.543336       -1.952356       7.090000 
      11.560209       -1.897664       7.220000 
      11.574155       -1.898120       7.020000 
      11.590470       -1.958628       7.040000 
      11.605983       -2.027618       7.050000 
      11.621503       -2.080511       7.260000 
      11.636885       -2.049547       7.210000 
      11.651911       -1.995407       6.980000 
      11.668072       -1.972470       7.020000 
      11.683571       -1.931756       7.210000 
      11.698423       -1.897664       7.150000 
      11.714052       -1.918734       7.020000 
      11.729758       -1.979680       7.130000 
      11.745930       -2.035675       7.150000 
      11.760237       -2.030319       7.180000 
      11.777199       -2.014635       7.140000 
      11.792540       -2.017320       7.080000 
      11.808388       -1.980123       7.060000 
      11.823531       -1.942501       7.100000 
      11.838766       -1.937531       7.170000 
      11.853194       -1.955456       7.170000 
      11.869379       -1.970670       7.160000 
      11.885335       -1.949170       7.120000 
      11.900287       -1.902053       7.080000 
      11.916162       -1.847470       7.050000 
      11.932085       -1.835287       7.110000 
      11.946345       -1.845185       7.200000 
      11.961305       -1.829475       7.180000 
      11.977584       -1.881938       7.100000 
      11.991957       -1.930705       7.000000 
      12.007448       -1.908390       7.140000 
      12.022726       -1.882825       7.130000 
      12.039072       -1.862655       7.080000 
      12.054237       -1.872567       7.070000 
      12.069586       -1.931233       7.010000 
      12.085167       -1.989495       7.100000 
      12.100373       -1.994881       7.130000 
      12.116147       -1.960856       7.070000 
      12.131454       -1.938028       7.150000 
      12.147181       -1.944273       7.180000 
      12.162515       -2.001250       7.110000 
      12.178234       -2.107822       7.150000 
      12.193666       -2.139190       7.130000 
      12.209327       -2.037933       7.130000 
      12.224388       -1.942514       7.150000 
      12.241181       -1.880151       7.120000 
      12.255407       -1.838529       7.150000 
      12.270336       -1.895865       7.180000 
      12.285354       -1.989451       7.160000 
      12.301302       -1.965311       7.090000 
      12.316287       -1.891812       7.200000 
      12.331910       -1.918276       7.140000 
      12.348532       -1.979609       7.100000 
      12.363353       -1.970241       7.120000 
      12.378445       -1.920035       7.200000 
      12.394233       -1.902092       7.270000 
      12.409887       -1.877896       7.100000 
      12.425474       -1.850571       7.110000 
      12.441002       -1.877010       7.170000 
      12.456743       -1.891321       7.090000 
      12.471128       -1.872554       6.970000 
      12.486465       -1.902136       7.170000 
      12.502923       -1.990381       7.190000 
      12.518211       -2.034775       7.180000 
      12.532707       -2.008350       7.040000 
      12.548427       -1.977425       7.070000 
      12.564172       -1.937974       7.270000 
      12.580758       -1.925917       7.060000 
      12.596140       -1.965741       6.980000 
      12.611459       -1.960342       7.220000 
      12.627477       -1.895864       7.260000 
      12.642851       -1.867584       7.050000 
      12.658809       -1.877895       7.140000 
      12.672936       -1.885066       7.190000 
      12.689362       -1.900763       7.130000 
      12.703876       -1.896680       6.980000 
      12.719171       -1.872110       7.250000 
      12.736098       -1.891325       7.250000 
      12.751198       -1.941100       7.050000 
      12.767373       -1.944201       6.960000 
      12.782727       -1.911991       7.290000 
      12.798203       -1.891781       7.300000 
      12.812740       -1.907062       7.100000 
      12.827873       -1.925860       7.050000 
      12.843307       -1.931246       7.200000 
      12.858135       -1.936618       7.150000 
      12.874387       -1.954999       7.100000 
      12.889896       -1.965741       7.020000 
      12.905035       -1.931219       7.270000 
      12.920829       -1.895864       7.110000 
      12.937165       -1.896667       6.980000 
      12.952210       -1.876580       7.060000 
      12.966608       -1.840230       7.150000 
      12.982270       -1.834914       7.130000 
      12.998449       -1.846931       7.080000 
      13.014861       -1.916517       7.090000 
      13.029940       -2.003310       7.310000 
      13.045749       -2.010148       7.180000 
      13.060454       -1.945118       6.980000 
      13.075581       -1.918276       7.000000 
      13.090939       -1.926303       7.130000 
      13.105492       -1.925430       7.080000 
      13.122334       -1.907022       7.060000 
      13.138221       -1.890881       7.210000 
      13.153178       -1.900763       7.180000 
      13.168777       -1.890865       7.070000 
      13.186499       -1.842944       7.040000 
      13.201463       -1.832203       7.230000 
      13.216659       -1.896250       7.160000 
      13.232214       -1.935688       7.170000 
      13.247544       -1.914192       7.130000 
      13.263062       -1.906592       7.200000 
      13.278194       -1.897110       7.060000 
      13.294680       -1.871237       7.040000 
      13.309941       -1.880527       7.130000 
      13.324899       -1.892706       7.110000 
      13.341125       -1.864413       7.180000 
      13.356428       -1.863597       7.020000 
      13.372217       -1.880983       7.080000 
      13.386391       -1.906176       7.150000 
      13.402828       -1.925820       7.220000 
      13.418353       -1.930789       7.150000 
      13.434012       -1.930775       7.060000 
      13.449159       -1.925377       7.200000 
      13.464929       -1.900763       7.260000 
      13.480917       -1.856356       7.110000 
      13.495308       -1.818734       7.040000 
      13.511513       -1.820975       7.220000 
      13.526315       -1.866211       7.160000 
      13.541736       -1.871597       6.980000 
      13.557292       -1.850571       7.050000 
      13.573899       -1.883268       7.080000 
      13.589363       -1.925833       7.110000 
      13.605777       -1.954100       7.110000 
      13.622419       -1.965284       7.180000 
      13.638188       -1.926289       7.190000 
      13.653604       -1.877912       7.130000 
      13.668227       -1.890438       7.070000 
      13.683610       -1.924460       7.120000 
      13.697822       -1.865781       7.140000 
      13.713219       -1.763155       7.050000 
      13.729666       -1.760484       6.970000 
      13.743933       -1.850500       7.220000 
      13.761041       -1.928516       7.180000 
      13.777275       -1.913679       7.000000 
      13.793256       -1.842473       7.070000 
      13.807804       -1.803036       7.200000 
      13.824398       -1.831716       7.080000 
      13.839895       -1.865768       7.060000 
      13.855345       -1.855470       7.140000 
      13.870208       -1.842930       7.100000 
      13.886550       -1.867127       7.090000 
      13.902750       -1.924960       7.040000 
      13.917975       -1.959899       7.120000 
      13.932973       -1.931232       7.200000 
      13.948267       -1.902136       7.150000 
      13.963048       -1.931688       7.140000 
      13.978525       -1.965727       7.170000 
      13.995315       -1.954113       7.110000 
      14.011178       -1.925833       7.150000 
      14.027340       -1.883294       7.140000 
      14.057626       -1.851457       7.200000 
      14.072783       -1.882408       7.150000 
      14.088331       -1.915035       7.160000 
      14.105168       -1.905692       7.160000 
      14.120341       -1.885039       7.070000 
      14.149363       -1.872053       7.100000 
      14.165966       -1.837545       7.120000 
      14.181678       -1.826374       7.160000 
      14.197340       -1.872040       7.150000 
      14.213401       -1.895807       7.120000 
      14.228841       -1.890465       7.170000 
      14.244887       -1.907465       7.050000 
      14.259793       -1.931232       7.180000 
      14.275156       -1.954556       7.130000 
      14.290988       -1.965714       7.080000 
      14.307038       -1.930803       7.130000 
      14.337343       -1.891365       7.160000 
      14.353892       -1.883751       7.210000 
      14.367982       -1.891795       7.110000 
      14.384181       -1.935758       7.040000 
      14.399739       -1.984512       7.090000 
      14.415466       -1.970253       7.160000 
      14.430634       -1.915522       7.170000 
      14.446286       -1.888277       7.130000 
      14.461803       -1.881910       7.110000 
      14.477355       -1.893663       7.160000 
      14.493312       -1.939732       7.120000 
      14.507840       -2.010577       7.090000 
      14.524192       -2.013665       7.080000 
      14.538374       -1.959942       7.090000 
      14.553174       -1.907478       7.050000 
      14.569109       -1.862212       7.130000 
      14.585133       -1.842528       7.110000 
      14.600361       -1.856343       7.150000 
      14.615992       -1.876553       7.220000 
      14.630847       -1.879654       7.150000 
      14.645124       -1.877023       7.030000 
      14.661245       -1.862628       7.060000 
      14.676233       -1.877509       7.150000 
      14.692165       -1.950017       7.020000 
      14.707554       -2.004748       7.000000 
      14.723333       -1.973771       7.150000 
      14.740160       -1.917377       7.210000 
      14.755439       -1.886382       7.130000 
      14.770998       -1.877009       7.090000 
      14.787669       -1.855470       7.120000 
      14.803536       -1.831703       7.150000 
      14.819269       -1.812904       7.110000 
      14.834167       -1.815979       7.130000 
      14.850508       -1.851469       7.110000 
      14.865376       -1.863913       7.180000 
      14.881203       -1.833987       7.190000 
      14.896800       -1.811066       7.120000 
      14.912331       -1.876123       7.230000 
      14.928038       -1.919934       7.200000 
      14.944325       -1.865812       7.180000 
      14.958555       -1.832189       6.980000 
      14.974134       -1.872926       7.050000 
      14.988286       -1.900790       7.130000 
      15.004365       -1.909680       7.210000 
      15.020431       -1.927675       7.100000 
      15.035562       -1.928934       7.120000 
      15.051689       -1.927259       7.130000 
      15.066218       -1.905180       7.150000 
      15.082100       -1.887794       7.120000 
      15.097723       -1.885469       7.180000 
      15.114116       -1.894934       7.160000 
      15.128390       -1.866641       7.040000 
      15.158912       -1.802606       7.100000 
      15.174151       -1.802593       7.130000 
      15.190944       -1.866211       7.160000 
      15.206194       -1.889965       7.100000 
      15.221419       -1.866228       7.020000 
      15.237391       -1.866684       7.110000 
      15.252538       -1.896250       7.230000 
      15.266753       -1.901179       7.150000 
      15.282218       -1.889995       7.200000 
      15.297464       -1.895793       7.220000 
      15.313988       -1.872013       7.200000 
      15.329435       -1.825487       7.160000 
      15.344434       -1.826747       7.140000 
      15.358947       -1.823659       7.160000 
      15.374891       -1.805251       7.080000 
      15.388695       -1.857298       7.120000 
      15.404140       -1.904210       7.150000 
      15.419311       -1.880622       7.080000 
      15.435855       -1.840149       7.100000 
      15.451860       -1.828185       7.140000 
      15.467486       -1.806107       7.190000 
      15.481152       -1.799062       7.180000 
      15.497019       -1.840149       7.170000 
      15.512462       -1.909731       7.120000 
      15.528061       -1.903740       7.140000 
      15.544006       -1.821930       7.150000 
      15.559946       -1.771585       7.140000 
      15.575151       -1.780664       7.230000 
      15.590400       -1.794479       7.160000 
      15.606125       -1.851899       7.140000 
      15.620179       -1.890327       7.120000 
      15.636115       -1.883266       7.070000 
      15.651464       -1.865701       7.070000 
      15.667796       -1.801663       7.140000 
      15.683789       -1.727287       7.140000 
      15.699723       -1.719660       7.220000 
      15.714401       -1.762212       7.090000 
      15.730905       -1.830360       7.050000 
      15.746316       -1.889468       7.160000 
      15.760561       -1.894894       7.180000 
      15.776577       -1.861272       7.140000 
      15.791565       -1.842500       7.140000 
      15.807588       -1.856329       7.120000 
      15.823141       -1.876110       7.040000 
      15.838483       -1.874254       7.130000 
      15.853399       -1.852785       7.050000 
      15.869212       -1.821418       7.180000 
      15.883324       -1.837558       7.100000 
      15.898813       -1.877439       7.160000 
      15.915606       -1.909236       7.190000 
      15.930638       -1.945546       7.170000 
      15.945605       -1.937889       7.140000 
      15.960818       -1.871180       7.170000 
      15.976172       -1.774327       7.160000 
      15.991394       -1.743941       7.150000 
      16.007640       -1.826760       7.090000 
      16.023561       -1.905662       7.100000 
      16.038561       -1.908780       7.070000 
      16.053915       -1.911521       7.170000 
      16.069953       -1.920890       7.140000 
      16.085019       -1.907022       7.100000 
      16.100047       -1.895408       7.180000 
      16.115265       -1.915048       7.160000 
      16.131259       -1.893150       7.160000 
      16.147316       -1.835303       7.200000 
      16.162719       -1.863557       7.210000 
      16.177809       -1.908750       7.170000 
      16.193257       -1.889119       7.140000 
      16.209352       -1.814194       7.180000 
      16.225041       -1.773524       7.200000 
      16.240927       -1.856370       7.140000 
      16.256109       -1.946443       7.090000 
      16.272263       -1.938389       7.120000 
      16.288030       -1.941117       7.120000 
      16.304034       -1.961201       7.090000 
      16.319991       -1.930386       7.130000 
      16.334299       -1.891325       7.040000 
      16.349087       -1.882851       7.070000 
      16.364709       -1.880553       7.010000 
      16.379950       -1.881979       7.020000 
      16.395947       -1.880970       7.110000 
      16.411252       -1.887364       7.080000 
      16.427202       -1.904724       7.180000 
      16.442024       -1.921859       7.170000 
      16.457394       -1.904723       7.190000 
      16.473020       -1.887351       7.130000 
      16.488197       -1.880526       7.120000 
      16.503593       -1.876566       7.160000 
      16.533369       -1.855900       7.170000 
      16.550072       -1.837101       7.110000 
      16.566066       -1.837088       7.250000 
      16.581942       -1.855429       7.100000 
      16.597875       -1.870240       7.180000 
      16.613060       -1.844161       7.100000 
      16.628671       -1.781522       7.140000 
      16.643914       -1.711479       7.130000 
      16.658711       -1.669507       7.100000 
      16.689107       -1.666226       7.140000 
      16.705446       -1.709817       7.180000 
      16.719806       -1.764386       7.160000 
      16.736096       -1.845600       7.230000 
      16.750548       -1.884485       7.140000 
      16.767611       -1.859525       7.160000 
      16.783061       -1.832105       7.100000 
      16.798198       -1.812917       7.070000 
      16.813596       -1.815979       7.090000 
      16.829547       -1.851456       7.100000 
      16.845228       -1.863443       7.120000 
      16.859945       -1.827701       7.120000 
      16.875598       -1.776058       7.090000 
      16.891711       -1.787390       7.190000 
      16.921512       -1.810482       7.090000 
      16.938603       -1.785605       7.160000 
      16.953788       -1.754005       7.150000 
      16.969752       -1.725084       7.220000 
      16.983769       -1.674713       7.210000 
      16.998813       -1.696002       7.230000 
      17.014899       -1.755361       7.170000 
      17.030120       -1.831785       7.140000 
      17.046220       -1.892999       7.090000 
      17.062215       -1.916003       7.160000 
      17.079263       -1.885899       7.100000 
      17.094387       -1.871653       7.170000 
      17.110382       -1.896210       7.160000 
      17.126871       -1.894920       7.150000 
      17.141506       -1.855430       7.060000 
      17.156683       -1.812461       7.030000 
      17.173216       -1.786865       6.970000 
      17.189165       -1.788694       7.210000 
      17.204458       -1.815105       7.170000 
      17.219515       -1.865284       7.140000 
      17.236239       -1.865271       7.110000 
      17.266559       -1.814662       7.150000 
      17.281868       -1.783295       7.190000 
      17.297479       -1.762668       7.190000 
      17.314043       -1.772554       7.070000 
      17.329086       -1.830789       7.200000 
      17.345055       -1.884095       7.100000 
      17.361906       -1.870670       7.090000 
      17.376906       -1.820464       7.190000 
      17.393086       -1.806619       7.090000 
      17.407218       -1.791738       7.140000 
      17.424136       -1.747483       7.170000 
      17.439267       -1.746032       7.150000 
      17.454603       -1.792720       7.230000 
      17.471620       -1.799351       7.170000 
      17.487624       -1.792750       7.240000 
      17.503260       -1.810579       7.270000 
      17.518567       -1.846956       7.130000 
      17.533719       -1.855443       7.110000 
      17.548054       -1.860842       7.160000 
      17.565138       -1.876995       7.200000 
      17.580090       -1.880526       7.110000 
      17.597045       -1.886868       7.030000 
      17.613077       -1.898008       7.080000 
      17.628956       -1.881881       7.070000 
      17.644009       -1.796764       7.080000 
      17.658530       -1.757326       7.120000 
      17.674966       -1.799878       7.100000 
      17.689150       -1.833930       7.150000 
      17.704389       -1.875626       7.020000 
      17.721411       -1.889911       7.090000 
      17.736414       -1.855013       7.200000 
      17.752041       -1.812878       7.140000 
      17.766505       -1.791821       7.180000 
      17.782092       -1.807492       7.100000 
      17.798994       -1.830789       7.090000 
      17.814949       -1.849144       7.140000 
      17.830370       -1.841074       7.100000 
      17.844953       -1.785496       7.160000 
      17.861011       -1.742514       7.120000 
      17.875661       -1.732602       7.190000 
      17.892115       -1.737128       7.200000 
      17.907366       -1.761272       7.130000 
      17.922932       -1.800293       7.100000 
      17.939123       -1.814162       7.170000 
      17.954916       -1.777452       7.120000 
      17.969915       -1.733089       7.120000 
      17.986136       -1.772554       7.130000 
      18.000456       -1.860368       7.170000 
      18.032470       -1.889911       7.180000 
      18.048632       -1.870271       7.120000 
      18.064101       -1.874240       7.060000 
      18.078181       -1.858141       7.230000 
      18.093135       -1.781067       7.250000 
      18.109089       -1.777939       7.220000 
      18.123086       -1.836574       7.180000 
      18.154391       -1.843315       7.170000 
      18.170490       -1.805706       7.140000 
      18.186371       -1.757229       7.180000 
      18.201702       -1.724173       7.100000 
      18.218927       -1.746058       7.150000 
      18.233782       -1.816890       7.210000 
      18.248748       -1.843758       7.160000 
      18.264344       -1.830802       7.130000 
      18.280370       -1.813307       7.130000 
      18.296277       -1.820934       7.090000 
      18.312230       -1.870254       7.110000 
      18.328794       -1.879126       7.150000 
      18.343757       -1.811535       7.020000 
      18.358454       -1.751014       7.100000 
      18.374349       -1.748742       7.100000 
      18.388747       -1.737102       7.120000 
      18.404525       -1.744312       7.180000 
      18.420252       -1.783211       7.190000 
      18.436110       -1.766724       7.070000 
      18.452076       -1.780597       7.110000 
      18.466339       -1.863043       7.170000 
      18.482942       -1.892152       7.260000 
      18.498242       -1.875210       7.130000 
      18.513766       -1.827163       7.160000 
      18.528813       -1.778436       7.170000 
      18.544931       -1.797624       7.110000 
      18.560859       -1.870696       7.050000 
      18.576514       -1.907823       7.310000 
      18.592371       -1.869797       7.150000 
      18.607190       -1.786355       7.090000 
      18.623026       -1.723730       7.130000 
      18.638584       -1.711546       7.200000 
      18.655359       -1.729502       7.170000 
      18.671357       -1.750571       7.120000 
      18.685750       -1.825389       7.160000 
      18.702228       -1.881371       7.270000 
      18.717187       -1.861727       7.140000 
      18.734149       -1.841530       7.030000 
      18.748379       -1.778782       7.160000 
      18.763307       -1.721931       7.240000 
      18.779447       -1.782838       7.150000 
      18.794981       -1.849543       7.020000 
      18.809077       -1.829446       7.060000 
      18.825572       -1.790411       7.150000 
      18.840690       -1.772040       7.140000 
      18.856337       -1.731743       7.090000 
      18.871801       -1.697664       7.200000 
      18.886806       -1.718747       7.230000 
      18.901423       -1.780110       7.140000 
      18.917816       -1.840631       6.980000 
      18.933408       -1.849131       7.040000 
      18.948443       -1.830802       7.090000 
      18.964215       -1.807922       7.090000 
      18.978863       -1.796764       7.060000 
      18.993791       -1.831246       7.100000 
      19.009565       -1.865754       7.170000 
      19.024614       -1.855416       7.210000 
      19.039802       -1.841118       7.230000 
      19.055542       -1.844215       7.190000 
      19.071451       -1.812404       7.120000 
      19.087477       -1.732672       7.130000 
      19.103515       -1.733062       7.230000 
      19.119570       -1.816460       7.230000 
      19.135001       -1.851758       7.160000 
      19.150348       -1.802592       7.150000 
      19.164274       -1.730790       7.130000 
      19.179525       -1.740299       7.150000 
      19.194701       -1.780553       7.090000 
      19.210058       -1.824530       7.120000 
      19.226868       -1.841503       7.120000 
      19.241679       -1.815065       7.060000 
      19.258109       -1.811091       7.170000 
      19.272777       -1.809649       7.170000 
      19.288051       -1.752798       7.170000 
      19.303948       -1.686413       7.180000 
      19.318735       -1.706162       7.150000 
      19.333332       -1.719974       7.280000 
      19.349516       -1.637115       7.270000 
      19.365479       -1.573497       7.130000 
      19.380564       -1.632589       7.120000 
      19.396141       -1.705689       7.080000 
      19.412670       -1.703864       7.260000 
      19.427114       -1.693609       7.180000 
      19.442358       -1.715951       7.140000 
      19.457008       -1.769837       7.050000 
      19.473273       -1.779583       7.180000 
      19.488669       -1.717847       7.090000 
      19.504664       -1.686896       7.060000 
      19.519691       -1.747869       7.110000 
      19.535150       -1.790838       7.220000 
      19.550998       -1.794964       7.190000 
      19.565128       -1.825780       7.140000 
      19.580988       -1.840670       7.170000 
      19.596979       -1.804737       7.260000 
      19.612936       -1.768996       7.270000 
      19.628456       -1.765299       7.120000 
      19.644508       -1.798119       7.070000 
      19.661441       -1.804710       7.160000 
      19.677289       -1.810675       7.150000 
      19.693278       -1.815451       7.040000 
      19.709276       -1.781978       7.000000 
      19.724202       -1.746045       7.090000 
      19.739197       -1.758654       7.100000 
      19.755334       -1.780540       7.140000 
      19.772242       -1.805706       7.170000 
      19.787376       -1.819964       7.170000 
      19.802588       -1.800736       7.160000 
      19.816757       -1.760869       7.040000 
      19.833422       -1.732589       7.120000 
      19.848019       -1.718317       7.250000 
      19.865019       -1.740203       7.150000 
      19.880049       -1.792250       7.120000 
      19.895130       -1.798908       7.140000 
      19.911127       -1.787780       7.160000 
      19.925132       -1.791298       7.210000 
      19.941140       -1.824517       7.110000 
      19.956123       -1.830303       7.150000 
      19.972628       -1.761755       7.180000 
      19.988649       -1.713861       7.130000 
      20.002686       -1.762601       7.240000 
      20.018832       -1.839744       7.180000 
      20.034060       -1.855801       7.140000 
      20.049705       -1.786851       7.160000 
      20.065150       -1.658642       7.140000 
      20.080844       -1.625573       7.160000 
      20.096379       -1.726747       7.110000 
      20.112185       -1.823601       7.150000 
      20.127003       -1.819521       7.210000 
      20.142522       -1.777455       7.290000 
      20.159101       -1.791324       7.120000 
      20.173210       -1.835715       7.170000 
      20.189968       -1.820018       7.210000 
      20.205302       -1.772527       7.110000 
      20.219263       -1.772527       7.070000 
      20.235961       -1.820031       7.200000 
      20.251488       -1.836131       7.210000 
      20.267226       -1.795837       7.150000 
      20.282470       -1.790868       7.150000 
      20.297856       -1.811464       7.230000 
      20.314653       -1.773354       7.250000 
      20.329946       -1.706149       7.210000 
      20.343919       -1.632575       7.130000 
      20.359891       -1.572594       7.100000 
      20.375532       -1.562213       7.130000 
      20.391318       -1.577480       7.180000 
      20.406059       -1.585993       7.150000 
      20.421256       -1.613334       7.200000 
      20.436583       -1.666671       7.180000 
      20.452299       -1.748674       7.170000 
      20.467873       -1.798893       7.110000 
      20.482919       -1.744644       7.130000 
      20.499152       -1.659584       7.200000 
      20.514388       -1.657729       7.210000 
      20.529787       -1.741127       7.040000 
      20.545428       -1.778683       7.120000 
      20.560518       -1.735262       7.160000 
      20.576310       -1.690452       7.150000 
      20.591358       -1.667567       7.090000 
      20.606892       -1.619244       7.100000 
      20.621979       -1.617433       7.120000 
      20.638090       -1.729044       7.080000 
      20.654052       -1.838748       7.130000 
      20.669380       -1.897580       7.200000 
      20.685486       -1.902370       7.190000 
      20.700701       -1.816433       7.150000 
      20.716179       -1.681497       7.210000 
      20.732215       -1.624629       7.140000 
      20.747678       -1.627674       7.150000 
      20.763091       -1.636699       7.120000 
      20.778404       -1.661299       7.150000 
      20.794585       -1.701636       7.130000 
      20.808767       -1.730803       7.260000 
      20.825867       -1.755456       7.210000 
      20.840769       -1.777439       7.150000 
      20.856949       -1.791324       7.160000 
      20.871461       -1.835718       7.170000 
      20.888153       -1.883625       7.260000 
      20.902275       -1.859442       7.180000 
      20.917719       -1.766698       7.100000 
      20.934532       -1.703506       7.100000 
      20.948772       -1.713831       7.140000 
      20.965814       -1.756370       7.100000 
      20.981359       -1.806135       7.040000 
      20.997404       -1.849090       7.140000 
      21.013700       -1.863941       7.240000 
