

 time    ||    gripping force   ||   raspberry measurement 

      0       39.980000       -794.923810 
      0       40.070000       -794.923810 
      0       33.920000       -794.923810 
      0       32.850000       -794.923810 
      0       32.860000       -794.923810 
      0       25.410000       -794.923810 
      0       23.150000       -794.923810 
      0       21.950000       -794.923810 
      0       21.370000       -794.923810 
      0       20.180000       -794.923805 
      0       18.740000       -794.922623 
      0       18.020000       -794.816228 
      0       17.210000       -791.292922 
      0       16.850000       -748.370533 
      1       16.240000       -556.008790 
      1       15.880000       -238.869375 
      1       15.130000       -46.529628 
      1       14.500000       -3.646249 
      1       13.860000       -0.224731 
      1       12.510000       -0.278785 
      1       12.130000       -0.445707 
      1       11.580000       -0.521922 
      1       11.560000       -0.513050 
      1       11.500000       -0.541292 
      1       11.330000       -0.623375 
      2       11.130000       -0.701309 
      2       11.050000       -0.714392 
      2       10.900000       -0.692371 
      2       11.030000       -0.725660 
      2       11.170000       -0.756915 
      2       11.080000       -0.750314 
      2       11.260000       -0.743534 
      2       10.870000       -0.793779 
      2       12.120000       -0.829107 
      3       16.010000       -0.811748 
      3       17.790000       -0.818822 
      3       19.710000       -0.815735 
      3       23.880000       -0.791538 
      3       25.870000       -0.815306 
      3       28.520000       -0.813893 
      3       29.110000       -0.793850 
      3       29.820000       -0.824665 
      3       30.250000       -0.863726 
      3       30.650000       -0.872200 
      3       30.720000       -0.874498 
      3       30.560000       -0.873072 
      4       30.500000       -0.874068 
      4       30.480000       -0.867216 
      4       30.450000       -0.843975 
      4       30.570000       -0.795940 
      4       31.330000       -0.733633 
      4       33.030000       -0.623819 
      4       33.450000       -0.514407 
      4       33.400000       -0.456587 
      4       33.450000       -0.421090 
      4       33.380000       -0.379398 
      4       33.380000       -0.278096 
      4       33.300000       -0.190680 
      4       33.340000       -0.163369 
      5       33.600000       -0.187455 
      5       33.980000       -0.258839 
      5       34.420000       -0.269804 
      5       35.730000       -0.205519 
      5       36.720000       -0.142108 
      5       36.740000       -0.141841 
      5       37.380000       -0.117035 
      5       38.210000       -0.086236 
      5       38.440000       -0.090157 
      5       38.360000       -0.147156 
      6       38.390000       -0.193212 
      6       38.490000       -0.152529 
      6       39.120000       -0.113964 
      6       39.030000       -0.122464 
      6       39.020000       -0.137288 
      6       38.940000       -0.187427 
      6       38.870000       -0.197724 
      6       38.900000       -0.126006 
      6       38.960000       -0.056170 
      6       38.900000       -0.004965 
      7       38.890000       0.007881 
      7       38.870000       -0.033622 
      7       38.830000       -0.113519 
      7       38.810000       -0.149663 
      7       38.800000       -0.113519 
      7       38.860000       -0.033622 
      7       38.720000       0.007895 
      7       38.780000       -0.004482 
      7       38.780000       -0.049441 
      7       38.750000       -0.085599 
      8       38.710000       -0.084795 
      8       38.690000       -0.038121 
      8       38.720000       -0.034187 
      8       38.760000       -0.054218 
      8       38.710000       -0.028345 
      8       38.670000       -0.008108 
      8       38.760000       -0.016192 
      8       38.720000       -0.008148 
      8       38.680000       -0.029648 
      8       38.660000       -0.069515 
      8       38.650000       -0.095537 
      9       38.640000       -0.104010 
      9       38.680000       -0.053401 
      9       38.640000       -0.013507 
      9       38.670000       -0.015749 
      9       38.590000       0.002650 
      9       38.660000       0.019203 
      9       38.610000       0.016089 
      9       38.670000       -0.018419 
      10       38.660000       -0.039476 
      10       38.700000       -0.031446 
      10       38.660000       -0.040389 
      10       38.840000       -0.030090 
      10       38.960000       -0.042660 
      10       39.380000       -0.103580 
      10       40.830000       -0.101295 
      10       40.990000       -0.033717 
      10       41.160000       0.015203 
      10       41.230000       0.023676 
      11       41.260000       0.015928 
      11       41.240000       -0.022849 
      11       41.250000       -0.052277 
      11       41.330000       -0.022111 
      11       41.380000       0.016329 
      11       41.330000       0.019846 
      11       41.390000       0.003346 
      11       41.440000       -0.013625 
      11       42.010000       0.003436 
      11       42.030000       0.019311 
      12       42.010000       0.010729 
      12       42.010000       -0.046220 
      12       42.010000       -0.091380 
      12       41.990000       -0.050588 
      12       41.960000       -0.015932 
      12       41.930000       -0.032134 
      12       41.920000       -0.014996 
      12       41.910000       0.019344 
      12       41.970000       0.027127 
      12       41.860000       0.029118 
      12       41.900000       0.027428 
      12       41.890000       0.028578 
      13       41.830000       0.026868 
      13       41.870000       0.027997 
      13       41.860000       0.025442 
      13       41.830000       0.016799 
      13       41.800000       -0.022026 
      13       41.830000       -0.051901 
      13       41.890000       -0.027044 
      13       41.800000       -0.011260 
      13       41.820000       -0.033279 
      13       41.820000       -0.026780 
      13       41.790000       -0.034050 
      14       41.810000       -0.070930 
      14       41.800000       -0.038315 
      14       41.780000       0.014428 
      14       41.750000       0.022234 
      14       41.740000       0.005225 
      14       41.750000       -0.021977 
      15       41.730000       -0.046520 
      15       41.690000       -0.074504 
      15       41.790000       -0.043091 
      15       41.780000       -0.012578 
      15       41.710000       -0.029213 
      15       41.790000       -0.012117 
      15       41.740000       0.022194 
      15       41.710000       0.029948 
      15       41.740000       0.031884 
      15       41.710000       0.029329 
      16       41.650000       0.021047 
      16       41.750000       -0.013739 
      16       41.710000       -0.034048 
      16       41.750000       -0.021237 
      16       41.710000       -0.014886 
      16       41.730000       0.007520 
      17       41.690000       0.024231 
      17       41.690000       0.020933 
      17       41.700000       -0.013001 
      17       41.660000       -0.028398 
      17       41.640000       0.002966 
      17       41.670000       0.024616 
      17       41.680000       0.031113 
      17       41.700000       0.029816 
      18       41.660000       0.030955 
      18       41.720000       0.029222 
      18       41.690000       0.030354 
      18       41.730000       0.028626 
      18       41.700000       0.029764 
      18       41.680000       0.028042 
      18       41.660000       0.029186 
      18       41.680000       0.027470 
      18       41.710000       0.028619 
      18       41.670000       0.026896 
      18       41.660000       0.027625 
      18       41.660000       0.021006 
      19       41.650000       0.003171 
      19       41.690000       -0.019170 
      19       41.660000       -0.025969 
      19       41.630000       -0.047993 
      19       41.650000       -0.064300 
      19       41.600000       -0.060626 
      19       41.610000       -0.027147 
      19       41.620000       -0.021161 
      19       41.660000       -0.089224 
      20       41.630000       -0.140266 
      20       41.610000       -0.105538 
      20       41.640000       -0.038032 
      20       41.670000       -0.026003 
      20       41.590000       -0.052477 
      20       41.650000       -0.037606 
      20       41.590000       -0.021867 
      20       41.620000       -0.013906 
      20       41.630000       -0.016177 
      20       41.630000       -0.012768 
      21       41.610000       -0.011845 
      21       41.640000       -0.004562 
      21       41.650000       -0.042748 
      21       41.620000       -0.083036 
      21       41.640000       -0.041903 
      21       41.620000       -0.007321 
      21       41.640000       -0.023609 
      21       41.620000       -0.006569 
      21       41.650000       0.027248 
      21       41.630000       0.029633 
      21       41.650000       0.008482 
      22       41.580000       -0.023083 
      22       41.650000       -0.012218 
      22       41.650000       0.003444 
      22       41.590000       -0.004154 
      22       41.620000       0.013690 
      22       41.630000       0.030765 
      23       41.540000       0.036788 
      23       41.620000       0.035421 
      23       41.630000       0.036478 
      23       41.600000       0.033838 
      23       41.610000       0.025111 
      23       41.590000       -0.013797 
      23       41.570000       -0.043741 
      23       41.590000       -0.018554 
      23       41.610000       0.001666 
      24       41.650000       -0.005503 
      24       41.530000       0.012341 
      24       41.670000       0.028579 
      24       41.570000       0.024785 
      24       41.560000       -0.014520 
      24       41.530000       -0.053418 
      24       41.580000       -0.055953 
      24       41.590000       -0.033714 
      24       41.530000       0.007516 
      24       41.600000       0.029972 
      25       41.540000       0.036441 
      25       41.520000       0.035092 
      25       41.620000       0.036178 
      25       41.540000       0.034379 
      25       41.610000       0.035020 
      25       41.590000       0.027901 
      26       41.580000       0.005065 
      26       41.540000       -0.036743 
      26       41.600000       -0.068281 
      26       41.510000       -0.106255 
      26       41.620000       -0.111771 
      26       41.590000       -0.046860 
      26       41.590000       -0.007735 
      26       41.530000       -0.032980 
      26       41.550000       -0.048546 
      27       41.540000       -0.030835 
      27       41.580000       0.009954 
      27       41.580000       0.032372 
      27       41.560000       0.038791 
      27       41.600000       0.036580 
      27       41.530000       0.028251 
      27       41.310000       -0.006181 
      28       41.030000       -0.021660 
      28       40.840000       0.009637 
      28       40.890000       0.031221 
      28       40.870000       0.037651 
      28       40.880000       0.036289 
      28       40.850000       0.037364 
      28       40.890000       0.035566 
      28       40.890000       0.036634 
      29       40.710000       0.034844 
      29       40.670000       0.035920 
      29       40.690000       0.034136 
      29       40.690000       0.035193 
      29       40.580000       0.032566 
      29       40.520000       0.023851 
      29       40.460000       -0.015044 
      29       40.500000       -0.044976 
      29       40.510000       -0.019776 
      29       40.480000       0.000429 
      29       40.500000       -0.007564 
      29       40.480000       0.000926 
      30       40.460000       -0.014597 
      30       40.500000       -0.025085 
      30       40.470000       0.006646 
      30       40.480000       0.027434 
      30       40.200000       0.024503 
      30       40.200000       -0.009454 
      30       40.240000       -0.024887 
      30       40.250000       0.006416 
      31       40.170000       0.027181 
      31       40.230000       0.023839 
      31       40.210000       -0.014605 
      31       40.210000       -0.044128 
      31       40.240000       -0.014908 
      31       40.260000       0.013208 
      31       40.230000       -0.025980 
      31       40.220000       -0.096253 
      31       40.250000       -0.111243 
      31       40.240000       -0.047149 
      32       40.170000       -0.007208 
      32       40.280000       -0.023059 
      32       40.220000       -0.005998 
      32       40.200000       0.028251 
      32       40.240000       0.035945 
      32       40.250000       0.037848 
      32       40.210000       0.036071 
      32       40.200000       0.037109 
      32       40.160000       0.034462 
      32       40.120000       0.025703 
      32       40.160000       -0.014036 
      32       40.130000       -0.052952 
      33       40.160000       -0.055493 
      33       40.130000       -0.033258 
      33       40.150000       0.007941 
      33       40.140000       0.029555 
      33       40.150000       0.026628 
      33       40.130000       -0.007350 
      33       40.070000       -0.022803 
      33       40.040000       0.008505 
      33       40.050000       0.030087 
      33       40.030000       0.036104 
      34       40.040000       0.029851 
      34       40.060000       0.012379 
      34       40.040000       -0.004722 
      34       40.030000       0.011864 
      34       40.030000       0.024025 
      34       40.030000       0.011505 
      34       40.010000       -0.005162 
      34       40.070000       0.011442 
      35       40.090000       0.023607 
      35       40.030000       0.011065 
      35       40.090000       -0.006422 
      35       40.000000       0.001219 
      35       40.000000       -0.014333 
      35       40.010000       -0.024824 
      35       40.030000       0.006930 
      35       40.020000       0.028541 
      35       40.050000       0.034573 
      35       40.040000       0.028322 
      35       40.040000       0.010441 
      36       40.030000       -0.011534 
      36       40.130000       -0.013065 
      36       40.030000       -0.011302 
      36       40.040000       0.010243 
      36       40.030000       0.022407 
      36       40.050000       0.004572 
      36       40.050000       -0.035941 
      36       40.040000       -0.057249 
      36       40.050000       -0.053606 
      37       40.030000       -0.014014 
      37       40.020000       0.025569 
      37       40.030000       0.032451 
      37       40.020000       0.019657 
      37       40.040000       -0.038606 
      37       40.040000       -0.092856 
      38       40.030000       -0.080760 
      38       39.960000       -0.055233 
      38       40.060000       -0.074563 
      38       40.000000       -0.135978 
      38       40.030000       -0.127015 
      38       40.050000       -0.095650 
      38       40.000000       -0.087938 
      38       40.060000       -0.030772 
      38       40.030000       0.027680 
      38       40.010000       0.040725 
      38       40.010000       0.043018 
      39       40.010000       0.041203 
      39       40.040000       0.042216 
      39       40.020000       0.040356 
      39       40.010000       0.040951 
      39       40.000000       0.034211 
      39       40.030000       0.016683 
      39       40.000000       -0.000488 
      39       40.050000       0.015192 
      40       39.980000       0.017094 
      40       39.990000       -0.037083 
      40       39.980000       -0.098886 
      40       39.970000       -0.056583 
      40       40.040000       -0.007751 
      40       39.980000       -0.019580 
      40       40.030000       -0.003432 
      40       40.000000       0.016060 
      40       40.020000       -0.032792 
      40       39.990000       -0.086223 
      41       39.980000       -0.072864 
      41       40.000000       -0.031859 
      41       40.000000       0.013794 
      41       40.030000       0.030430 
      41       40.000000       0.003579 
      41       40.050000       -0.068813 
      41       39.990000       -0.097794 
      41       40.010000       -0.033847 
      41       40.030000       0.019251 
      42       39.970000       0.000053 
      42       40.040000       -0.014198 
      42       40.040000       0.017037 
      42       40.040000       0.037696 
      42       40.020000       0.034249 
      42       40.000000       -0.004312 
      42       40.020000       -0.034337 
      42       40.010000       -0.009244 
      42       40.060000       0.010856 
      42       40.020000       0.002745 
      42       40.000000       0.010720 
      43       40.040000       -0.009408 
      43       40.010000       -0.034502 
      43       40.020000       -0.009394 
      43       40.030000       0.006253 
      43       40.020000       -0.015103 
      43       39.980000       0.000601 
      43       40.040000       0.025371 
      43       40.070000       0.000367 
      43       40.050000       -0.014352 
      43       40.030000       0.016460 
      43       39.970000       0.032630 
      44       40.020000       0.015092 
      44       40.060000       -0.025514 
      44       40.000000       -0.046925 
      44       40.020000       -0.043386 
      44       39.980000       -0.003909 
      44       40.020000       0.035187 
      44       39.990000       0.038343 
      44       40.040000       0.021625 
      44       39.970000       0.004471 
      44       40.030000       0.021391 
      44       40.010000       0.038363 
      45       40.000000       0.044309 
      45       40.010000       0.042868 
      45       39.990000       0.043876 
      45       39.940000       0.042014 
      45       39.970000       0.043017 
      45       40.060000       0.041150 
      45       40.000000       0.041737 
      45       40.000000       0.034963 
      45       40.010000       0.016576 
      45       40.010000       -0.010366 
      46       40.000000       -0.030519 
      46       40.010000       -0.044108 
      46       39.980000       -0.006256 
      46       40.010000       0.030028 
      46       40.020000       0.040978 
      46       39.940000       0.039995 
      46       40.020000       0.041045 
      46       40.020000       0.039198 
      46       39.980000       0.039804 
      47       39.960000       0.033076 
      47       39.990000       0.015559 
      47       40.020000       -0.001560 
      47       39.980000       0.015419 
      47       39.990000       0.032451 
      47       40.000000       0.038457 
      47       39.990000       0.037074 
      47       39.990000       0.038114 
      48       39.980000       0.035471 
      48       40.040000       0.027140 
      48       40.000000       -0.007282 
      48       40.040000       -0.022749 
      48       40.030000       0.008559 
      48       39.980000       0.030153 
      48       39.980000       0.036594 
      48       40.010000       0.035230 
      48       40.010000       0.035876 
      48       40.010000       0.028775 
      48       39.990000       0.006807 
      49       40.020000       -0.024342 
      49       40.030000       -0.008571 
      49       39.970000       0.025239 
      49       39.990000       0.028057 
      49       39.970000       0.011428 
      49       39.980000       -0.005624 
      49       39.970000       0.011397 
      49       39.990000       0.028469 
      49       39.970000       0.034514 
      49       40.000000       0.033171 
      49       39.990000       0.034276 
      50       39.990000       0.032509 
      50       39.970000       0.033582 
      50       40.000000       0.030971 
      50       40.000000       0.022273 
      50       39.990000       -0.016594 
      50       40.010000       -0.046085 
      50       39.960000       -0.015967 
      50       39.980000       0.022836 
      50       39.950000       0.030997 
      50       40.020000       0.032962 
      51       39.960000       0.031234 
      51       39.980000       0.032320 
      51       40.000000       0.029722 
      51       40.020000       0.021036 
      51       40.000000       -0.017819 
      51       39.950000       -0.047323 
      51       39.980000       -0.018032 
      52       39.990000       0.011392 
      52       40.040000       -0.013099 
      52       39.950000       -0.028920 
      52       39.940000       -0.011831 
      52       40.000000       -0.041369 
      52       39.970000       -0.066717 
      52       40.020000       -0.018990 
      52       39.960000       0.021503 
      53       39.930000       0.032937 
      53       40.000000       0.032021 
      53       39.980000       0.032287 
      53       39.980000       0.020315 
      53       39.980000       -0.020204 
      53       40.020000       -0.067474 
      53       39.970000       -0.045545 
      53       39.980000       -0.029988 
      53       39.970000       -0.053204 
      53       40.040000       -0.042009 
      53       40.000000       -0.035449 
      54       39.990000       -0.011018 
      54       39.930000       0.009348 
      54       40.010000       -0.039424 
      54       40.040000       -0.093201 
      54       40.000000       -0.084266 
      54       39.940000       -0.057250 
      54       39.990000       -0.012302 
      54       39.970000       0.027742 
      54       40.010000       0.035892 
      54       39.990000       0.037809 
      54       39.950000       0.036033 
      54       39.990000       0.037070 
      55       40.030000       0.034425 
      55       40.010000       0.025692 
      55       40.020000       -0.013209 
      55       40.020000       -0.042733 
      55       40.000000       -0.012650 
      55       39.980000       0.026121 
      55       40.040000       0.034222 
      55       40.010000       0.035291 
      55       39.950000       0.023315 
      55       40.040000       -0.017208 
      55       40.050000       -0.063657 
      56       40.010000       -0.031940 
      56       40.000000       0.021140 
      56       40.020000       0.033811 
      56       39.990000       0.036134 
      56       40.020000       0.033497 
      56       40.020000       0.023471 
      56       40.040000       -0.030978 
      56       39.990000       -0.125994 
      56       40.020000       -0.179756 
      56       40.000000       -0.133188 
      56       40.050000       -0.069708 
      57       39.970000       -0.036668 
      57       40.040000       -0.012742 
      57       39.940000       -0.006435 
      57       40.050000       0.006126 
      57       39.990000       -0.013530 
      57       39.980000       -0.038132 
      57       39.980000       -0.007668 
      57       40.060000       0.031065 
      58       40.020000       0.039130 
      58       40.030000       0.040576 
      58       40.000000       0.033453 
      58       39.990000       0.011439 
      58       40.050000       -0.019756 
      58       39.960000       -0.004018 
      58       40.020000       0.030172 
      58       40.000000       0.037847 
      58       40.040000       0.039730 
      58       39.980000       0.037935 
      59       39.960000       0.038980 
      59       40.040000       0.037126 
      59       40.020000       0.036863 
      59       40.020000       0.019088 
      59       39.930000       -0.049829 
      59       40.020000       -0.149150 
      59       39.970000       -0.137437 
      60       40.000000       -0.056729 
      60       39.990000       -0.031248 
      60       39.980000       -0.009212 
      60       39.970000       0.002829 
      60       40.040000       -0.018852 
      60       39.980000       -0.002286 
      60       40.030000       0.031887 
      60       40.000000       0.038707 
      60       40.030000       0.031182 
      60       40.070000       -0.003254 
      60       40.020000       -0.018761 
      60       40.020000       0.012506 
