

 time    ||    gripping force   ||   raspberry measurement 

      0       49.940000       -794.924242 
      0       37.180000       -794.924242 
      0       36.970000       -794.924242 
      0       29.820000       -794.924242 
      0       26.010000       -794.924242 
      0       24.680000       -794.924242 
      0       23.420000       -794.924242 
      0       21.340000       -794.924242 
      0       19.630000       -794.924242 
      0       18.540000       -794.924238 
      0       17.550000       -794.923056 
      0       16.160000       -794.816675 
      1       15.210000       -791.293852 
      1       12.030000       -748.378233 
      1       11.580000       -556.058213 
      2       10.970000       -239.047454 
      2       11.180000       -46.923265 
      2       13.650000       -4.225874 
      2       19.820000       -0.834408 
      2       26.850000       -0.778264 
      2       29.580000       -0.823772 
      2       32.400000       -0.865005 
      2       34.330000       -0.883430 
      2       35.850000       -0.923325 
      2       36.990000       -0.953334 
      3       38.140000       -0.924238 
      3       38.720000       -0.895115 
      3       39.100000       -0.924238 
      3       39.270000       -0.953334 
      3       39.760000       -0.923352 
      3       40.260000       -0.884303 
      3       41.160000       -0.875360 
      3       42.180000       -0.866776 
      3       42.700000       -0.833166 
      3       42.910000       -0.742539 
      3       43.060000       -0.628724 
      3       43.820000       -0.518867 
      3       44.020000       -0.396066 
      3       45.090000       -0.279044 
      3       45.360000       -0.266530 
      4       45.150000       -0.378015 
      4       45.220000       -0.433123 
      4       45.150000       -0.366363 
      4       45.360000       -0.334512 
      4       45.480000       -0.323281 
      4       46.070000       -0.237221 
      4       46.050000       -0.116695 
      4       46.030000       -0.045779 
      4       46.150000       -0.051244 
      4       47.760000       -0.062734 
      5       48.710000       -0.049861 
      5       48.740000       -0.027782 
      5       48.530000       -0.021580 
      5       48.550000       -0.008541 
      5       48.510000       -0.023822 
      5       48.390000       -0.035396 
      6       48.350000       -0.013080 
      6       48.330000       -0.024655 
      6       48.340000       -0.039935 
      6       48.330000       -0.026936 
      6       48.320000       -0.022010 
      6       48.340000       -0.014370 
      6       48.730000       -0.052962 
      6       48.880000       -0.093672 
      6       48.860000       -0.048435 
      6       49.010000       -0.000085 
      7       48.940000       -0.019712 
      7       48.920000       -0.034147 
      7       48.910000       -0.003585 
      7       49.130000       0.007985 
      7       49.150000       -0.027339 
      7       49.160000       -0.073987 
      7       49.160000       -0.042580 
      7       49.170000       0.010714 
      7       49.180000       0.023713 
      8       49.230000       0.025985 
      8       49.120000       0.019213 
      8       49.160000       -0.002686 
      8       49.180000       -0.034106 
      8       49.200000       -0.019269 
      8       49.180000       0.005275 
      8       49.160000       -0.025541 
      8       49.210000       -0.069101 
      8       49.130000       -0.090974 
      8       49.150000       -0.084772 
      9       49.150000       -0.027769 
      9       49.230000       0.013761 
      9       49.150000       0.024695 
      9       49.180000       0.014218 
      9       49.110000       -0.021913 
      9       49.220000       -0.054746 
      9       49.130000       -0.021913 
      9       49.160000       0.014244 
      9       49.180000       0.025595 
      9       49.140000       0.025016 
      9       49.160000       0.026480 
      10       49.080000       0.025016 
      10       49.100000       0.025581 
      10       49.130000       0.013814 
      10       49.140000       -0.026882 
      10       49.110000       -0.073974 
      10       49.120000       -0.042579 
      10       49.320000       0.010714 
      10       50.280000       0.023726 
      10       50.890000       0.026441 
      11       50.860000       0.025042 
      11       50.700000       0.026481 
      11       50.790000       0.025043 
      11       50.750000       0.026481 
      12       50.730000       0.025016 
      12       50.810000       0.025595 
      12       50.730000       0.014244 
      12       50.690000       -0.021913 
      12       50.660000       -0.054746 
      12       50.670000       -0.021913 
      12       50.720000       0.014244 
      12       50.680000       0.025595 
      12       50.720000       0.024792 
      12       50.660000       0.026806 
      13       50.660000       0.033663 
      13       50.670000       0.057664 
      13       50.650000       0.035381 
      13       50.600000       -0.027984 
      13       50.620000       -0.028117 
      13       50.660000       -0.034578 
      13       50.620000       -0.054515 
      13       50.630000       -0.023475 
      13       50.650000       0.015429 
      14       50.550000       0.023664 
      14       50.610000       0.025702 
      14       50.570000       0.024048 
      14       50.570000       0.025231 
      14       50.660000       0.023542 
      14       50.590000       0.024305 
      14       50.590000       0.017718 
      14       50.590000       -0.000070 
      15       50.570000       -0.021940 
      15       50.590000       -0.023367 
      15       50.540000       -0.021501 
      15       50.570000       0.000147 
      15       50.580000       0.012438 
      15       50.620000       -0.004447 
      15       50.660000       -0.035057 
      15       50.600000       -0.019153 
      15       50.560000       0.015188 
      15       50.530000       0.022999 
      15       50.590000       0.024593 
      16       50.540000       0.017630 
      16       50.520000       -0.004226 
      16       50.610000       -0.035264 
      16       50.510000       -0.019371 
      16       50.570000       0.014973 
      16       50.550000       0.022799 
      17       50.540000       0.024833 
      17       50.580000       0.023187 
      17       50.580000       0.024380 
      17       50.570000       0.022712 
      17       50.540000       0.023909 
      17       50.570000       0.022246 
      17       50.540000       0.023447 
      18       50.530000       0.021789 
      18       50.550000       0.022995 
      18       50.550000       0.021341 
      18       50.430000       0.022551 
      19       50.520000       0.020902 
      19       50.570000       0.022117 
      19       50.500000       0.020471 
      19       50.500000       0.021651 
      19       50.570000       0.018747 
      19       50.450000       0.005677 
      19       50.510000       -0.047140 
      19       50.500000       -0.077762 
      19       50.630000       -0.030789 
      20       50.500000       0.004902 
      20       50.510000       -0.002108 
      20       50.560000       -0.018187 
      20       50.510000       -0.001014 
      20       50.470000       0.016182 
      20       50.490000       0.022350 
      20       50.510000       0.021115 
      20       50.490000       0.021916 
      20       50.510000       0.015366 
      20       50.460000       -0.001973 
      21       50.450000       -0.018918 
      21       50.610000       -0.001764 
      21       50.530000       0.015439 
      21       50.540000       0.021615 
      21       50.500000       0.020387 
      21       50.540000       0.021182 
      21       50.490000       0.014227 
      21       50.480000       -0.007595 
      21       50.530000       -0.038599 
      22       50.450000       -0.022673 
      22       50.460000       0.011704 
      23       50.440000       0.019563 
      23       50.500000       0.021630 
      23       50.490000       0.020015 
      23       50.480000       0.021239 
      24       50.470000       0.019603 
      24       50.500000       0.020831 
      24       50.460000       0.019198 
      24       50.510000       0.020404 
      24       50.420000       0.017938 
      24       50.470000       0.009770 
      24       50.460000       -0.024904 
      25       50.440000       -0.045101 
      25       50.470000       -0.032180 
      25       50.440000       -0.025719 
      25       50.380000       -0.003178 
      25       50.450000       0.014478 
      25       50.490000       0.020677 
      25       50.460000       0.019471 
      25       50.460000       0.020688 
      25       50.440000       0.018219 
      26       50.460000       0.010061 
      26       50.460000       -0.024190 
      26       50.470000       -0.039489 
      26       50.400000       -0.008040 
      26       50.450000       0.012869 
      26       50.490000       0.009671 
      26       50.450000       -0.028631 
      26       50.480000       -0.057988 
      26       50.430000       -0.027752 
      27       50.460000       0.011143 
      27       50.440000       0.018583 
      27       50.370000       0.011272 
      27       50.450000       -0.022965 
      28       50.530000       -0.038275 
      28       50.390000       -0.006812 
      28       50.400000       0.014936 
      28       50.430000       0.021529 
      28       50.420000       0.020329 
      28       50.420000       0.021562 
      28       50.420000       0.019923 
      28       50.490000       0.021148 
      29       50.400000       0.019512 
      29       50.500000       0.020741 
      29       50.460000       0.019110 
      29       50.480000       0.020343 
      29       50.410000       0.018715 
      29       50.450000       0.019952 
      30       50.460000       0.018328 
      30       50.460000       0.019543 
      30       50.430000       0.017085 
      30       50.390000       0.008938 
      30       50.470000       -0.025301 
      30       50.370000       -0.040588 
      31       50.470000       -0.009102 
      31       50.380000       0.012669 
      31       50.440000       0.019285 
      31       50.470000       0.018107 
      31       50.460000       0.019363 
      31       50.440000       0.017745 
      31       50.400000       0.018992 
      32       50.440000       0.017378 
      32       50.430000       0.018628 
      32       50.370000       0.017018 
      32       50.390000       0.018272 
      32       50.460000       0.016665 
      32       50.520000       0.017922 
      32       50.380000       0.016319 
      33       50.410000       0.017580 
      33       50.440000       0.015980 
      33       50.460000       0.017244 
      33       50.400000       0.015648 
      33       50.400000       0.016915 
      33       50.390000       0.015322 
      34       50.380000       0.016593 
      34       50.390000       0.015003 
      34       50.380000       0.016251 
      34       50.420000       0.013826 
      34       50.490000       0.005712 
      34       50.390000       -0.028496 
      35       50.430000       -0.043751 
      35       50.390000       -0.012233 
      35       50.430000       0.009569 
      35       50.380000       0.016216 
      35       50.370000       0.015069 
      35       50.460000       0.016369 
      35       50.440000       0.015220 
      35       50.470000       0.021810 
      36       50.440000       0.043272 
      36       50.390000       0.073920 
      36       50.410000       0.057640 
      36       50.440000       0.022914 
      36       50.420000       0.014708 
      37       50.480000       0.012299 
      37       50.410000       0.013574 
      37       50.420000       0.012014 
      37       50.340000       0.013318 
      37       50.410000       0.011761 
      37       50.370000       0.013067 
      37       50.470000       0.011513 
      37       50.380000       0.012821 
      37       50.440000       0.011269 
      38       50.400000       0.012581 
      38       50.420000       0.011031 
      38       50.390000       0.012344 
      38       50.430000       0.010797 
      38       50.410000       0.012113 
      38       50.410000       0.010568 
      38       50.430000       0.011886 
      38       50.410000       0.010343 
      38       50.460000       0.011664 
      38       50.410000       0.010110 
      39       50.360000       0.011007 
      39       50.420000       0.004567 
      39       50.380000       -0.012665 
      39       50.490000       -0.029502 
      39       50.350000       -0.012243 
      39       50.380000       0.005065 
      39       50.410000       0.011345 
      39       50.400000       0.010220 
      39       50.440000       0.011129 
      39       50.350000       0.004688 
      40       50.350000       -0.012545 
      40       50.330000       -0.029384 
      40       50.440000       -0.012126 
      40       50.440000       0.005168 
      40       50.410000       0.011008 
      40       50.410000       0.004581 
      40       50.410000       -0.017132 
      40       50.450000       -0.048041 
      41       50.330000       -0.032020 
      41       50.460000       0.002450 
      41       50.380000       0.010402 
      41       50.440000       0.012560 
      42       50.390000       0.011037 
      42       50.380000       0.012350 
      42       50.340000       0.010803 
      42       50.360000       0.012093 
      42       50.370000       0.009710 
      43       50.390000       0.001636 
      43       50.410000       -0.032530 
      43       50.440000       -0.047758 
      43       50.420000       -0.016626 
      43       50.380000       0.000314 
      43       50.400000       -0.011556 
      44       50.400000       -0.027967 
      44       50.390000       -0.010749 
      44       50.380000       0.005281 
      44       50.400000       -0.002748 
      44       50.420000       -0.055055 
      44       50.390000       -0.085572 
      44       50.380000       -0.038095 
      44       50.380000       0.002575 
      45       50.380000       0.014173 
      45       50.380000       0.012646 
      45       50.330000       0.005008 
      45       50.340000       -0.023873 
      45       50.360000       -0.016071 
      45       50.380000       0.044827 
      45       50.390000       0.051942 
      45       50.390000       0.022591 
      46       50.380000       0.014801 
      46       50.400000       0.011554 
      46       50.370000       0.003023 
      46       50.390000       -0.035664 
      46       50.380000       -0.065390 
      46       50.400000       -0.039986 
      47       50.360000       -0.019552 
      47       50.400000       -0.026521 
      47       50.420000       -0.008866 
      47       50.340000       0.003528 
      47       50.360000       -0.008786 
      47       50.400000       -0.025237 
      47       50.380000       -0.008007 
      47       50.370000       0.009259 
      48       50.360000       0.015497 
      48       50.380000       0.014343 
      48       50.430000       0.015637 
      48       50.370000       0.014057 
      48       50.390000       0.015340 
      48       50.340000       0.013763 
      48       50.420000       0.015049 
      48       50.300000       0.013475 
      48       50.370000       0.014764 
      48       50.380000       0.013192 
      49       50.390000       0.014484 
      49       50.380000       0.012915 
      49       50.390000       0.014184 
      49       50.410000       0.011767 
      49       50.340000       0.003261 
      49       50.390000       -0.035416 
      49       50.290000       -0.064718 
      49       50.350000       -0.034388 
      49       50.320000       0.005438 
      49       50.400000       0.023172 
      49       50.430000       0.057942 
      50       50.360000       0.072928 
      50       50.430000       0.041119 
      50       50.370000       0.019002 
      50       50.420000       0.011218 
      50       50.370000       0.002278 
      50       50.410000       -0.036402 
      50       50.270000       -0.065694 
      50       50.420000       -0.035381 
      50       50.380000       0.003617 
      50       50.400000       0.011969 
      50       50.380000       0.014125 
      51       50.430000       0.012573 
      51       50.410000       0.013446 
      51       50.390000       0.006980 
      51       50.350000       -0.010301 
      52       50.440000       -0.028001 
      52       50.370000       -0.020157 
      52       50.320000       -0.035495 
      52       50.360000       -0.045787 
      52       50.320000       -0.014262 
      52       50.410000       0.002254 
      52       50.380000       -0.014129 
      52       50.380000       -0.044629 
      52       50.390000       -0.028630 
      53       50.360000       0.005807 
      53       50.370000       0.013725 
      53       50.360000       0.015850 
      53       50.370000       0.014280 
      54       50.410000       0.015136 
      54       50.370000       0.008654 
      54       50.390000       -0.008618 
      54       50.400000       -0.025496 
      54       50.370000       -0.008277 
      54       50.380000       0.008992 
      54       50.370000       0.015232 
      54       50.350000       0.014081 
      55       50.410000       0.015378 
      55       50.340000       0.013800 
      55       50.390000       0.015086 
      55       50.380000       0.013511 
      55       50.360000       0.014774 
      55       50.370000       0.012351 
      55       50.400000       0.003839 
      55       50.400000       -0.034844 
      56       50.410000       -0.064152 
      56       50.380000       -0.033854 
      56       50.390000       0.005129 
      56       50.400000       0.013466 
      56       50.390000       0.015606 
      57       50.370000       0.014052 
      57       50.430000       0.015310 
      57       50.380000       0.012882 
      57       50.330000       0.004364 
      57       50.390000       -0.034323 
      58       50.430000       -0.063637 
      58       50.420000       -0.033344 
      59       50.460000       0.005634 
      59       50.390000       0.013966 
      59       50.330000       0.016101 
      59       50.370000       0.014543 
      59       50.360000       0.015821 
      59       50.380000       0.014239 
      59       50.360000       0.015521 
      59       50.390000       0.013942 
      60       50.360000       0.015226 
      60       50.400000       0.013650 
      60       50.340000       0.014937 
      60       50.430000       0.013364 
      60       50.400000       0.014654 
      60       50.380000       0.013084 
