Human trial picking the raspberry twin 

 time    ||     output compensated 

      0       -799.807547 
      0       -799.807547 
      0       -799.807547 
      0       -799.807547 
      0       -799.807547 
      0       -799.807547 
      0       -799.807547 
      0       -799.807547 
      0       -799.807547 
      0       -799.807542 
      0       -799.806353 
      0       -799.699329 
      0       -796.155153 
      0       -752.977704 
      0       -559.463334 
      0       -240.385338 
      0       -46.815833 
      0       -3.592731 
      0       -0.025617 
      0       0.064728 
      0       0.048571 
      0       0.042208 
      0       0.044063 
      0       0.052080 
      0       0.085741 
      0       0.092360 
      0       0.032435 
      0       0.007229 
      0       0.029707 
      0       0.014370 
      0       -0.006104 
      0       -0.032279 
      0       -0.040170 
      0       -0.004442 
      0       0.042636 
      0       0.015768 
      0       -0.023240 
      0       -0.033941 
      0       -0.043410 
      0       0.000128 
      0       0.059206 
      0       0.090640 
      0       0.039040 
      0       -0.017758 
      0       0.033681 
      0       0.067330 
      0       0.030124 
      0       0.024755 
      0       0.035935 
      0       0.032822 
      0       0.003712 
      0       0.007243 
      0       0.058874 
      0       0.079347 
      0       0.069189 
      1       0.049794 
      1       0.053918 
      1       0.017568 
      1       -0.011972 
      1       0.019852 
      1       0.060549 
      1       0.087570 
      1       0.084693 
      1       0.063386 
      1       0.015712 
      1       -0.023143 
      1       -0.033121 
      1       0.031062 
      1       0.051523 
      1       -0.037499 
      1       -0.075673 
      1       -0.015130 
      1       0.030080 
      1       0.042210 
      1       0.039925 
      1       0.021137 
      1       -0.060423 
      1       -0.139725 
      1       -0.084603 
      1       0.039948 
      1       0.085188 
      1       0.031938 
      1       0.007215 
      1       0.029720 
      1       0.014773 
      1       -0.002034 
      1       -0.024266 
      1       -0.072410 
      1       -0.094072 
      1       0.005510 
      1       0.070390 
      1       0.074517 
      1       0.083460 
      1       0.061005 
      1       0.029791 
      1       0.026940 
      1       0.064716 
      1       0.089702 
      1       0.107254 
      1       0.087031 
      1       0.052119 
      1       0.043996 
      1       0.039992 
      1       0.021594 
      1       -0.054594 
      1       -0.110545 
      1       -0.025011 
      1       0.091071 
      1       0.128280 
      2       0.113459 
      2       0.081245 
      2       0.081162 
      2       0.047189 
      2       -0.054678 
      2       -0.136555 
      2       -0.159107 
      2       -0.100305 
      2       -0.093700 
      2       -0.113288 
      2       -0.084700 
      2       -0.053253 
      2       -0.007999 
      2       0.031988 
      2       0.039245 
      2       0.031315 
      2       -0.007642 
      2       -0.038073 
      2       -0.017861 
      2       -0.016684 
      2       -0.044116 
      2       -0.028955 
      2       -0.009235 
      2       0.007796 
      2       -0.012303 
      2       -0.046305 
      2       -0.048525 
      2       -0.027637 
      2       -0.001625 
      2       -0.040227 
      2       -0.102819 
      2       -0.087075 
      2       -0.029115 
      2       -0.030918 
      2       -0.050630 
      2       0.000019 
      2       -0.012864 
      2       -0.053012 
      2       -0.032170 
      2       -0.016721 
      2       0.026958 
      2       0.067430 
      2       0.021985 
      2       -0.026075 
      2       -0.005532 
      2       0.018626 
      2       0.025417 
      2       0.045227 
      2       0.054024 
      2       0.086826 
      2       0.089427 
      3       0.076648 
      3       0.074445 
      3       0.022760 
      3       -0.016550 
      3       -0.008808 
      3       -0.002567 
      3       0.025048 
      3       0.065525 
      3       0.100896 
      3       0.085611 
      3       0.060031 
      3       0.084619 
      3       0.103781 
      3       0.094302 
      3       0.096029 
      3       0.051505 
      3       -0.009212 
      3       0.005391 
      3       0.012476 
      3       -0.040436 
      3       -0.026736 
      3       0.020985 
      3       0.028326 
      3       0.012108 
      3       -0.004912 
      3       0.012926 
      3       0.038958 
      3       0.072718 
      3       0.069360 
      3       0.022484 
      3       0.021026 
      3       0.051280 
      3       0.071761 
      3       0.049186 
      3       0.008855 
      3       -0.021901 
      3       0.016550 
      3       0.080590 
      3       0.078125 
      3       0.057709 
      3       0.045261 
      3       0.001653 
      3       -0.037255 
      3       -0.055684 
      3       -0.018142 
      3       0.018248 
      3       0.029315 
      3       0.028436 
      3       0.029163 
      3       0.022129 
      4       0.000228 
      4       -0.030854 
      4       -0.014979 
      4       0.020159 
      4       0.037333 
      4       0.071948 
      4       0.086795 
      4       0.054873 
      4       0.033496 
      4       0.036218 
      4       0.073649 
      4       0.098088 
      4       0.054185 
      4       0.023401 
      4       0.069389 
      4       0.104078 
      4       0.096077 
      4       0.079003 
      4       0.094777 
      4       0.106070 
      4       0.091427 
      4       0.058403 
      4       0.009114 
      4       -0.058921 
      4       -0.051646 
      4       -0.027270 
      4       -0.054847 
      4       -0.084102 
      4       -0.112027 
      4       -0.078989 
      4       0.031381 
      4       0.094035 
      4       0.071828 
      4       -0.025149 
      4       -0.102997 
      4       -0.090374 
      4       -0.036328 
      4       0.002284 
      4       -0.019154 
      4       -0.007699 
      4       0.049907 
      4       0.056176 
      4       0.019619 
      4       0.050117 
      4       0.088096 
      4       0.048735 
      4       0.017579 
      4       0.054198 
      4       0.055024 
      4       0.015417 
      5       -0.028670 
      5       -0.052339 
      5       0.012538 
      5       0.055360 
      5       -0.003681 
      5       -0.055553 
      5       -0.030608 
      5       0.008716 
      5       0.025553 
      5       0.050512 
      5       0.029178 
      5       -0.024312 
      5       0.012739 
      5       0.036949 
      5       -0.014770 
      5       -0.020923 
      5       0.013050 
      5       0.039094 
      5       0.057330 
      5       0.049192 
      5       0.063389 
      5       0.063551 
      5       -0.006649 
      5       -0.068769 
      5       -0.076896 
      5       -0.059792 
      5       -0.036950 
      5       -0.030442 
      5       -0.017680 
      5       -0.038362 
      5       -0.077035 
      5       -0.097944 
      5       -0.095719 
      5       -0.056964 
      5       -0.031619 
      5       -0.013075 
      5       -0.023139 
      5       -0.019825 
      5       0.008371 
      5       -0.006419 
      5       -0.025799 
      5       -0.042904 
      5       -0.027321 
      5       -0.010244 
      5       -0.007854 
      6       0.048059 
      6       0.104420 
      6       0.101566 
      6       0.042914 
      6       -0.020062 
      6       0.021827 
      6       0.073518 
      6       0.065218 
      6       0.045960 
      6       0.030381 
      6       0.052744 
      6       0.031770 
      6       -0.013319 
      6       0.000109 
      6       0.039586 
      6       0.075590 
      6       0.065064 
      6       0.054231 
      6       0.085182 
      6       0.105185 
      6       0.101476 
      6       0.066723 
      6       0.049678 
      6       0.070396 
      6       0.052437 
      6       0.007511 
      6       -0.042228 
      6       -0.088426 
      6       -0.047074 
      6       0.039321 
      6       0.074120 
      6       0.067516 
      6       0.084657 
      6       0.099759 
      6       0.090759 
      6       0.036666 
      6       -0.004594 
      6       0.004414 
      6       0.008234 
      7       0.026927 
      7       0.023848 
      7       0.011769 
      7       0.015546 
      7       0.053622 
      7       0.082716 
      7       0.051806 
      7       0.007725 
      7       -0.019763 
      7       -0.041862 
      7       -0.038195 
      7       -0.017093 
      7       0.026686 
      7       0.062324 
      7       0.128304 
      7       0.201614 
      7       0.280330 
      7       0.385037 
      7       0.455667 
      7       0.512056 
      7       0.577899 
      7       0.726814 
      7       0.867472 
      7       0.910191 
      7       0.962644 
      7       1.038900 
      7       1.083362 
      7       1.157411 
      7       1.330445 
      7       1.597648 
      7       1.849975 
      7       2.013693 
      7       2.115507 
      7       2.174808 
      7       2.236797 
      7       2.417932 
      7       2.733087 
      7       3.062460 
      7       3.262529 
      8       3.312724 
      8       3.312047 
      8       3.339388 
      8       3.490588 
      8       3.682258 
      8       3.824115 
      8       3.929281 
      8       3.963554 
      8       3.945090 
      8       3.980665 
      8       4.015021 
      8       4.023701 
      8       4.012394 
      8       4.033087 
      8       4.068012 
      8       4.076082 
      8       4.078367 
      8       4.076982 
      8       4.079267 
      8       4.087324 
      8       4.121846 
      8       4.138402 
      8       4.116920 
      8       4.132617 
      8       4.157200 
      8       4.126801 
      8       4.087754 
      8       4.079280 
      8       4.077009 
      8       4.079281 
      8       4.087794 
      8       4.128118 
      8       4.172982 
      9       4.200750 
      9       4.225058 
      9       4.243871 
      9       4.326928 
      9       4.489137 
      9       4.697178 
      9       4.884983 
      9       5.009166 
      9       5.066171 
      9       5.076028 
      9       5.078367 
      9       5.076996 
      9       5.079778 
      9       5.095061 
      9       5.177149 
      9       5.352011 
      9       5.611977 
      9       5.900210 
      9       6.091170 
      9       6.154514 
      9       6.134887 
      9       6.148455 
      9       6.317059 
      9       6.611047 
      9       6.859386 
      9       6.967916 
      9       7.026264 
      9       7.068467 
      9       7.088647 
      9       7.148307 
      9       7.241910 
      9       7.080387 
      9       5.900124 
      9       3.440497 
      9       1.399541 
      10       1.416501 
      10       2.398953 
      10       2.873922 
      10       2.701317 
      10       2.195357 
      10       1.619465 
      10       0.997591 
      10       0.295557 
      10       -0.333533 
      10       -0.746493 
      10       -0.991986 
      10       -1.269504 
      10       -1.600894 
      10       -1.779701 
      10       -1.819821 
      10       -1.821538 
      10       -1.823930 
      10       -1.832431 
      10       -1.853602 
      10       -1.874561 
      10       -1.864231 
      10       -1.866529 
      10       -1.865117 
      10       -1.866556 
      11       -1.865117 
      11       -1.866556 
      11       -1.865118 
      11       -1.866569 
      11       -1.865561 
      11       -1.871955 
      11       -1.889315 
      11       -1.906450 
      11       -1.889315 
      11       -1.871955 
      11       -1.865561 
      11       -1.866569 
      11       -1.865118 
      11       -1.866556 
      11       -1.865117 
      11       -1.866556 
      11       -1.865117 
      11       -1.866556 
      11       -1.865117 
      11       -1.866556 
      11       -1.865117 
      11       -1.866556 
      11       -1.865117 
      11       -1.866556 
      11       -1.865117 
      11       -1.866556 
      11       -1.865117 
      11       -1.866556 
      11       -1.865117 
      11       -1.866556 
      11       -1.865117 
      11       -1.866556 
      12       -1.865117 
      12       -1.866556 
      12       -1.865117 
      12       -1.866556 
      12       -1.865118 
      12       -1.866569 
      12       -1.865574 
      12       -1.872411 
      12       -1.895157 
      12       -1.936046 
      12       -1.953406 
      12       -1.936046 
      12       -1.895157 
      12       -1.872411 
      12       -1.865574 
      12       -1.866569 
      12       -1.865118 
      12       -1.866556 
      12       -1.865117 
      12       -1.866556 
      12       -1.865117 
      12       -1.866556 
      12       -1.865117 
      12       -1.866556 
      12       -1.865104 
      12       -1.866099 
      12       -1.859288 
      12       -1.837390 
      12       -1.805995 
      13       -1.821692 
      13       -1.856188 
      13       -1.864244 
      13       -1.866529 
      13       -1.865117 
      13       -1.866556 
      13       -1.865117 
      13       -1.866556 
      13       -1.865117 
      13       -1.866556 
      13       -1.865117 
      13       -1.866556 
      13       -1.865117 
      13       -1.866556 
      13       -1.846466 
      13       -1.829426 
      14       -1.809707 
      14       -1.793034 
      14       -1.773680 
      14       -1.757367 
      14       -1.738369 
      14       -1.722410 
      14       -1.703762 
      14       -1.688148 
      14       -1.669843 
      14       -1.654568 
      14       -1.636598 
      14       -1.621656 
      14       -1.604016 
      14       -1.589400 
      15       -1.572082 
      15       -1.557785 
      15       -1.540783 
      15       -1.526799 
      15       -1.510107 
      15       -1.496430 
      15       -1.480042 
      15       -1.466665 
      15       -1.450575 
      15       -1.437493 
      15       -1.421694 
      15       -1.408901 
      16       -1.393388 
      16       -1.380878 
      16       -1.365646 
      16       -1.353413 
      16       -1.338455 
      16       -1.326494 
      16       -1.311806 
      16       -1.300125 
      16       -1.286125 
      16       -1.279594 
      16       -1.283984 
      16       -1.288108 
      16       -1.258263 
      16       -1.228494 
      16       -1.209879 
      16       -1.198779 
      16       -1.185354 
      16       -1.174924 
      16       -1.161751 
      16       -1.151558 
      16       -1.138618 
      16       -1.128656 
      16       -1.115945 
      16       -1.106223 
      17       -1.094162 
      17       -1.089551 
      17       -1.095842 
      17       -1.101847 
      17       -1.073865 
      17       -1.045940 
      17       -1.029150 
      17       -1.019857 
      17       -1.008222 
      17       -0.999563 
      17       -0.988144 
      17       -0.979686 
      17       -0.968465 
      17       -0.960205 
      17       -0.949179 
      17       -0.941124 
      17       -0.930714 
      17       -0.927711 
      17       -0.934769 
      17       -0.932573 
      17       -0.869063 
      17       -0.812106 
      17       -0.828735 
      17       -0.858666 
      18       -0.858455 
      18       -0.852145 
      18       -0.842226 
      18       -0.835228 
      18       -0.825452 
      18       -0.818621 
      18       -0.809011 
      18       -0.802345 
      18       -0.792897 
      18       -0.786392 
      18       -0.777104 
      18       -0.770757 
      19       -0.761626 
      19       -0.755434 
      19       -0.746455 
      19       -0.740415 
      19       -0.731586 
      19       -0.725668 
      19       -0.716136 
      19       -0.700560 
      19       -0.654059 
      19       -0.608050 
      19       -0.594406 
      19       -0.596025 
      19       -0.629534 
      19       -0.662734 
      19       -0.664521 
      20       -0.660151 
      20       -0.652152 
      20       -0.647055 
      20       -0.639160 
      20       -0.634192 
      20       -0.626413 
      20       -0.621135 
      20       -0.608180 
      20       -0.580419 
      20       -0.543534 
      20       -0.553639 
      20       -0.582253 
      20       -0.584407 
      20       -0.580825 
      20       -0.573618 
      20       -0.569306 
      20       -0.562176 
      20       -0.557553 
