

 time    ||    gripping force   ||   raspberry measurement 

      0       0.210000       -794.264815 
      0       0.260000       -794.264815 
      0       0.200000       -794.264815 
      0       0.200000       -794.264815 
      0       0.080000       -794.264815 
      0       0.160000       -794.264815 
      0       0.210000       -794.264815 
      0       0.380000       -794.264815 
      0       0.330000       -794.264815 
      0       0.370000       -794.264810 
      0       0.280000       -794.263629 
      1       0.520000       -786.215768 
      1       0.240000       -782.695982 
      1       0.380000       -739.816086 
      1       0.380000       -547.643138 
      1       0.370000       -230.843869 
      1       0.540000       -38.881332 
      1       0.350000       3.779376 
      1       0.240000       7.335505 
      1       0.370000       7.209499 
      1       0.290000       6.908607 
      1       0.250000       7.312971 
      1       0.430000       7.901203 
      1       0.490000       8.142199 
      2       0.470000       7.936745 
      2       0.380000       7.477650 
      2       0.350000       7.265521 
      2       0.390000       7.667736 
      2       0.250000       8.214614 
      2       0.510000       8.451981 
      2       0.490000       8.493160 
      2       0.350000       8.552455 
      2       0.470000       8.611150 
      2       0.400000       8.621168 
      3       0.460000       8.584222 
      3       0.400000       8.431580 
      3       0.560000       8.297503 
      3       0.500000       8.383187 
      3       0.570000       8.493702 
      3       0.540000       8.525697 
      3       0.690000       8.536345 
      3       0.460000       8.571363 
      3       0.510000       8.592460 
      3       0.320000       8.585249 
      3       0.150000       8.602802 
      4       1.550000       8.614815 
      4       2.360000       8.597859 
      4       2.440000       8.566465 
      4       3.350000       8.577206 
      4       6.620000       8.592460 
      4       9.820000       8.579447 
      4       11.200000       8.574092 
      4       34.350000       8.561495 
      4       50.280000       8.581262 
      4       79.710000       8.605415 
      5       131.320000       8.565871 
      5       175.260000       8.495701 
      5       188.150000       8.453782 
      5       176.390000       8.363915 
      5       145.070000       8.246811 
      5       129.700000       8.353204 
      5       128.740000       8.534430 
      5       136.730000       8.613138 
      6       147.970000       8.625078 
      6       147.850000       8.628411 
      6       147.460000       8.639343 
      6       147.310000       8.712573 
      6       147.560000       8.953605 
      6       147.360000       9.558744 
      7       147.190000       10.535971 
      7       147.100000       11.532684 
      7       146.880000       12.189439 
      7       146.980000       12.262144 
      7       146.650000       11.915134 
      7       146.730000       11.496590 
      7       146.660000       11.242158 
      7       146.560000       11.292696 
      8       146.510000       11.492485 
      8       146.230000       11.601332 
      8       146.140000       11.625615 
      8       146.240000       11.625989 
      8       145.730000       11.627481 
      9       145.920000       11.626044 
      9       145.470000       11.627482 
      9       145.640000       11.626044 
      9       145.380000       11.627482 
      9       145.650000       11.626044 
      9       145.400000       11.627482 
      9       145.280000       11.626044 
      9       145.510000       11.627482 
      9       145.400000       11.626044 
      9       145.360000       11.627482 
      10       145.220000       11.626044 
      10       145.100000       11.627482 
      10       145.180000       11.626030 
      10       144.990000       11.627039 
      10       144.930000       11.620644 
      10       144.960000       11.603258 
      10       144.900000       11.585276 
      11       144.740000       11.592916 
      11       144.850000       11.577193 
      11       144.750000       11.565605 
      11       144.740000       11.587934 
      11       144.680000       11.576763 
      11       144.740000       11.565592 
      11       144.600000       11.587934 
      11       144.250000       11.576763 
      11       144.040000       11.565592 
      11       144.080000       11.587934 
      12       144.010000       11.576789 
      12       144.050000       11.566438 
      12       143.920000       11.597403 
      12       143.890000       11.608986 
      12       143.840000       11.573662 
      12       143.760000       11.526987 
      13       143.770000       11.557535 
      13       143.790000       11.600890 
      13       143.780000       11.575460 
      13       143.630000       11.537285 
      13       143.720000       11.534184 
      13       143.700000       11.554807 
      13       143.040000       11.581662 
      13       142.090000       11.552539 
      13       141.160000       11.525684 
      13       141.190000       11.563280 
      13       142.250000       11.565535 
      14       142.620000       11.535996 
      14       142.650000       11.529228 
      14       142.740000       11.536868 
      14       142.660000       11.575876 
      14       142.620000       11.605832 
      14       142.620000       11.575890 
      14       142.460000       11.537298 
      14       142.500000       11.534197 
      14       142.440000       11.555210 
      14       142.460000       11.585718 
      14       142.420000       11.560109 
      14       142.430000       11.488005 
      14       142.400000       11.448137 
      15       142.360000       11.472720 
      15       142.420000       11.497900 
      15       142.340000       11.509903 
      15       142.330000       11.548565 
      15       142.370000       11.569482 
      15       142.360000       11.577745 
      15       142.380000       11.575311 
      15       142.190000       11.578161 
      15       142.270000       11.574008 
      15       142.210000       11.562447 
      15       142.270000       11.508146 
      15       142.240000       11.483159 
      16       142.240000       11.548039 
      16       142.230000       11.610761 
      16       142.150000       11.622041 
      16       142.170000       11.595020 
      16       142.150000       11.479974 
      16       142.150000       11.377292 
      16       142.170000       11.431594 
      16       142.100000       11.504917 
      16       142.030000       11.531109 
      17       142.020000       11.550187 
      17       142.110000       11.567376 
      17       142.010000       11.550241 
      17       142.030000       11.532895 
      17       142.090000       11.526930 
      17       142.030000       11.532855 
      17       142.040000       11.548924 
      17       141.990000       11.551595 
      17       141.980000       11.482135 
      17       142.010000       11.425684 
      17       141.970000       11.433724 
      17       142.000000       11.396931 
      17       141.930000       11.358049 
      17       141.990000       11.402276 
      17       141.970000       11.456591 
      18       141.920000       11.449355 
      18       141.960000       11.432881 
      18       141.940000       11.427359 
      18       142.010000       11.437837 
      18       141.980000       11.468622 
      18       141.870000       11.478547 
      18       141.930000       11.420714 
      18       141.790000       11.417587 
      18       141.660000       11.457008 
      19       141.590000       11.438623 
      19       141.570000       11.385347 
      19       141.600000       11.357523 
      19       141.590000       11.428409 
      19       141.590000       11.506732 
      19       141.610000       11.534652 
      19       141.590000       11.571283 
      19       141.610000       11.591546 
      19       141.470000       11.573577 
      19       141.630000       11.543985 
      19       141.560000       11.489789 
      20       141.450000       11.465978 
      20       141.570000       11.414860 
      20       141.450000       11.333795 
      20       141.540000       11.339554 
      20       141.560000       11.318484 
      20       141.410000       11.285843 
      20       141.500000       11.350728 
      20       141.530000       11.418898 
      20       141.360000       11.458753 
      20       140.870000       11.437740 
      20       140.420000       11.370452 
      21       139.620000       11.365663 
      21       139.830000       11.394189 
      21       140.190000       11.413557 
      21       140.560000       11.390206 
      21       140.770000       11.400973 
      21       140.250000       11.409070 
      21       139.910000       11.370479 
      21       139.970000       11.395285 
      21       140.600000       11.464969 
      21       140.760000       11.517196 
      21       140.730000       11.522805 
      21       140.770000       11.518068 
      22       139.870000       11.475311 
      22       139.990000       11.437851 
      22       140.230000       11.421101 
      22       140.610000       11.398342 
      22       140.700000       11.366868 
      22       140.170000       11.380832 
      22       139.840000       11.395021 
      22       139.930000       11.321237 
      22       140.290000       11.222918 
      22       140.950000       11.201584 
      22       140.990000       11.248426 
      22       140.820000       11.298355 
      22       140.800000       11.253785 
      23       140.830000       11.224895 
      23       140.860000       11.252067 
      23       140.760000       11.298786 
      23       140.770000       11.341355 
      23       140.840000       11.419301 
      23       140.760000       11.472195 
      23       140.230000       11.432327 
      23       139.900000       11.397819 
      23       140.000000       11.347597 
      23       140.220000       11.290755 
      23       140.650000       11.275852 
      23       140.730000       11.271474 
      23       140.710000       11.320228 
      24       140.690000       11.354324 
      24       140.180000       11.322956 
      24       139.880000       11.349411 
      24       139.890000       11.365951 
      24       140.180000       11.354350 
      24       140.470000       11.344026 
      24       140.620000       11.310373 
      24       140.660000       11.308684 
      24       140.110000       11.321061 
      24       139.900000       11.326152 
      24       139.900000       11.314776 
      25       140.450000       11.273246 
      25       140.590000       11.216685 
      25       140.570000       11.215843 
      25       140.120000       11.260636 
      25       139.830000       11.329586 
      25       140.150000       11.331011 
      25       140.370000       11.258754 
      25       140.580000       11.211882 
      25       139.960000       11.191050 
      25       139.780000       11.234790 
      25       140.050000       11.289166 
      25       140.500000       11.323025 
      26       140.500000       11.328231 
      26       140.540000       11.337766 
      26       140.490000       11.301819 
      26       140.510000       11.270977 
      26       140.020000       11.287008 
      26       139.630000       11.259276 
      26       139.810000       11.177704 
      26       140.080000       11.106914 
      26       140.300000       11.138712 
      26       139.920000       11.285745 
      26       139.670000       11.377480 
      26       139.740000       11.325656 
      26       140.030000       11.251197 
      26       140.360000       11.251251 
      27       140.480000       11.261549 
      27       139.870000       11.305876 
      27       139.700000       11.355195 
      27       139.990000       11.327314 
      27       140.430000       11.230184 
      27       140.450000       11.135984 
      27       139.890000       11.150418 
      27       139.710000       11.167738 
      27       139.980000       11.175518 
      27       140.320000       11.235925 
      27       140.450000       11.253355 
      27       140.350000       11.216355 
      28       140.430000       11.274854 
      28       140.360000       11.333709 
      28       140.390000       11.261035 
      28       140.350000       11.218101 
      28       140.360000       11.222031 
      28       140.310000       11.293842 
      28       139.960000       11.332285 
      28       139.670000       11.245381 
      28       139.900000       11.215430 
      28       140.200000       11.291048 
      28       140.340000       11.344920 
      28       140.370000       11.300933 
      29       140.270000       11.253038 
      29       140.330000       11.277166 
      29       140.290000       11.304570 
      29       140.360000       11.260593 
      29       139.830000       11.175962 
      29       139.610000       11.168751 
      29       139.610000       11.292030 
      29       139.620000       11.382893 
      29       139.870000       11.344494 
      29       140.320000       11.267754 
      29       140.310000       11.245439 
      29       140.310000       11.279474 
      29       140.270000       11.322013 
      29       140.300000       11.282175 
      30       140.250000       11.256609 
      30       140.250000       11.319801 
      30       139.870000       11.361880 
      30       140.070000       11.355222 
      30       140.240000       11.272183 
      30       140.560000       11.182259 
      30       140.280000       11.172747 
      30       140.240000       11.164664 
      30       139.790000       11.136510 
      30       139.500000       11.201390 
      30       139.490000       11.267306 
      30       139.820000       11.233214 
      31       140.250000       11.213587 
      31       140.230000       11.215702 
      31       140.200000       11.197939 
      31       139.730000       11.168198 
      31       139.410000       11.197513 
      31       139.550000       11.274395 
      31       139.810000       11.283114 
      31       140.140000       11.230544 
      31       140.210000       11.271490 
      31       140.210000       11.363599 
      31       139.680000       11.423396 
      31       139.480000       11.373011 
      31       139.510000       11.239194 
      31       139.790000       11.140082 
      32       140.060000       11.171019 
      32       140.140000       11.270491 
      32       140.520000       11.347498 
      32       140.400000       11.330998 
      32       140.420000       11.240386 
      32       140.250000       11.196185 
      32       140.300000       11.206317 
      32       140.270000       11.248592 
      32       140.210000       11.273942 
      32       140.190000       11.289827 
      32       140.180000       11.251070 
      32       140.250000       11.155821 
      32       140.210000       11.140927 
      33       140.240000       11.243606 
      33       140.140000       11.255597 
      33       140.140000       11.216368 
      33       140.210000       11.273069 
      33       140.220000       11.331910 
      33       140.190000       11.326486 
      33       140.140000       11.308171 
      33       140.190000       11.233698 
      33       140.200000       11.199786 
      33       140.210000       11.301363 
      33       140.160000       11.403129 
      33       140.170000       11.352923 
      33       140.190000       11.223860 
      33       140.120000       11.159862 
      33       140.200000       11.198301 
      34       140.090000       11.249479 
      34       140.150000       11.292889 
      34       140.110000       11.378010 
      34       140.170000       11.387891 
      34       139.580000       11.342612 
      34       140.840000       11.260193 
      34       139.410000       11.131471 
      34       139.930000       11.106541 
      34       140.380000       11.159221 
      34       140.360000       11.179058 
      34       140.510000       11.137759 
      34       140.390000       11.200600 
      34       140.610000       11.321915 
      35       140.180000       11.294231 
      35       140.570000       11.235999 
      35       140.100000       11.264153 
      35       140.450000       11.265561 
      35       140.690000       11.235956 
      35       140.690000       11.227912 
      35       140.140000       11.221127 
      35       140.370000       11.209114 
      35       140.020000       11.215316 
      35       140.170000       11.262434 
      35       140.140000       11.266381 
      35       140.390000       11.246351 
      35       140.130000       11.272223 
      36       140.170000       11.292460 
      36       140.210000       11.284376 
      36       140.320000       11.292433 
      36       140.090000       11.271363 
      36       140.330000       11.236425 
      36       140.260000       11.228315 
      36       140.140000       11.224741 
      36       140.230000       11.211312 
      36       140.230000       11.154339 
      36       140.110000       11.118611 
      36       140.220000       11.202303 
      36       140.230000       11.296929 
      37       140.140000       11.303161 
      37       140.240000       11.308161 
      37       140.170000       11.320214 
      37       140.110000       11.317114 
      37       140.150000       11.287575 
      37       140.240000       11.286162 
      37       140.110000       11.319385 
      37       140.170000       11.327801 
      37       140.130000       11.336411 
      37       140.170000       11.285192 
      37       140.090000       11.193443 
      37       140.150000       11.148983 
      37       140.130000       11.176803 
      38       140.110000       11.205846 
      38       140.210000       11.175434 
      38       140.120000       11.131483 
      38       140.160000       11.105514 
      38       140.160000       11.102830 
      38       140.180000       11.181732 
      38       140.090000       11.270379 
      38       140.140000       11.269510 
      38       140.050000       11.234169 
      38       140.140000       11.201816 
      38       140.000000       11.110927 
      38       140.070000       11.057607 
      39       140.100000       11.169150 
      39       140.120000       11.264577 
      39       140.050000       11.253384 
      39       140.070000       11.231928 
      39       140.100000       11.210275 
      39       140.110000       11.154005 
      39       140.110000       11.095160 
      39       140.090000       11.102440 
      39       140.150000       11.122475 
      39       140.030000       11.214968 
      39       140.080000       11.324076 
      39       140.100000       11.284831 
      39       140.020000       11.180351 
      40       140.100000       11.156663 
      40       140.080000       11.157453 
      40       140.130000       11.191214 
      40       140.040000       11.249258 
      40       140.060000       11.231508 
      40       140.080000       11.146242 
      40       140.000000       11.126197 
      40       139.980000       11.174894 
      40       140.050000       11.225197 
      40       140.110000       11.184347 
      40       140.070000       11.095230 
      40       140.060000       11.071949 
      41       139.980000       11.191118 
      41       140.460000       11.354252 
      41       140.140000       11.365852 
      41       139.820000       11.262423 
      41       140.690000       11.178982 
      41       140.270000       11.181745 
      41       139.950000       11.194645 
      41       139.810000       11.117154 
      41       140.220000       11.014488 
      41       140.120000       11.029339 
      41       140.220000       11.125597 
      41       140.120000       11.156565 
      42       140.350000       11.125214 
      42       139.930000       11.152955 
      42       140.100000       11.186617 
      42       139.850000       11.173551 
      42       140.480000       11.148109 
      42       140.030000       11.100045 
      42       140.360000       11.061646 
      42       140.140000       11.057927 
      42       140.250000       11.156232 
      42       140.260000       11.254613 
      42       140.090000       11.226166 
      42       139.900000       11.181667 
      43       140.410000       11.231083 
      43       140.060000       11.292833 
      43       139.980000       11.331039 
      43       140.360000       11.296434 
      43       139.910000       11.253508 
      43       140.540000       11.287964 
      43       139.860000       11.353406 
      43       140.620000       11.345726 
      43       140.110000       11.246713 
      43       140.320000       11.195632 
      43       140.340000       11.193357 
      43       139.960000       11.108656 
      44       140.340000       11.059879 
      44       140.090000       11.177649 
      44       140.220000       11.304459 
      44       140.200000       11.292862 
      44       140.090000       11.235928 
      44       140.300000       11.199632 
      44       140.070000       11.166988 
      44       140.230000       11.183465 
      44       140.250000       11.226515 
      44       140.070000       11.255125 
      44       140.290000       11.206757 
      44       140.200000       11.022515 
      45       140.300000       10.911968 
      45       140.130000       10.979879 
      45       140.290000       11.079956 
      45       140.180000       11.108047 
      45       140.140000       11.078604 
      45       140.140000       11.046671 
      45       140.180000       11.084044 
      45       140.160000       11.134070 
      45       140.170000       11.143179 
      45       140.200000       11.121091 
      45       140.190000       11.156192 
      46       140.210000       11.190078 
      46       140.180000       11.127079 
      46       140.130000       11.057939 
      46       140.170000       11.091175 
      46       140.110000       11.167722 
      46       140.250000       11.213928 
      46       140.130000       11.135885 
      46       140.050000       11.013628 
      46       140.210000       11.000616 
      46       140.110000       11.066892 
      46       140.200000       11.115825 
      46       140.090000       11.126017 
      47       140.180000       11.138226 
      47       140.160000       11.173511 
      47       140.180000       11.195156 
      47       140.160000       11.110290 
      47       140.140000       10.991300 
      47       140.170000       10.983050 
      47       140.140000       11.083960 
      47       140.170000       11.131411 
      47       140.090000       11.110775 
      47       140.170000       11.039154 
      47       140.140000       11.001001 
      47       140.150000       11.047237 
      48       140.170000       11.082535 
      48       140.130000       11.136437 
      48       140.130000       11.131332 
      48       140.120000       11.075973 
      48       140.080000       11.078066 
      48       140.130000       11.092903 
      48       140.090000       11.083934 
      48       140.070000       11.086618 
      48       140.150000       11.042654 
      49       140.140000       10.983132 
      49       140.150000       11.012632 
      49       140.110000       11.075416 
      49       140.130000       11.060566 
      49       140.110000       11.004189 
      49       140.150000       11.021171 
      49       140.100000       11.097789 
      49       140.170000       11.094231 
      49       140.140000       11.060126 
      49       140.110000       11.043595 
      49       140.130000       10.999575 
      49       140.080000       10.959874 
      50       140.180000       10.936787 
      50       140.120000       10.965259 
      50       140.100000       11.023732 
      50       140.050000       11.082200 
      50       140.140000       11.069469 
      50       140.120000       11.043692 
      50       140.120000       11.056943 
      50       140.090000       11.096556 
      50       140.140000       11.108920 
      50       140.110000       11.072319 
      50       140.080000       11.010320 
      51       140.090000       10.978672 
      51       140.150000       10.946695 
      51       140.090000       10.921295 
      51       140.110000       10.957027 
      51       140.040000       11.085301 
      51       140.050000       11.153686 
      51       140.100000       11.084862 
      51       140.110000       11.015316 
      51       140.050000       10.986673 
      51       140.090000       10.933353 
      51       140.090000       10.982636 
      52       140.090000       11.114800 
      52       140.060000       11.131287 
      52       140.090000       11.012257 
      52       140.120000       10.901404 
      52       140.070000       10.878230 
      52       140.100000       10.870480 
      52       140.060000       10.926167 
      52       140.030000       10.965894 
      52       140.010000       10.912228 
      52       140.100000       10.888532 
      52       140.070000       10.967737 
      53       140.000000       11.037350 
      53       140.040000       11.057828 
      53       140.130000       11.093402 
      53       140.010000       11.088736 
      53       140.060000       11.059376 
      53       140.020000       11.040359 
      53       140.040000       11.066947 
      53       140.100000       11.055167 
      53       140.070000       10.988031 
      53       140.050000       10.953966 
      53       140.050000       11.002329 
      53       140.010000       11.062408 
      54       140.110000       11.078534 
      54       140.090000       11.092406 
      54       140.050000       11.076319 
      54       140.030000       11.055680 
      54       140.010000       11.049882 
      54       140.100000       11.039540 
      54       140.050000       11.067833 
      54       140.030000       11.066798 
      54       140.040000       11.045464 
      54       139.970000       11.060969 
      54       140.090000       11.038250 
      54       140.020000       10.975852 
      54       140.060000       10.989886 
      54       139.970000       11.034930 
      54       140.010000       11.047249 
      55       140.060000       11.028648 
      55       140.080000       11.018109 
      55       140.060000       10.970839 
      55       140.080000       10.925378 
      55       140.080000       10.941716 
      55       140.060000       11.018095 
      55       140.050000       11.057328 
      55       140.050000       11.041863 
      56       140.010000       10.982080 
      56       140.000000       10.956290 
      56       140.010000       11.016189 
      56       139.990000       11.125612 
      56       140.030000       11.147484 
      56       140.000000       11.075419 
      56       139.950000       10.989307 
      56       140.000000       10.948150 
      56       140.010000       10.971821 
      56       140.060000       10.986632 
      56       139.990000       10.955237 
      57       139.990000       10.934170 
      57       139.980000       10.936385 
      57       140.050000       10.964219 
      57       140.000000       10.947083 
      57       139.980000       10.853053 
      57       140.030000       10.831526 
      57       140.030000       10.892846 
      57       140.030000       10.865079 
      57       140.070000       10.800615 
      57       140.040000       10.795133 
      57       139.940000       10.788944 
      57       139.930000       10.825658 
      57       139.990000       10.926042 
      58       140.020000       10.943038 
      58       139.970000       10.863351 
      58       139.980000       10.814045 
      58       140.020000       10.877676 
      58       139.990000       10.951180 
      58       140.010000       10.948951 
      58       139.990000       10.934144 
      58       139.990000       10.941837 
      58       139.970000       10.990591 
      58       140.020000       11.012657 
      58       139.940000       10.982534 
      59       139.970000       10.970978 
      59       140.010000       10.940412 
      59       139.980000       10.957092 
      59       139.950000       10.982051 
      59       140.000000       10.953867 
      59       140.000000       10.921144 
      59       139.970000       10.861035 
      59       139.960000       10.764747 
      59       139.910000       10.714516 
      59       139.970000       10.782673 
      59       140.000000       10.871320 
      59       139.970000       10.881249 
      60       139.940000       10.895161 
      60       139.930000       10.952481 
      60       140.010000       10.946683 
      60       139.960000       10.924328 
      60       139.990000       10.952039 
      60       139.960000       10.912171 
      60       139.990000       10.836926 
      60       139.990000       10.858395 
      60       140.000000       10.900943 
      60       139.930000       10.876320 
      60       140.000000       10.847237 
      60       139.980000       10.873136 
      60       139.910000       10.903285 
      60       139.990000       10.933630 
      60       139.940000       10.982147 
      61       139.960000       10.957824 
