Human trial picking the raspberry twin 

 time    ||     output compensated 

      0       -799.789796 
      0       -799.789796 
      0       -799.789796 
      0       -799.789796 
      0       -799.789796 
      0       -799.789796 
      0       -799.789796 
      0       -799.789796 
      0       -799.789796 
      0       -799.789791 
      0       -799.788602 
      0       -799.681591 
      0       -796.137832 
      0       -752.964936 
      0       -559.465281 
      0       -240.394565 
      0       -46.837521 
      0       -3.676795 
      0       -0.168772 
      0       -0.091440 
      0       -0.038581 
      0       0.016411 
      0       0.028203 
      0       0.080102 
      0       0.114650 
      0       0.088239 
      0       0.067603 
      0       0.069857 
      0       0.098537 
      0       0.090883 
      0       0.029493 
      0       0.020563 
      0       0.034778 
      0       -0.015291 
      0       -0.074979 
      0       -0.085694 
      0       -0.074952 
      0       -0.014432 
      0       0.044690 
      0       0.058159 
      0       0.060887 
      0       0.059488 
      0       0.060901 
      0       0.058616 
      0       0.050559 
      0       0.016037 
      0       -0.000519 
      0       0.020976 
      0       0.005682 
      1       -0.014805 
      1       0.024481 
      1       0.041643 
      1       0.003468 
      1       0.023734 
      1       0.078260 
      1       0.117834 
      1       0.087672 
      1       -0.008563 
      1       -0.087048 
      1       -0.072198 
      1       -0.000134 
      1       0.049163 
      1       0.056360 
      1       0.033918 
      1       -0.061054 
      1       -0.133198 
      1       -0.039072 
      1       0.052230 
      1       -0.015345 
      1       -0.094217 
      1       -0.048085 
      1       -0.014019 
      1       -0.041327 
      1       -0.009100 
      1       0.033475 
      1       -0.000993 
      1       -0.066449 
      1       -0.059239 
      1       0.033476 
      1       0.049186 
      1       -0.039997 
      1       -0.056080 
      1       0.024090 
      1       0.079212 
      1       0.044304 
      1       0.024510 
      1       0.047001 
      1       0.026708 
      1       -0.013033 
      1       -0.061150 
      1       -0.086983 
      1       -0.103702 
      1       -0.073541 
      1       -0.000200 
      1       0.048316 
      1       0.046864 
      1       0.000795 
      1       -0.080405 
      1       -0.127347 
      1       -0.139155 
      1       -0.133673 
      2       -0.117173 
      2       -0.109063 
      2       -0.153037 
      2       -0.154699 
      2       -0.065221 
      2       -0.039989 
      2       -0.091160 
      2       -0.070853 
      2       -0.002002 
      2       0.045672 
      2       0.036996 
      2       0.029961 
      2       -0.005586 
      2       -0.079370 
      2       -0.127913 
      2       -0.126931 
      2       -0.087094 
      2       -0.039169 
      2       -0.060652 
      2       -0.075560 
      2       -0.055781 
      2       -0.080016 
      2       -0.087192 
      2       -0.097913 
      2       -0.129208 
      2       -0.071617 
      2       0.026672 
      2       0.085444 
      2       0.110790 
      2       0.038613 
      2       -0.092030 
      2       -0.097440 
      2       0.017617 
      2       0.070574 
      2       0.068239 
      2       0.057609 
      2       0.038583 
      2       0.010504 
      2       -0.021411 
      2       -0.093187 
      2       -0.174259 
      2       -0.214244 
      2       -0.120710 
      2       0.003807 
      2       0.009552 
      2       -0.018880 
      2       -0.019611 
      2       0.019230 
      2       0.058068 
      3       0.060544 
      3       0.037833 
      3       -0.008359 
      3       -0.049881 
      3       -0.077861 
      3       -0.093500 
      3       -0.143133 
      3       -0.162587 
      3       -0.137843 
      3       -0.145414 
      3       -0.129636 
      3       -0.068536 
      3       0.008057 
      3       0.026204 
      3       0.029876 
      3       0.039018 
      3       0.004326 
      3       -0.008844 
      3       0.009251 
      3       0.056765 
      3       0.039246 
      3       -0.008562 
      3       -0.011120 
      3       0.023962 
      3       0.061067 
      3       0.045684 
      3       0.014308 
      3       -0.059658 
      3       -0.145811 
      3       -0.155177 
      3       -0.097618 
      3       -0.043522 
      3       0.012947 
      3       0.002884 
      3       -0.072792 
      3       -0.093509 
      3       -0.031238 
      3       -0.006202 
      3       -0.013102 
      3       -0.018463 
      3       -0.018091 
      3       -0.028734 
      3       -0.059324 
      3       -0.072213 
      3       -0.018965 
      3       0.015171 
      3       0.004150 
      3       -0.037357 
      3       -0.057612 
      3       -0.059472 
      3       -0.028032 
      3       0.022547 
      3       0.044765 
      3       0.000589 
      4       -0.059949 
      4       -0.114137 
      4       -0.079506 
      4       -0.028812 
      4       -0.012833 
      4       -0.014129 
      4       -0.026831 
      4       -0.079309 
      4       -0.109157 
      4       -0.056100 
      4       0.008692 
      4       0.059311 
      4       0.076768 
      4       0.058840 
      4       0.017746 
      4       -0.005788 
      4       -0.021899 
      4       -0.053474 
      4       -0.073029 
      4       -0.057570 
      4       -0.107671 
      4       -0.139728 
      4       -0.055463 
      4       0.036948 
      4       0.041528 
      4       0.032606 
      4       0.067881 
      4       0.097254 
      4       0.076000 
      4       0.003678 
      4       -0.021985 
      4       -0.016081 
      4       -0.024322 
      4       -0.071121 
      4       -0.078374 
      4       -0.001313 
      4       0.024887 
      4       0.001126 
      4       -0.001504 
      4       0.010404 
      4       0.013509 
      4       -0.001332 
      4       0.004040 
      4       -0.021723 
      4       -0.008197 
      4       0.078000 
      4       0.121032 
      5       0.115123 
      5       0.096008 
      5       0.107254 
      5       0.087737 
      5       0.012540 
      5       -0.069424 
      5       -0.084535 
      5       -0.092308 
      5       -0.099197 
      5       -0.080181 
      5       -0.038873 
      5       -0.015966 
      5       -0.009064 
      5       -0.010797 
      5       -0.018678 
      5       -0.053519 
      5       -0.079214 
      5       -0.095239 
      5       -0.151184 
      5       -0.186333 
      5       -0.181577 
      5       -0.172007 
      5       -0.159827 
      5       -0.099933 
      5       -0.059629 
      5       -0.050826 
      5       -0.070526 
      5       -0.078883 
      5       -0.062335 
      5       -0.089519 
      5       -0.176559 
      5       -0.142289 
      5       -0.049613 
      5       -0.045058 
      5       -0.063639 
      5       -0.029417 
      5       -0.036525 
      5       -0.118819 
      5       -0.146289 
      5       -0.144209 
      5       -0.150005 
      5       -0.152339 
      5       -0.129740 
      5       -0.115711 
      5       -0.060300 
      5       -0.031422 
      5       -0.009224 
      5       0.047590 
      5       0.032477 
      5       -0.016136 
      5       0.031453 
      5       0.099409 
      5       0.034170 
      5       -0.072279 
      5       -0.083015 
      5       -0.034400 
      5       0.002438 
      5       -0.034997 
      6       -0.093508 
      6       -0.132628 
      6       -0.107186 
      6       -0.038400 
      6       -0.002877 
      6       0.007799 
      6       0.022289 
      6       -0.042166 
      6       -0.093683 
      6       -0.061240 
      6       -0.062877 
      6       -0.034713 
      6       0.013036 
      6       0.004500 
      6       -0.082055 
      6       -0.201448 
      6       -0.191869 
      6       -0.103067 
      6       -0.042998 
      6       -0.005731 
      6       -0.029697 
      6       -0.090918 
      6       -0.090994 
      6       -0.020386 
      6       0.024110 
      6       0.019948 
      6       -0.051759 
      6       -0.156710 
      6       -0.169884 
      6       -0.057611 
      6       0.047048 
      6       0.026312 
      6       -0.056093 
      6       -0.063428 
      6       -0.079706 
      6       -0.069491 
      6       0.045182 
      6       0.164050 
      6       0.203785 
      6       0.196377 
      6       0.213133 
      6       0.238054 
      6       0.280142 
      6       0.319508 
      6       0.353222 
      7       0.493121 
      7       0.787996 
      7       1.070951 
      7       1.206350 
      7       1.308293 
      7       1.524806 
      7       1.836844 
      7       2.049276 
      7       2.119793 
      7       2.168216 
      7       2.209507 
      7       2.227973 
      7       2.269171 
      7       2.314491 
      7       2.347228 
      7       2.390751 
      7       2.429773 
      7       2.510532 
      7       2.645457 
      7       2.793394 
      7       2.943173 
      7       3.081185 
      7       3.177212 
      7       3.211265 
      7       3.219862 
      7       3.228833 
      7       3.268781 
      7       3.309979 
      7       3.333856 
      7       3.400123 
      7       3.495706 
      7       3.596066 
      7       3.705548 
      7       3.772714 
      7       3.859868 
      7       3.983012 
      8       4.083994 
      8       4.152090 
      8       4.237318 
      8       4.291981 
      8       4.268768 
      8       4.246428 
      8       4.312332 
      8       4.451340 
      8       4.623031 
      8       4.808608 
      8       4.961957 
      8       5.086141 
      8       5.177641 
      8       5.211237 
      8       5.218396 
      8       5.207919 
      8       5.132566 
      8       4.823873 
      8       4.209828 
      8       3.530579 
      8       2.942674 
      8       2.293488 
      8       1.649113 
      8       1.100692 
      8       0.587674 
      8       0.148200 
      8       -0.271084 
      8       -0.656625 
      8       -1.024753 
      8       -1.322314 
      8       -1.263274 
      8       -0.980681 
      8       -0.832371 
      9       -0.867776 
      9       -1.053891 
      9       -1.309167 
      9       -1.502949 
      9       -1.591629 
      9       -1.626761 
      9       -1.634789 
      9       -1.658211 
      9       -1.685926 
      9       -1.712644 
      9       -1.726038 
      9       -1.684479 
      9       -1.652946 
      9       -1.667523 
      9       -1.672528 
      9       -1.662545 
      9       -1.644934 
      9       -1.629922 
      9       -1.628484 
      9       -1.629922 
      9       -1.628484 
      9       -1.629949 
      9       -1.629370 
      9       -1.640721 
      9       -1.676878 
      10       -1.709711 
      10       -1.676878 
      10       -1.640734 
      10       -1.629814 
      10       -1.635348 
      10       -1.652681 
      10       -1.669817 
      10       -1.652681 
      10       -1.635322 
      10       -1.628927 
      10       -1.629936 
      10       -1.628484 
      10       -1.629936 
      10       -1.628927 
      10       -1.635322 
      10       -1.652681 
      10       -1.669817 
      10       -1.652681 
      10       -1.635335 
      10       -1.629384 
      10       -1.635765 
      10       -1.657664 
      10       -1.689488 
      10       -1.678747 
      10       -1.663049 
      10       -1.670690 
      10       -1.652708 
      10       -1.635322 
      10       -1.628927 
      10       -1.629936 
      10       -1.628484 
      10       -1.629922 
      10       -1.628484 
      10       -1.629922 
      10       -1.628484 
      10       -1.629922 
      10       -1.628484 
      10       -1.629936 
      10       -1.628927 
      10       -1.635335 
      10       -1.653138 
      10       -1.675673 
      11       -1.682734 
      11       -1.705269 
      11       -1.723071 
      11       -1.729452 
      11       -1.727584 
      11       -1.719124 
      11       -1.680090 
      11       -1.650147 
      11       -1.680533 
      11       -1.724497 
      11       -1.750908 
      11       -1.758965 
      11       -1.703400 
      11       -1.644735 
      11       -1.632139 
      11       -1.639322 
      11       -1.661534 
      11       -1.674601 
      11       -1.629037 
      11       -1.583502 
      11       -1.592005 
      11       -1.590774 
      11       -1.543760 
      11       -1.506642 
      11       -1.484833 
      11       -1.470996 
      11       -1.455700 
      11       -1.452380 
      11       -1.473652 
      11       -1.491420 
      11       -1.444001 
      12       -1.393765 
      12       -1.368591 
      12       -1.355478 
      12       -1.340473 
      12       -1.328492 
      12       -1.313783 
      12       -1.302096 
      12       -1.288515 
      12       -1.287279 
      12       -1.314709 
      12       -1.348621 
      12       -1.309374 
      12       -1.266624 
      12       -1.270757 
      12       -1.242084 
      12       -1.204874 
      12       -1.217575 
      12       -1.220115 
      12       -1.177232 
      12       -1.148686 
      12       -1.149067 
      12       -1.154102 
      12       -1.125583 
      12       -1.097142 
      12       -1.079866 
      12       -1.070917 
      12       -1.068610 
      12       -1.097405 
      12       -1.125488 
      12       -1.117303 
      12       -1.084450 
      12       -1.032713 
      12       -0.999868 
      12       -0.983539 
      12       -0.980007 
      12       -0.991887 
      12       -1.013474 
      12       -0.992705 
      12       -0.967238 
      12       -0.965143 
      13       -0.938115 
      13       -0.916428 
      13       -0.919543 
      13       -0.926886 
      13       -0.900640 
      13       -0.874448 
      13       -0.859373 
      13       -0.851778 
      13       -0.841823 
      13       -0.834842 
      13       -0.825495 
      13       -0.823570 
      13       -0.832520 
      13       -0.841159 
      13       -0.815784 
      13       -0.790440 
      13       -0.776205 
      13       -0.769442 
      13       -0.760350 
      13       -0.755447 
      13       -0.761214 
      13       -0.811706 
      13       -0.858599 
      13       -0.842036 
      13       -0.807442 
      13       -0.754992 
      13       -0.707522 
      13       -0.692019 
      13       -0.682823 
      14       -0.677393 
      14       -0.669194 
      14       -0.663926 
      14       -0.655863 
      14       -0.650728 
      14       -0.642797 
      14       -0.637793 
      14       -0.629991 
      14       -0.625129 
      14       -0.617879 
      14       -0.618044 
      14       -0.629488 
      14       -0.645476 
      14       -0.645161 
      14       -0.651180 
      14       -0.624222 
      14       -0.583430 
      14       -0.570444 
      14       -0.571891 
      14       -0.600722 
      14       -0.615174 
      14       -0.596991 
      14       -0.590200 
      14       -0.585119 
      14       -0.591326 
      14       -0.565804 
      14       -0.535383 
      14       -0.559260 
      15       -0.582485 
      15       -0.546978 
      15       -0.502864 
      15       -0.489446 
      15       -0.482277 
      15       -0.478852 
      15       -0.472639 
      15       -0.469337 
      15       -0.463219 
      15       -0.460011 
      15       -0.453987 
      15       -0.450871 
      15       -0.444939 
      15       -0.441913 
      15       -0.436070 
      15       -0.433134 
      15       -0.427404 
      15       -0.425406 
      15       -0.429566 
      15       -0.464753 
      15       -0.499162 
      15       -0.497240 
      15       -0.470588 
      15       -0.424989 
      15       -0.398208 
      15       -0.387483 
      15       -0.385432 
      15       -0.389541 
      15       -0.419821 
      15       -0.432015 
      15       -0.406453 
      15       -0.418767 
      15       -0.448317 
      15       -0.446465 
      15       -0.420320 
      15       -0.375649 
      15       -0.354269 
      16       -0.362567 
      16       -0.375466 
      16       -0.354734 
      16       -0.334001 
      16       -0.324331 
      16       -0.322086 
      16       -0.317428 
      16       -0.315677 
      16       -0.311096 
      16       -0.309383 
      16       -0.304014 
      16       -0.292585 
      16       -0.251016 
      16       -0.218849 
      16       -0.246317 
      16       -0.282498 
      16       -0.288061 
      16       -0.287456 
      16       -0.283184 
      16       -0.281776 
      16       -0.277534 
      16       -0.276183 
      16       -0.272024 
      16       -0.271578 
      16       -0.277251 
      16       -0.313123 
      16       -0.339648 
      16       -0.306595 
      17       -0.264885 
      17       -0.253861 
      17       -0.249486 
      17       -0.253734 
      17       -0.273727 
      17       -0.311883 
      17       -0.330444 
      17       -0.324070 
      17       -0.281773 
      17       -0.239473 
      17       -0.228677 
      17       -0.224540 
      17       -0.228599 
      17       -0.243498 
      17       -0.258028 
      17       -0.238483 
      17       -0.218912 
      17       -0.210393 
      17       -0.209287 
      17       -0.205757 
      17       -0.205124 
      17       -0.201649 
      17       -0.201056 
      17       -0.197622 
      17       -0.197083 
      17       -0.194113 
      17       -0.198502 
      17       -0.213703 
      17       -0.228531 
      17       -0.209281 
      17       -0.190002 
      17       -0.181772 
      18       -0.180953 
      18       -0.177706 
      18       -0.177353 
      18       -0.174155 
      18       -0.173838 
      18       -0.170675 
      18       -0.170393 
      18       -0.167265 
      18       -0.167029 
      18       -0.164360 
      18       -0.169047 
      18       -0.184543 
      18       -0.199662 
      18       -0.180701 
      18       -0.161708 
      18       -0.153760 
      18       -0.153221 
      18       -0.150252 
      18       -0.150186 
      18       -0.147686 
      18       -0.152540 
      18       -0.168200 
      18       -0.183482 
      18       -0.164683 
      18       -0.145851 
      18       -0.138062 
      18       -0.137680 
      18       -0.134866 
      18       -0.134941 
      18       -0.132167 
      18       -0.132270 
      18       -0.129549 
      18       -0.130516 
      18       -0.137200 
      19       -0.170404 
      19       -0.189146 
      19       -0.174785 
      19       -0.166897 
      19       -0.142945 
      19       -0.123891 
      19       -0.116309 
      19       -0.116157 
      19       -0.113984 
      19       -0.119174 
      19       -0.135169 
      19       -0.150781 
      19       -0.132309 
      19       -0.113800 
      19       -0.106332 
      19       -0.106267 
      19       -0.103767 
      19       -0.104153 
      19       -0.101688 
      19       -0.102095 
      19       -0.099650 
      19       -0.100077 
      20       -0.097653 
      20       -0.098100 
      20       -0.095695 
      20       -0.096162 
      20       -0.093777 
      20       -0.094263 
      20       -0.091896 
      20       -0.092401 
      20       -0.090053 
      20       -0.090577 
      20       -0.088247 
      20       -0.088788 
      20       -0.086476 
      20       -0.087036 
      20       -0.084741 
      20       -0.085318 
      20       -0.083041 
      20       -0.083634 
      20       -0.081374 
      20       -0.081984 
      20       -0.079740 
      20       -0.080367 
      20       -0.078140 
      20       -0.078795 
      20       -0.077022 
      20       -0.083021 
      20       -0.104709 
      20       -0.144142 
      20       -0.159887 
      20       -0.141102 
      20       -0.099210 
      20       -0.075700 
      20       -0.068174 
      20       -0.068478 
      21       -0.066356 
