Human trial picking the raspberry twin 

 time    ||     output     ||     loadcell

      0.000000       -798.115625       0.120000 
      0.030589       -798.115625       0.170000 
      0.060918       -798.115625       0.140000 
      0.092507       -798.115625       0.010000 
      0.124742       -798.115625       0.060000 
      0.155517       -798.115625       0.120000 
      0.186551       -798.115625       0.110000 
      0.216479       -798.115625       0.160000 
      0.248388       -798.115625       0.040000 
      0.278750       -798.115620       0.000000 
      0.309614       -798.114433       0.240000 
      0.340946       -798.007610       0.200000 
      0.372719       -794.470122       0.060000 
      0.403626       -751.374949       0.270000 
      0.434968       -558.238470       0.280000 
      0.466471       -239.817456       0.030000 
      0.497458       -46.683639       0.030000 
      0.528599       -3.598373       0.200000 
      0.559412       -0.098898       0.090000 
      0.589878       0.037881       0.070000 
      0.620774       0.086133       0.060000 
      0.652049       0.064638       0.320000 
      0.683004       0.051682       0.090000 
      0.714433       0.016634       0.010000 
      0.745148       0.019458       0.100000 
      0.776143       0.112992       0.300000 
      0.807716       0.141711       0.020000 
      0.839518       0.044015       0.060000 
      0.870643       -0.027620       0.040000 
      0.901013       0.010833       0.290000 
      0.932711       0.070091       0.050000 
      0.963274       0.087480       0.030000 
      0.994430       0.116233       0.190000 
      1.025219       0.156930       0.180000 
      1.056014       0.187035       0.190000 
      1.087236       0.137646       0.120000 
      1.118346       0.025310       0.140000 
      1.149170       -0.041171       0.060000 
      1.179851       -0.012312       0.240000 
      1.210726       0.095467       0.330000 
      1.241552       0.169606       0.050000 
      1.272629       0.109795       0.040000 
      1.303687       0.059423       0.070000 
      1.334697       0.068143       0.140000 
      1.365089       0.120353       0.140000 
      1.396232       0.122849       0.240000 
      1.427138       0.100174       0.140000 
      1.457612       0.115748       0.140000 
      1.489732       0.160181       0.070000 
      1.520954       0.207650       0.100000 
      1.552900       0.241728       0.030000 
      1.583735       0.213448       0.170000 
      1.614627       0.125217       0.210000 
      1.646481       0.079923       0.100000 
      1.676183       0.095134       0.000000 
      1.706957       0.073165       0.010000 
      1.738231       0.019858       0.070000 
      1.769500       -0.003049       0.080000 
      1.800816       0.019858       0.200000 
      1.831811       0.073152       0.020000 
      1.863725       0.094691       0.110000 
      1.895082       0.074498       0.290000 
      1.926439       0.100134       0.030000 
      1.957587       0.162796       0.070000 
      1.989356       0.170440       0.040000 
      2.020557       0.137773       0.130000 
      2.051591       0.173111       0.240000 
      2.081781       0.175366       0.120000 
      2.112999       0.082178       0.110000 
      2.144284       0.053056       0.110000 
      2.174925       0.080310       0.080000 
      2.206895       0.107300       0.010000 
      2.237354       0.119265       0.000000 
      2.269304       0.088905       0.020000 
      2.299808       0.063726       0.150000 
      2.330822       0.057511       0.290000 
      2.362158       0.047170       0.030000 
      2.392993       0.075920       0.120000 
      2.424581       0.080767       0.200000 
      2.455195       0.090318       0.070000 
      2.486126       0.184755       0.370000 
      2.517523       0.281609       0.060000 
      2.548611       0.284267       0.200000 
      2.579373       0.199593       0.140000 
      2.610723       0.080836       0.190000 
      2.642677       0.032456       0.120000 
      2.673860       0.061082       0.180000 
      2.704442       0.102291       0.000000 
      2.736365       0.117532       0.030000 
      2.767371       0.073554       0.180000 
      2.798897       0.001047       0.150000 
      2.829407       -0.024562       0.140000 
      2.860779       0.006402       0.060000 
      2.891696       0.033244       0.130000 
      2.921777       0.059283       0.110000 
      2.953006       0.078994       0.240000 
      2.984668       0.085292       0.130000 
      3.015516       0.101477       0.060000 
      3.047025       0.168695       0.220000 
      3.077426       0.264611       0.260000 
      3.108607       0.302251       0.320000 
      3.140862       0.312632       0.010000 
      3.172791       0.319734       0.010000 
      3.203884       0.289791       0.030000 
      3.235938       0.274081       0.340000 
      3.266459       0.300506       0.130000 
      3.296708       0.302734       0.210000 
      3.327676       0.283506       0.130000 
      3.358636       0.255629       0.060000 
      3.389424       0.224814       0.110000 
      3.420826       0.233687       0.100000 
      3.452290       0.246283       0.180000 
      3.483782       0.222932       0.120000 
      3.514428       0.240484       0.110000 
      3.545307       0.268571       0.240000 
      3.576759       0.257953       0.110000 
      3.607735       0.227361       0.060000 
      3.638898       0.176336       0.000000 
      3.669753       0.105061       0.260000 
      3.701744       0.101947       0.080000 
      3.731977       0.155226       0.040000 
      3.763198       0.202291       0.010000 
      3.794247       0.223374       0.040000 
      3.825309       0.203621       0.070000 
      3.856583       0.171464       0.240000 
      3.888102       0.175854       0.100000 
      3.919639       0.240484       0.300000 
      3.950828       0.315663       0.160000 
      3.982552       0.333228       0.180000 
      4.012470       0.263242       0.020000 
      4.044387       0.206405       0.040000 
      4.076302       0.209046       0.080000 
      4.106221       0.213959       0.050000 
      4.137138       0.165582       0.020000 
      4.168056       0.134187       0.140000 
      4.199970       0.176283       0.020000 
      4.230915       0.196489       0.030000 
      4.260807       0.173608       0.070000 
      4.291725       0.123889       0.220000 
      4.322603       0.123889       0.020000 
      4.353796       0.239528       0.000000 
      4.385563       0.290979       0.010000 
      4.416942       0.218475       0.230000 
      4.448738       0.161072       0.160000 
      4.480468       0.179476       0.050000 
      4.511407       0.190178       0.070000 
      4.542939       0.154398       0.180000 
      4.574717       0.168709       0.010000 
      4.605670       0.212174       0.280000 
      4.636585       0.204174       0.410000 
      4.668506       0.255270       0.120000 
      4.699386       0.365040       0.150000 
      4.729326       0.420632       0.280000 
      4.760253       0.428303       0.060000 
      4.790142       0.403580       0.230000 
      4.820607       0.365124       0.070000 
      4.851961       0.338643       0.020000 
      4.883840       0.325200       0.040000 
      4.914976       0.290665       0.000000 
      4.946644       0.279051       0.010000 
      4.977402       0.319331       0.270000 
      5.008950       0.319317       0.090000 
      5.040651       0.278580       0.050000 
      5.071365       0.284326       0.270000 
      5.102437       0.288405       0.040000 
      5.133759       0.227858       0.270000 
      5.164677       0.153069       0.010000 
      5.195621       0.135100       0.180000 
      5.227539       0.200560       0.040000 
      5.258459       0.243502       0.180000 
      5.288891       0.242243       0.330000 
      5.320802       0.248927       0.290000 
      5.351728       0.226087       0.220000 
      5.382644       0.191219       0.270000 
      5.412561       0.250744       0.530000 
      5.444470       0.363711       0.210000 
      5.476391       0.408921       0.230000 
      5.506347       0.368654       0.270000 
      5.538260       0.269541       0.310000 
      5.570142       0.206916       0.280000 
      5.599777       0.210417       0.290000 
      5.631513       0.231056       0.210000 
      5.662830       0.249455       0.090000 
      5.695098       0.309006       0.180000 
      5.726524       0.369540       0.080000 
      5.757148       0.380281       0.120000 
      5.789039       0.369527       0.080000 
      5.819798       0.308576       0.120000 
      5.850808       0.244498       0.130000 
      5.881845       0.212205       0.020000 
      5.912758       0.192933       0.220000 
      5.942900       0.200547       0.160000 
      5.974954       0.185292       0.120000 
      6.006049       0.179923       0.110000 
      6.036922       0.235058       0.120000 
      6.066746       0.286080       0.130000 
      6.097224       0.269138       0.150000 
      6.128168       0.199192       0.020000 
      6.158732       0.178192       0.750000 
      6.189912       0.221134       2.410000 
      6.220881       0.306388       1.820000 
      6.251868       0.366782       1.290000 
      6.282891       0.306348       5.570000 
      6.314646       0.240060       8.680000 
      6.345461       0.330156       12.330000 
      6.376921       0.408462       19.170000 
      6.407631       0.353041       28.000000 
      6.439345       0.333260       35.770000 
      6.470765       0.376681       53.340000 
      6.502212       0.337783       72.850000 
      6.534124       0.303719       98.890000 
      6.565038       0.323886       127.330000 
      6.595928       0.330171       155.950000 
      6.625882       0.411402       171.120000 
      6.657763       0.562756       208.560000 
      6.688720       0.657895       197.260000 
      6.719625       0.667756       218.760000 
      6.750543       0.695607       228.010000 
      6.781436       0.755212       219.780000 
      6.813348       0.808147       220.630000 
      6.844293       0.853938       226.990000 
      6.875215       0.881304       209.270000 
      6.906101       0.920884       205.800000 
      6.937017       1.088108       213.980000 
      6.968019       1.424409       238.470000 
      6.999149       1.733600       261.020000 
      7.030638       1.916775       290.100000 
      7.060825       2.183122       249.850000 
      7.091449       2.587919       60.510000 
      7.122888       2.878913       38.660000 
      7.154694       3.153928       31.550000 
      7.185200       3.516825       28.800000 
      7.215949       3.680624       18.520000 
      7.246532       3.674485       24.080000 
      7.277560       3.756946       15.880000 
      7.308331       3.826886       12.010000 
      7.339404       3.807275       12.760000 
      7.369860       3.771960       10.110000 
      7.399835       3.779353       11.360000 
      7.431273       3.881378       12.080000 
      7.463284       4.069912       12.160000 
      7.494405       3.929876       9.200000 
      7.525151       2.757573       9.160000 
      7.556276       1.169960       10.330000 
      7.587527       0.355486       11.020000 
      7.618831       0.032443       11.250000 
      7.650745       -0.336228       10.210000 
      7.681847       -0.783775       10.010000 
      7.712469       -1.110346       10.560000 
      7.742969       -1.249963       10.530000 
      7.774685       -1.232927       10.220000 
      7.806639       -1.180197       10.620000 
      7.837638       -1.162244       11.330000 
      7.869242       -1.140341       10.690000 
      7.900701       -1.122377       9.830000 
      7.932613       -1.132705       9.650000 
      7.964703       -1.193624       10.290000 
      7.995828       -1.259501       10.860000 
      8.026511       -1.228106       11.120000 
      8.056333       -1.156042       10.130000 
      8.088016       -1.123236       9.350000 
      8.119901       -1.126902       9.160000 
      8.150992       -1.164029       9.440000 
      8.181158       -1.195409       10.170000 
      8.212631       -1.164015       10.230000 
      8.243414       -1.126419       9.820000 
      8.274849       -1.116507       9.540000 
      8.304689       -1.115648       9.530000 
      8.336640       -1.115621       10.010000 
      8.368647       -1.115621       10.200000 
      8.400171       -1.115621       10.150000 
      8.431226       -1.115621       9.850000 
      8.462292       -1.115621       9.610000 
      8.493578       -1.115621       9.740000 
      8.525098       -1.115621       10.080000 
      8.556004       -1.115621       10.210000 
      8.586867       -1.115621       10.220000 
      8.618551       -1.115621       9.930000 
      8.648895       -1.115621       10.040000 
      8.679645       -1.115621       9.990000 
      8.710628       -1.115621       9.940000 
      8.742870       -1.115621       9.780000 
      8.773141       -1.115621       9.900000 
      8.804862       -1.115621       10.070000 
      8.836766       -1.115621       10.000000 
      8.867321       -1.115621       9.830000 
      8.898051       -1.115621       9.770000 
      8.929809       -1.115634       9.670000 
      8.959851       -1.116064       9.650000 
      9.006072       -1.121020       9.670000 
      9.036093       -1.139818       9.390000 
      9.082018       -1.155515       9.450000 
      9.112816       -1.139818       9.590000 
      9.143844       -1.121020       9.630000 
      9.189333       -1.116064       9.460000 
      9.220997       -1.115634       9.500000 
      9.250758       -1.115621       9.660000 
      9.282258       -1.115621       9.820000 
      9.312178       -1.115621       9.530000 
      9.344093       -1.115634       9.340000 
      9.375010       -1.116064       9.400000 
      9.405928       -1.121020       9.550000 
      9.437842       -1.139818       9.550000 
      9.468158       -1.155515       9.500000 
      9.498830       -1.139818       9.820000 
      9.529655       -1.121020       9.750000 
      9.561357       -1.116064       9.790000 
      9.592589       -1.115634       9.750000 
      9.624660       -1.115621       9.710000 
      9.655579       -1.115621       9.610000 
      9.686496       -1.115621       9.540000 
      9.717415       -1.115621       9.530000 
      9.749329       -1.115621       9.560000 
      9.779437       -1.115621       9.640000 
      9.810191       -1.115621       9.500000 
      9.840824       -1.115621       9.380000 
      9.871938       -1.115621       9.200000 
      9.902976       -1.115621       9.400000 
      9.934134       -1.115621       9.290000 
      9.964987       -1.115621       9.340000 
      9.995987       -1.115621       9.200000 
      10.027190       -1.115621       9.420000 
      10.058111       -1.115621       9.350000 
      10.090027       -1.115621       9.220000 
      10.120944       -1.115621       9.360000 
      10.151861       -1.115621       9.480000 
      10.182779       -1.115621       9.310000 
      10.213729       -1.115621       9.310000 
      10.244619       -1.115621       9.280000 
      10.276350       -1.115621       9.500000 
      10.306843       -1.115621       9.470000 
      10.337994       -1.115621       9.340000 
      10.369156       -1.115621       9.630000 
      10.399807       -1.115621       9.460000 
      10.431696       -1.115621       9.600000 
      10.462793       -1.115621       9.680000 
      10.494652       -1.115621       9.440000 
      10.525925       -1.115621       9.670000 
      10.557844       -1.115621       9.560000 
      10.588761       -1.115621       9.470000 
      10.619681       -1.115621       9.660000 
      10.651594       -1.115621       10.310000 
      10.682512       -1.115621       10.310000 
      10.713432       -1.115621       9.720000 
      10.743843       -1.115621       9.570000 
      10.774837       -1.115621       9.120000 
      10.805529       -1.115621       9.250000 
      10.836189       -1.115621       9.270000 
      10.867392       -1.115621       9.610000 
      10.897203       -1.115621       9.740000 
      10.928732       -1.115621       9.660000 
      10.960490       -1.115621       9.520000 
      10.992682       -1.115621       8.820000 
      11.038661       -1.115621       8.660000 
      11.069721       -1.115621       8.840000 
      11.100315       -1.115621       10.230000 
      11.132068       -1.115621       10.450000 
      11.163983       -1.115621       10.210000 
      11.194898       -1.115621       9.180000 
      11.225830       -1.115621       8.980000 
      11.256734       -1.115621       8.860000 
      11.288817       -1.115621       9.000000 
      11.319584       -1.115621       9.340000 
      11.351542       -1.115621       10.120000 
      11.381719       -1.115621       10.600000 
      11.412047       -1.115621       10.320000 
      11.443983       -1.115621       9.560000 
      11.474722       -1.115621       8.840000 
      11.505639       -1.115621       8.610000 
      11.537554       -1.115621       9.180000 
      11.568471       -1.115621       9.530000 
      11.599939       -1.115621       9.650000 
      11.631453       -1.115621       9.340000 
      11.661046       -1.115621       9.580000 
      11.691792       -1.115621       8.850000 
      11.722958       -1.115621       8.630000 
      11.754056       -1.115621       8.630000 
      11.784656       -1.115621       8.630000 
      11.815100       -1.115621       8.950000 
      11.846907       -1.115621       9.030000 
      11.878031       -1.115621       9.240000 
      11.909946       -1.115621       9.280000 
      11.940862       -1.115621       9.250000 
      11.987739       -1.115621       8.910000 
      12.018656       -1.115621       9.110000 
      12.050539       -1.115621       8.990000 
      12.080746       -1.115621       9.550000 
      12.111884       -1.115621       9.360000 
      12.142840       -1.115621       9.560000 
      12.174628       -1.115621       9.510000 
      12.204669       -1.115621       9.330000 
      12.234760       -1.115621       9.350000 
      12.266131       -1.115621       9.170000 
      12.297100       -1.115621       9.460000 
      12.327220       -1.115621       9.390000 
      12.358999       -1.115621       9.660000 
      12.389882       -1.115621       9.380000 
      12.420800       -1.115621       9.520000 
      12.452715       -1.115621       9.280000 
      12.483632       -1.115621       9.120000 
      12.515547       -1.115621       8.860000 
      12.546464       -1.115621       8.850000 
      12.577190       -1.115621       9.100000 
      12.608268       -1.115621       9.060000 
      12.639456       -1.115621       9.040000 
      12.670983       -1.115621       9.190000 
      12.701844       -1.115621       9.260000 
      12.733116       -1.115621       8.980000 
      12.764341       -1.115621       9.230000 
      12.796073       -1.115621       9.140000 
      12.826700       -1.115621       9.200000 
      12.857653       -1.115621       9.350000 
      12.888469       -1.115621       9.350000 
      12.919383       -1.115621       9.460000 
      12.950876       -1.115621       9.280000 
      12.982745       -1.115621       9.250000 
      13.013661       -1.115607       9.250000 
      13.044580       -1.115178       9.420000 
      13.076494       -1.110222       9.390000 
      13.107412       -1.091424       9.270000 
      13.138478       -1.075727       9.320000 
      13.169341       -1.091424       9.320000 
      13.200683       -1.110222       9.070000 
      13.232659       -1.115177       9.100000 
      13.263766       -1.115594       8.910000 
      13.294709       -1.115177       9.030000 
      13.326146       -1.110222       9.130000 
      13.357798       -1.091424       8.760000 
      13.389568       -1.075727       9.120000 
      13.420638       -1.091424       8.730000 
      13.450840       -1.110222       9.140000 
      13.481277       -1.115178       9.220000 
      13.512668       -1.115607       9.230000 
      13.544199       -1.115621       9.180000 
      13.574872       -1.115621       9.120000 
      13.605743       -1.115621       9.220000 
      13.637137       -1.115621       9.220000 
      13.667186       -1.115621       9.150000 
      13.698172       -1.115621       9.170000 
      13.729477       -1.115621       9.140000 
      13.761387       -1.115621       9.170000 
      13.792307       -1.115621       9.290000 
      13.824219       -1.115621       9.300000 
      13.855137       -1.115621       9.270000 
      13.886349       -1.115621       9.360000 
      13.918580       -1.115621       9.000000 
      13.950361       -1.115621       9.090000 
      13.981685       -1.115621       9.180000 
      14.012602       -1.115621       9.360000 
      14.043737       -1.115621       8.880000 
      14.074908       -1.115621       9.090000 
      14.105675       -1.115621       9.090000 
      14.137302       -1.115621       9.330000 
      14.168073       -1.115621       9.200000 
      14.198761       -1.115621       9.150000 
      14.229717       -1.115621       9.030000 
      14.260719       -1.115621       9.120000 
      14.292595       -1.115621       9.150000 
      14.323986       -1.115621       9.310000 
      14.356113       -1.115621       9.280000 
      14.387667       -1.115621       9.280000 
      14.417816       -1.115621       9.280000 
      14.449816       -1.115621       9.440000 
      14.481055       -1.115621       9.410000 
      14.512292       -1.115621       9.540000 
      14.543582       -1.115621       9.290000 
      14.573649       -1.115621       9.100000 
      14.604735       -1.115621       9.010000 
      14.635988       -1.115621       9.400000 
      14.667234       -1.115621       9.290000 
      14.698773       -1.115621       9.230000 
      14.729851       -1.115621       9.100000 
      14.761055       -1.115621       9.140000 
      14.791546       -1.115621       8.860000 
      14.823132       -1.115621       8.740000 
      14.869665       -1.115621       8.880000 
      14.900827       -1.115621       9.040000 
      14.932512       -1.115621       8.920000 
      14.962974       -1.115621       9.130000 
      14.994056       -1.115621       9.220000 
      15.025737       -1.115621       8.920000 
      15.057251       -1.115621       9.090000 
      15.089316       -1.115621       9.150000 
      15.120066       -1.115621       9.180000 
      15.151995       -1.115621       9.170000 
      15.183910       -1.115621       9.210000 
      15.213833       -1.115621       9.580000 
      15.243750       -1.115621       9.330000 
      15.273673       -1.115607       9.270000 
      15.305556       -1.115178       9.480000 
      15.336499       -1.110222       9.270000 
      15.367419       -1.091424       9.180000 
      15.397311       -1.075727       9.250000 
      15.429257       -1.091424       9.120000 
      15.460176       -1.110222       9.290000 
      15.491059       -1.115178       9.250000 
      15.522013       -1.115607       9.090000 
      15.552927       -1.115607       9.210000 
      15.584987       -1.115178       9.270000 
      15.615755       -1.110222       8.810000 
      15.646737       -1.091424       9.100000 
      15.678616       -1.075726       8.940000 
      15.709260       -1.091410       8.990000 
      15.740980       -1.109778       8.970000 
      15.772263       -1.109778       8.970000 
      15.802641       -1.091410       9.210000 
      15.833308       -1.075726       9.120000 
      15.864592       -1.091424       9.020000 
      15.895587       -1.110222       9.020000 
      15.926234       -1.115178       9.290000 
      15.958214       -1.115607       9.440000 
      15.989747       -1.115621       9.120000 
      16.020977       -1.115621       9.470000 
      16.051710       -1.115621       9.370000 
      16.082837       -1.115621       9.060000 
      16.114411       -1.115621       9.480000 
      16.145455       -1.115621       9.310000 
      16.176766       -1.115621       9.220000 
      16.208754       -1.115621       9.420000 
      16.240170       -1.115621       9.280000 
      16.270860       -1.115621       9.240000 
      16.302132       -1.115621       9.390000 
      16.333447       -1.115621       9.100000 
      16.364172       -1.115621       9.210000 
      16.395272       -1.115621       9.140000 
      16.427220       -1.115621       9.010000 
      16.457873       -1.115621       8.880000 
      16.488986       -1.115621       9.120000 
      16.519914       -1.115621       8.970000 
      16.550833       -1.115621       9.070000 
      16.582753       -1.115621       9.070000 
      16.612667       -1.115621       9.010000 
      16.644587       -1.115621       9.170000 
      16.675503       -1.115621       9.160000 
      16.705991       -1.115621       9.210000 
      16.737906       -1.115621       8.930000 
      16.769790       -1.115621       9.260000 
      16.799711       -1.115621       9.240000 
      16.831652       -1.115621       9.330000 
      16.863575       -1.115621       9.050000 
      16.893486       -1.115621       8.890000 
      16.923413       -1.115621       9.260000 
      16.954644       -1.115621       9.050000 
      16.985750       -1.115621       9.190000 
      17.016666       -1.115607       9.160000 
      17.048762       -1.115178       9.180000 
      17.080714       -1.110222       9.360000 
      17.112833       -1.091424       9.090000 
      17.144056       -1.075727       9.060000 
      17.175470       -1.091424       9.060000 
      17.206256       -1.110222       9.470000 
      17.237512       -1.115178       9.220000 
      17.268582       -1.115607       9.200000 
      17.300750       -1.115620       9.260000 
      17.331414       -1.115607       8.990000 
      17.362793       -1.115178       9.360000 
      17.394199       -1.110221       9.130000 
      17.425298       -1.091410       9.100000 
      17.457028       -1.075283       9.070000 
      17.488451       -1.086025       8.910000 
      17.519390       -1.086025       9.240000 
      17.550857       -1.075283       9.300000 
      17.581712       -1.091410       8.930000 
      17.612602       -1.110208       9.150000 
      17.642475       -1.114734       9.180000 
      17.674144       -1.110208       8.950000 
      17.704980       -1.091424       9.260000 
      17.735755       -1.075727       9.180000 
      17.766331       -1.091424       9.130000 
      17.796898       -1.110222       9.170000 
      17.828857       -1.115178       9.210000 
      17.859481       -1.115607       9.110000 
      17.889713       -1.115620       8.970000 
      17.920390       -1.115607       8.950000 
      17.952543       -1.115164       9.150000 
      17.983777       -1.109778       9.120000 
      18.014621       -1.086025       9.200000 
      18.046572       -1.051529       9.090000 
      18.077453       -1.051529       8.990000 
      18.109100       -1.086024       9.300000 
      18.139852       -1.109765       8.900000 
      18.170958       -1.114721       9.170000 
      18.202396       -1.110208       9.190000 
      18.233361       -1.091410       9.070000 
      18.264876       -1.075283       9.250000 
      18.310125       -1.086025       9.240000 
      18.341439       -1.086025       9.230000 
      18.372888       -1.075283       9.170000 
      18.404372       -1.091410       9.140000 
      18.435732       -1.110221       9.300000 
      18.466727       -1.115178       9.140000 
      18.498610       -1.115607       9.220000 
      18.529214       -1.115621       8.990000 
      18.559742       -1.115621       9.120000 
      18.590993       -1.115621       9.280000 
      18.622250       -1.115621       9.140000 
      18.653178       -1.115607       9.180000 
      18.683243       -1.115177       8.970000 
      18.714557       -1.110208       9.170000 
      18.745730       -1.090980       9.100000 
      18.776857       -1.070327       9.070000 
      18.808488       -1.067213       8.930000 
      18.839273       -1.069884       9.150000 
      18.870812       -1.085581       8.950000 
      18.901566       -1.085998       8.800000 
      18.932534       -1.074840       9.040000 
      18.963089       -1.086011       9.340000 
      18.994182       -1.085998       9.050000 
      19.024491       -1.074397       9.050000 
      19.054448       -1.080598       9.010000 
      19.085587       -1.061357       9.190000 
      19.116119       -1.029103       9.300000 
      19.147115       -1.032205       9.170000 
      19.178664       -1.016091       9.000000 
      19.209108       -1.005323       9.020000 
      19.239662       -1.036704       9.000000 
      19.270676       -1.053230       9.060000 
      19.301805       -1.036287       9.160000 
      19.332686       -1.000797       9.070000 
      19.363982       -1.002235       8.890000 
      19.395546       -1.034875       8.920000 
      19.426916       -1.055528       9.070000 
      19.458841       -1.045204       9.070000 
      19.489352       -1.045217       8.730000 
      19.520905       -1.055958       8.950000 
      19.552707       -1.039845       9.000000 
      19.584543       -1.021476       9.080000 
      19.614368       -1.021893       9.040000 
      19.645132       -1.044774       8.920000 
      19.676005       -1.073883       8.960000 
      19.707553       -1.050559       8.830000 
      19.738940       -0.986525       9.130000 
      19.769806       -0.981569       8.950000 
      19.800971       -1.026376       9.010000 
      19.832374       -1.034003       9.070000 
      19.863028       -1.021020       9.130000 
      19.893977       -1.021893       8.840000 
      19.924947       -1.045230       8.930000 
      19.955631       -1.079712       9.350000 
      19.986286       -1.079712       9.050000 
      20.016884       -1.045217       9.160000 
      20.048167       -1.021436       9.120000 
      20.078284       -1.015191       9.320000 
      20.108857       -1.004850       8.900000 
      20.139851       -0.967683       9.060000 
      20.170915       -0.941648       9.080000 
      20.200857       -0.995950       9.000000 
      20.232259       -1.058559       9.180000 
      20.262850       -1.035844       8.970000 
      20.293442       -0.990055       9.230000 
      20.324428       -1.018805       9.090000 
      20.355996       -1.059072       8.820000 
      20.387558       -1.084225       8.980000 
      20.418202       -1.079672       8.890000 
      20.449515       -1.039374       9.000000 
      20.481463       -0.991410       8.860000 
      20.511951       -0.946117       9.050000 
      20.542748       -0.921061       9.070000 
      20.575059       -0.911149       9.060000 
      20.606593       -0.897736       8.950000 
      20.653457       -0.911178       8.600000 
      20.684977       -0.985541       9.060000 
      20.716658       -1.043374       8.950000 
      20.747865       -1.028120       9.110000 
      20.779041       -0.972585       9.070000 
      20.811256       -0.935832       9.110000 
      20.842052       -0.961854       9.110000 
      20.873030       -0.981082       9.030000 
      20.904575       -0.980683       9.160000 
      20.935468       -1.021006       9.040000 
      20.967575       -1.074756       9.150000 
      20.999823       -1.084668       9.080000 
      21.031612       -1.069387       9.040000 
