Human trial picking the raspberry twin 

 time    ||     output     ||     loadcell

      0.000000       -797.347692       0.020000 
      0.015509       -797.347692       0.090000 
      0.031007       -797.347692       0.060000 
      0.047126       -797.347692       0.010000 
      0.062718       -797.347692       0.210000 
      0.078671       -797.347692       0.080000 
      0.092812       -797.347692       0.060000 
      0.109514       -797.347692       0.170000 
      0.125065       -797.347692       0.110000 
      0.139833       -797.347687       0.090000 
      0.156614       -797.346502       0.090000 
      0.170661       -797.239786       0.060000 
      0.186592       -793.705857       0.060000 
      0.202664       -750.654333       0.040000 
      0.218450       -557.717232       0.040000 
      0.232641       -239.643666       0.010000 
      0.248430       -46.752245       0.050000 
      0.264400       -3.713721       0.060000 
      0.279707       -0.189690       0.060000 
      0.295385       -0.108014       0.030000 
      0.309986       -0.088057       0.040000 
      0.325824       -0.043219       0.020000 
      0.341591       -0.058500       0.010000 
      0.356831       -0.101921       0.130000 
      0.371733       -0.093868       0.100000 
      0.387420       -0.077301       0.010000 
      0.403536       -0.135546       0.000000 
      0.418732       -0.152060       0.010000 
      0.433440       -0.041956       0.060000 
      0.448822       0.019556       0.070000 
      0.464859       -0.026716       0.090000 
      0.481252       -0.088868       0.010000 
      0.495727       -0.134248       0.020000 
      0.509930       -0.122883       0.040000 
      0.524725       -0.107348       0.130000 
      0.540483       -0.032324       0.030000 
      0.555197       0.076801       0.160000 
      0.571804       0.119130       0.110000 
      0.585972       0.113205       0.070000 
      0.602554       0.060839       0.110000 
      0.618204       -0.031436       0.120000 
      0.632278       0.005721       0.150000 
      0.648978       0.131644       0.110000 
      0.664190       0.189849       0.100000 
      0.679873       0.128503       0.030000 
      0.694170       -0.013148       0.040000 
      0.710080       -0.048919       0.010000 
      0.725316       -0.011406       0.010000 
      0.741710       -0.000556       0.060000 
      0.757019       -0.007363       0.020000 
      0.772590       -0.041403       0.110000 
      0.788214       -0.052574       0.150000 
      0.802974       -0.007364       0.010000 
      0.818881       0.010575       0.090000 
      0.834889       -0.023907       0.040000 
      0.851910       -0.065183       0.140000 
      0.867584       -0.076771       0.110000 
      0.881776       -0.028917       0.010000 
      0.896585       0.001175       0.010000 
      0.912379       -0.055802       0.010000 
      0.928149       -0.132792       0.010000 
      0.943792       -0.160629       0.020000 
      0.957885       -0.066459       0.050000 
      0.974116       0.045540       0.020000 
      0.989336       0.065254       0.050000 
      1.005910       0.049214       0.040000 
      1.021696       0.085438       0.010000 
      1.036875       0.147837       0.130000 
      1.051758       0.120377       0.060000 
      1.068213       0.078421       0.030000 
      1.083362       0.096610       0.060000 
      1.098675       0.107487       0.010000 
      1.114696       0.054983       0.100000 
      1.129801       0.009760       0.010000 
      1.146049       -0.010933       0.040000 
      1.161539       0.010699       0.030000 
      1.176557       0.047286       0.040000 
      1.193645       0.008887       0.010000 
      1.209170       -0.013591       0.020000 
      1.224109       0.065338       0.060000 
      1.239718       0.108693       0.060000 
      1.256345       0.100828       0.010000 
      1.270864       0.067833       0.030000 
      1.286153       0.023781       0.030000 
      1.301468       0.024365       0.150000 
      1.316597       0.030882       0.070000 
      1.332443       -0.037901       0.010000 
      1.347634       -0.066778       0.040000 
      1.363692       -0.080922       0.060000 
      1.378829       -0.015656       0.030000 
      1.394970       0.130622       0.010000 
      1.409418       0.218602       0.040000 
      1.426005       0.187625       0.030000 
      1.441056       0.098021       0.060000 
      1.457014       -0.005480       0.030000 
      1.471841       -0.051150       0.000000 
      1.487922       -0.023905       0.090000 
      1.502410       0.016930       0.010000 
      1.517882       0.093951       0.050000 
      1.533074       0.136529       0.140000 
      1.550042       0.054929       0.030000 
      1.564054       -0.021122       0.080000 
      1.580965       -0.032020       0.050000 
      1.595961       -0.049419       0.020000 
      1.610006       -0.063314       0.010000 
      1.625648       0.016833       0.070000 
      1.641790       0.066569       0.010000 
      1.656748       0.007474       0.050000 
      1.670439       -0.049473       0.030000 
      1.687228       -0.104594       0.060000 
      1.703148       -0.092884       0.000000 
      1.719109       0.002962       0.040000 
      1.733720       0.030285       0.100000 
      1.750771       -0.001935       0.070000 
      1.765003       0.016877       0.030000 
      1.781421       0.070179       0.030000 
      1.797397       0.032558       0.010000 
      1.812909       -0.062845       0.010000 
      1.828042       -0.058871       0.020000 
      1.843982       -0.001468       0.040000 
      1.859843       0.048698       0.010000 
      1.875584       0.083237       0.050000 
      1.890546       0.055869       0.050000 
      1.905535       0.044768       0.020000 
      1.921494       0.083197       0.050000 
      1.937368       0.144683       0.010000 
      1.952037       0.169253       0.040000 
      1.968518       0.092622       0.000000 
      1.983724       -0.011763       0.050000 
      1.998811       -0.017608       0.020000 
      2.014417       -0.006911       0.030000 
      2.029739       -0.082156       0.020000 
      2.043699       -0.111292       0.050000 
      2.058659       -0.036477       0.050000 
      2.073619       0.006062       0.010000 
      2.089950       -0.008623       0.030000 
      2.104490       0.001579       0.010000 
      2.119505       0.014229       0.010000 
      2.136465       -0.008679       0.030000 
      2.150502       0.014246       0.030000 
      2.166758       0.065684       0.020000 
      2.182714       0.085477       0.100000 
      2.198676       0.046416       0.020000 
      2.213963       -0.012679       0.080000 
      2.230059       -0.046748       0.070000 
      2.245836       -0.070099       0.030000 
      2.261123       -0.071827       0.000000 
      2.276734       -0.005083       0.000000 
      2.291982       0.038732       0.020000 
      2.308604       -0.019391       0.050000 
      2.323671       -0.015891       0.060000 
      2.339866       0.000260       0.040000 
      2.355396       -0.123879       0.010000 
      2.370988       -0.167686       0.050000 
      2.385223       -0.056727       0.020000 
      2.415855       0.044210       0.050000 
      2.432329       0.039258       0.070000 
      2.449229       -0.017206       0.160000 
      2.463981       -0.053916       0.160000 
      2.479540       -0.027947       0.020000 
      2.495972       0.055438       0.080000 
      2.510685       0.064767       0.040000 
      2.525958       -0.031061       0.080000 
      2.540863       -0.081294       0.020000 
      2.555892       -0.013622       0.020000 
      2.571280       0.004729       0.070000 
      2.586955       -0.111349       0.010000 
      2.602211       -0.188756       0.120000 
      2.617769       -0.096165       0.080000 
      2.632747       0.022755       0.080000 
      2.648118       0.045943       0.040000 
      2.663886       0.046069       0.100000 
      2.679757       0.022166       0.040000 
      2.695556       0.065890       0.060000 
      2.711461       0.125206       0.000000 
      2.726181       0.048392       0.020000 
      2.741336       -0.046756       0.030000 
      2.756760       0.018370       0.020000 
      2.771957       0.134273       0.090000 
      2.787524       0.211073       0.100000 
      2.803402       0.218967       0.120000 
      2.820330       0.196235       0.030000 
      2.835050       0.141044       0.060000 
      2.850876       0.052782       0.020000 
      2.866449       -0.030121       0.060000 
      2.881757       -0.056643       0.080000 
      2.898116       -0.026994       0.010000 
      2.913351       -0.015008       0.070000 
      2.928620       -0.044947       0.080000 
      2.944112       -0.067881       0.050000 
      2.959177       -0.003281       0.090000 
      2.973906       0.034728       0.010000 
      2.990067       -0.047688       0.080000 
      3.004555       -0.130104       0.060000 
      3.020902       -0.092095       0.120000 
      3.036256       -0.027468       0.080000 
      3.051819       -0.049543       0.020000 
      3.067747       -0.069543       0.030000 
      3.083211       -0.019061       0.040000 
      3.099102       0.053210       0.010000 
      3.115231       0.048671       0.080000 
      3.129837       0.027671       0.010000 
      3.146415       0.005207       0.070000 
      3.160732       0.001233       0.080000 
      3.175925       0.061671       0.010000 
      3.192024       0.069294       0.090000 
      3.208939       -0.022981       0.070000 
      3.223639       -0.111734       0.060000 
      3.239860       -0.080770       0.020000 
      3.255947       0.075137       0.030000 
      3.271125       0.149539       0.080000 
      3.287941       0.066211       0.040000 
      3.303432       0.021878       0.050000 
      3.318332       0.106588       0.120000 
      3.333478       0.204675       0.040000 
      3.363249       0.166600       0.010000 
      3.379155       0.084180       0.030000 
      3.395543       0.080093       0.060000 
      3.410297       0.024086       0.050000 
      3.425438       -0.027809       0.000000 
      3.440660       0.045558       0.050000 
      3.456558       0.111031       0.030000 
      3.472584       0.128973       0.040000 
      3.487742       0.137889       0.040000 
      3.503224       0.100719       0.040000 
      3.518606       0.057698       0.010000 
      3.533659       0.028102       0.020000 
      3.548172       0.001244       0.060000 
      3.565269       -0.024322       0.040000 
      3.578973       -0.039976       0.050000 
      3.593949       0.047373       0.020000 
      3.609376       0.189436       0.050000 
      3.623569       0.205949       0.040000 
      3.640490       0.077867       0.080000 
      3.654583       -0.061556       0.020000 
      3.670991       -0.089287       0.040000 
      3.686058       -0.081326       0.000000 
      3.701341       -0.083472       0.020000 
      3.716478       -0.052644       0.030000 
      3.733268       -0.031105       0.040000 
      3.748645       -0.028833       0.070000 
      3.764396       0.021816       0.010000 
      3.780028       0.052295       0.060000 
      3.795390       0.018730       0.050000 
      3.811321       0.040299       0.030000 
      3.825681       0.171499       0.020000 
      3.842100       0.288536       0.080000 
      3.857779       0.270528       0.040000 
      3.872977       0.142898       0.010000 
      3.888752       -0.019862       0.080000 
      3.903797       -0.083374       0.030000 
      3.918953       -0.027076       0.040000 
      3.933955       0.031698       0.060000 
      3.949706       0.024447       0.030000 
      3.965158       0.003005       0.020000 
      3.981969       -0.022135       0.090000 
      3.996725       -0.035964       0.040000 
      4.012591       -0.011846       0.080000 
      4.027918       0.044697       0.040000 
      4.042075       0.064740       0.120000 
      4.058650       -0.021220       0.070000 
      4.073249       -0.108635       0.020000 
      4.089858       -0.085341       0.010000 
      4.104450       -0.093441       0.040000 
      4.120218       -0.152533       0.050000 
      4.136881       -0.153928       0.110000 
      4.151363       -0.092968       0.020000 
      4.167383       -0.014066       0.060000 
      4.183067       0.010977       0.010000 
      4.198742       -0.013149       0.010000 
      4.213676       -0.017636       0.010000 
      4.229548       -0.006478       0.050000 
      4.245494       -0.013566       0.090000 
      4.259980       -0.004706       0.030000 
      4.290831       -0.016267       0.060000 
      4.307872       -0.083554       0.000000 
      4.323428       -0.097756       0.100000 
      4.338892       -0.036959       0.050000 
      4.354125       0.072065       0.050000 
      4.370911       0.152589       0.060000 
      4.385837       0.148655       0.040000 
      4.401026       0.041487       0.010000 
      4.415560       -0.094212       0.070000 
      4.432553       -0.139049       0.090000 
      4.447760       -0.070488       0.090000 
      4.464926       0.016874       0.060000 
      4.479491       0.075166       0.010000 
      4.494977       0.116376       0.080000 
      4.510325       0.122245       0.030000 
      4.526522       0.111934       0.040000 
      4.542929       0.127228       0.100000 
      4.558198       0.136517       0.020000 
      4.573164       0.107517       0.050000 
      4.588732       0.079584       0.040000 
      4.602962       0.059106       0.040000 
      4.618947       -0.018133       0.020000 
      4.635592       -0.063190       0.040000 
      4.651601       -0.012762       0.040000 
      4.666464       0.082806       0.010000 
      4.681641       0.112306       0.000000 
      4.697851       0.085894       0.040000 
      4.713231       0.004348       0.050000 
      4.728746       -0.066874       0.010000 
      4.744225       -0.037748       0.000000 
      4.759911       0.031216       0.040000 
      4.776035       0.114657       0.070000 
      4.791040       0.146319       0.030000 
      4.806763       0.091376       0.010000 
      4.821931       0.061241       0.040000 
      4.837661       0.060382       0.060000 
      4.852698       0.014646       0.010000 
      4.868655       0.003018       0.000000 
      4.884700       -0.011863       0.060000 
      4.900810       -0.058376       0.080000 
      4.916069       -0.065626       0.030000 
      4.932008       -0.047648       0.010000 
      4.948067       -0.028460       0.030000 
      4.963321       -0.022092       0.040000 
      4.978725       -0.025763       0.010000 
      4.993057       -0.034205       0.060000 
      5.009949       -0.073213       0.030000 
      5.025478       -0.036447       0.040000 
      5.041369       0.032504       0.050000 
      5.056767       0.041955       0.000000 
      5.071985       0.007904       0.050000 
      5.087484       -0.085783       0.020000 
      5.102746       -0.129151       0.090000 
      5.118368       -0.040972       0.050000 
      5.133563       0.074236       0.000000 
      5.149155       0.098420       0.040000 
      5.164134       0.028088       0.010000 
      5.180189       -0.040003       0.070000 
      5.196797       -0.005951       0.070000 
      5.210760       0.080509       0.050000 
      5.227674       0.098446       0.010000 
      5.243689       0.022635       0.020000 
      5.258135       -0.066428       0.030000 
      5.274551       -0.073203       0.030000 
      5.289745       -0.067387       0.100000 
      5.304554       -0.097353       0.010000 
      5.320105       0.016877       0.010000 
      5.336452       0.165625       0.030000 
      5.352314       0.131116       0.000000 
      5.367931       0.024118       0.040000 
      5.382732       -0.036959       0.040000 
      5.398748       -0.049822       0.000000 
      5.414749       -0.062471       0.010000 
      5.429415       -0.036890       0.040000 
      5.444793       0.016363       0.030000 
      5.459764       0.033885       0.010000 
      5.476227       -0.013219       0.010000 
      5.491933       -0.106367       0.030000 
      5.506712       -0.150760       0.030000 
      5.521878       -0.119380       0.130000 
      5.537082       -0.069227       0.080000 
      5.552660       -0.009136       0.050000 
      5.569114       0.005605       0.020000 
      5.584142       -0.041860       0.070000 
      5.599945       -0.071412       0.020000 
      5.614181       -0.028877       0.080000 
      5.629248       -0.002854       0.000000 
      5.645474       -0.062928       0.030000 
      5.661272       -0.089753       0.020000 
      5.676979       -0.022591       0.020000 
      5.691623       0.050926       0.060000 
      5.707958       0.045584       0.030000 
      5.723313       0.012861       0.030000 
      5.738799       0.016072       0.020000 
      5.753803       0.067553       0.030000 
      5.768980       0.172012       0.040000 
      5.783979       0.246357       0.040000 
      5.798731       0.214989       0.070000 
      5.814929       0.069369       0.060000 
      5.829497       -0.026493       0.040000 
      5.844993       0.015989       0.050000 
      5.861303       0.040668       0.040000 
      5.891076       0.029886       0.050000 
      5.907785       0.019991       0.010000 
      5.923660       -0.009552       0.010000 
      5.939813       -0.001898       0.060000 
      5.954922       -0.005578       0.020000 
      5.971224       -0.017995       0.030000 
      6.000640       0.046859       0.020000 
      6.016974       0.096165       0.040000 
      6.032309       0.047341       0.050000 
      6.048766       -0.031601       0.020000 
      6.063764       -0.135937       0.050000 
      6.080668       -0.201453       0.080000 
      6.095366       -0.187458       0.110000 
      6.110141       -0.140559       0.010000 
      6.126653       -0.060592       0.010000 
      6.140920       -0.029912       0.040000 
      6.157754       -0.006768       0.090000 
      6.172583       0.039161       0.070000 
      6.187077       0.053196       0.050000 
      6.203204       -0.010035       0.010000 
      6.218185       -0.041832       0.100000 
      6.234206       -0.054844       0.080000 
      6.250602       -0.079002       0.020000 
      6.266001       -0.044073       0.090000 
      6.280729       0.006575       0.080000 
      6.297259       0.070237       0.030000 
      6.312907       0.108307       0.030000 
      6.342911       0.089977       0.090000 
      6.360775       0.103407       0.090000 
      6.375122       0.116363       0.040000 
      6.390617       0.093588       0.010000 
      6.406322       0.034303       0.060000 
      6.421682       -0.065529       0.110000 
      6.436551       -0.073643       0.030000 
      6.452513       -0.010038       0.020000 
      6.468237       -0.044520       0.030000 
      6.485064       -0.065542       0.010000 
      6.500032       0.004777       0.060000 
      6.516734       0.089504       0.070000 
      6.532720       0.137030       0.120000 
      6.548678       0.130275       0.070000 
      6.562725       0.127188       0.000000 
      6.578722       0.116846       0.030000 
      6.593876       0.076536       0.010000 
      6.610011       0.033957       0.020000 
      6.624181       0.012861       0.010000 
      6.640306       0.027699       0.070000 
      6.655392       0.041957       0.010000 
      6.670668       0.033017       0.000000 
      6.684983       0.034815       0.010000 
      6.701124       0.045956       0.050000 
      6.716080       -0.031561       0.000000 
      6.731105       -0.133262       0.010000 
      6.747164       -0.125248       0.040000 
      6.763207       -0.117639       0.070000 
      6.779872       -0.157958       0.060000 
      6.794719       -0.155190       0.090000 
      6.811505       -0.101537       0.010000 
      6.827461       -0.034578       0.050000 
      6.841982       0.062999       0.050000 
      6.858431       0.187221       0.070000 
      6.872234       0.183554       0.040000 
      6.887820       0.120932       0.040000 
      6.903779       0.092623       0.030000 
      6.919695       0.036624       0.010000 
      6.950680       -0.054331       0.040000 
      6.966093       -0.086182       0.030000 
      6.981652       -0.007324       0.020000 
      6.997023       0.045526       0.050000 
      7.013204       0.005649       0.040000 
      7.029321       -0.031517       0.060000 
      7.044461       -0.027963       0.020000 
      7.060817       -0.031038       0.020000 
      7.075776       -0.051271       0.140000 
      7.091008       -0.002337       0.020000 
      7.106612       0.094363       0.080000 
      7.120544       0.096648       0.060000 
      7.136619       0.006592       0.010000 
      7.151504       -0.006421       0.040000 
      7.167459       0.027614       0.010000 
      7.182418       -0.005109       0.010000 
      7.198558       -0.061570       0.020000 
      7.212520       -0.092981       0.100000 
      7.228456       -0.106840       0.060000 
      7.244414       -0.140932       0.090000 
      7.261320       -0.146718       0.030000 
      7.276869       -0.077324       0.000000 
      7.292450       -0.019895       0.080000 
      7.307381       -0.034303       0.010000 
      7.321135       -0.079912       0.060000 
      7.353085       -0.078626       0.120000 
      7.369456       -0.015837       0.160000 
      7.384059       -0.004706       0.020000 
      7.399776       -0.014022       0.030000 
      7.416408       -0.012320       0.030000 
      7.430719       -0.047205       0.010000 
      7.446018       -0.076314       0.050000 
      7.461709       -0.040960       0.080000 
      7.476992       0.021789       0.010000 
      7.492149       0.063495       0.010000 
      7.506961       0.051785       0.000000 
      7.522079       -0.030618       0.090000 
      7.538632       -0.062872       0.020000 
      7.552673       0.003391       0.060000 
      7.569503       0.005175       0.080000 
      7.584650       -0.059342       0.020000 
      7.599213       -0.096082       0.020000 
      7.614722       -0.126594       0.000000 
      7.630691       -0.148918       0.050000 
      7.645839       -0.097867       0.010000 
      7.661820       0.027145       0.070000 
      7.676990       0.080051       0.050000 
      7.692634       0.059428       0.240000 
      7.707850       0.048714       2.870000 
      7.721922       0.020430       4.450000 
      7.738974       -0.020709       6.330000 
      7.754326       -0.056683       7.100000 
      7.768888       -0.037723       6.400000 
      7.783996       0.001536       1.830000 
      7.800260       -0.021622       2.020000 
      7.816009       -0.049473       12.660000 
      7.832052       -0.009592       19.050000 
      7.848347       0.000276       25.930000 
      7.863953       -0.000166       41.000000 
      7.879113       -0.015407       48.840000 
      7.893761       -0.078156       66.660000 
      7.909966       -0.074028       76.490000 
      7.925951       -0.003323       87.360000 
      7.940862       0.062154       111.990000 
      7.956006       0.080620       125.040000 
      7.971378       0.097577       150.060000 
      7.986383       0.118868       160.210000 
      8.002426       0.197193       168.970000 
      8.018666       0.426897       184.060000 
      8.034543       0.647201       191.750000 
      8.049481       0.792248       206.020000 
      8.064975       0.884486       212.470000 
      8.081427       0.991803       222.840000 
      8.095125       1.064396       226.180000 
      8.110372       1.113402       228.810000 
      8.126475       1.269423       233.840000 
      8.142830       1.476922       236.690000 
      8.158915       1.621413       244.540000 
      8.173447       1.742417       247.700000 
      8.189487       1.908847       249.600000 
      8.204991       2.089921       251.740000 
      8.220592       2.237499       252.740000 
      8.237443       2.336118       257.560000 
      8.253665       2.456784       261.580000 
      8.268230       2.580939       271.800000 
      8.284084       2.640722       276.040000 
      8.300187       2.666764       281.780000 
      8.315270       2.760151       284.050000 
      8.331202       3.044409       286.030000 
      8.348107       3.462607       289.440000 
      8.362911       3.775082       291.920000 
      8.377903       4.004295       298.360000 
      8.393306       4.285329       301.760000 
      8.409629       4.502807       307.580000 
      8.424478       4.562970       309.640000 
      8.439879       4.562586       310.270000 
      8.455304       4.582780       306.900000 
      8.470812       4.622272       304.630000 
      8.486689       4.646456       303.160000 
      8.503488       4.651855       303.620000 
      8.517546       4.652298       304.950000 
      8.533499       4.652312       309.140000 
      8.548771       4.652326       311.010000 
      8.565694       4.652782       312.500000 
      8.580063       4.658625       312.890000 
      8.596756       4.688234       313.470000 
      8.612055       4.752729       315.730000 
      8.628048       4.820929       317.990000 
      8.643287       4.859828       326.380000 
      8.657735       4.848271       330.390000 
      8.674150       4.814605       333.220000 
      8.689278       4.813759       336.980000 
      8.704932       4.771996       337.810000 
      8.721026       4.722357       338.110000 
      8.736686       4.723630       337.560000 
      8.750978       4.724167       336.430000 
      8.767735       4.731383       333.310000 
      8.783639       4.842154       331.480000 
      8.798596       5.083278       327.090000 
      8.814554       5.349985       325.360000 
      8.829514       5.527035       323.430000 
      8.845471       5.608236       323.440000 
      8.861593       5.610466       324.190000 
      8.876572       5.556783       326.010000 
      8.890534       5.506494       326.330000 
      8.906492       5.466639       328.250000 
      8.922448       5.383582       330.280000 
      8.937620       5.242456       336.290000 
      8.953548       5.061725       339.500000 
      8.970155       4.916113       342.370000 
      8.984334       4.820101       347.710000 
      9.000629       4.794131       349.980000 
      9.014957       4.823200       353.980000 
      9.031814       4.847397       355.530000 
      9.046882       4.863608       357.240000 
      9.062895       4.913815       338.210000 
      9.078622       5.011144       288.520000 
      9.094091       5.148313       177.520000 
      9.110012       5.350955       109.470000 
      9.124563       5.539160       53.820000 
      9.140064       5.609177       9.480000 
      9.154552       5.611007       9.400000 
      9.170424       5.628088       4.990000 
      9.185841       5.647383       3.980000 
      9.201470       5.658195       4.960000 
      9.217813       5.688687       6.220000 
      9.232946       5.758740       5.230000 
      9.248942       5.846476       5.390000 
      9.263903       5.820188       6.800000 
      9.278331       5.206336       7.710000 
      9.294472       3.654585       5.420000 
      9.309429       1.784940       4.900000 
      9.326385       0.758533       6.870000 
      9.340265       1.098678       7.820000 
      9.356619       1.767457       6.740000 
      9.372463       2.107941       6.250000 
      9.387437       2.306383       7.020000 
      9.404249       2.395871       9.200000 
      9.419582       2.250813       9.020000 
      9.434582       1.762388       7.780000 
      9.449540       1.031953       8.170000 
      9.465892       0.386187       9.010000 
      9.480180       -0.160646       8.840000 
      9.496731       -0.626692       7.900000 
      9.511712       -1.017038       7.090000 
      9.526633       -1.275595       7.480000 
      9.543590       -1.372632       7.460000 
      9.558752       -1.364631       6.130000 
      9.574380       -1.318950       6.000000 
      9.590138       -1.270614       6.700000 
      9.605625       -1.291210       6.790000 
      9.620176       -1.362429       6.320000 
      9.635670       -1.330604       5.730000 
      9.652196       -1.248188       6.180000 
      9.668203       -1.235592       6.920000 
      9.683255       -1.266526       6.500000 
      9.698841       -1.281767       6.120000 
      9.715006       -1.248118       6.860000 
      9.729057       -1.218618       7.540000 
      9.744080       -1.248977       7.340000 
      9.760734       -1.291652       7.080000 
      9.776358       -1.303223       7.330000 
      9.791689       -1.255758       8.590000 
      9.806631       -1.163444       8.530000 
      9.823330       -1.194395       7.540000 
      9.838223       -1.287525       7.700000 
      9.854130       -1.283968       8.240000 
      9.869258       -1.233336       7.780000 
      9.883844       -1.202394       6.450000 
      9.899801       -1.188979       6.640000 
      9.915385       -1.159870       7.100000 
      9.930974       -1.173715       6.860000 
      9.946448       -1.267911       6.280000 
      9.961639       -1.339034       6.410000 
      9.977746       -1.319047       6.890000 
      9.994700       -1.276789       7.050000 
      10.009660       -1.325346       6.370000 
      10.024620       -1.374929       6.310000 
      10.040871       -1.367441       7.110000 
      10.055209       -1.331454       7.290000 
      10.072008       -1.316318       7.060000 
      10.087573       -1.272258       6.910000 
      10.101812       -1.163926       7.340000 
      10.118761       -1.098410       7.700000 
      10.134317       -1.116374       7.480000 
      10.148616       -1.127518       7.280000 
      10.164017       -1.163416       7.730000 
      10.180156       -1.235520       8.020000 
      10.195658       -1.265086       7.520000 
      10.211285       -1.198367       7.170000 
      10.227371       -1.127548       7.230000 
      10.244130       -1.145944       7.580000 
      10.258086       -1.167399       7.400000 
      10.274140       -1.181784       6.690000 
      10.290921       -1.211296       6.690000 
      10.306142       -1.200538       7.040000 
      10.321228       -1.123061       6.980000 
      10.335738       -1.044589       6.620000 
      10.352196       -1.041045       6.530000 
      10.368599       -1.096566       6.880000 
      10.383581       -1.151674       6.890000 
      10.398801       -1.140945       6.680000 
      10.413675       -1.102327       6.710000 
      10.430520       -1.079126       7.280000 
      10.447217       -1.064215       7.380000 
      10.462427       -1.030742       6.990000 
      10.478338       -0.948576       7.050000 
      10.494132       -0.961742       7.750000 
      10.509974       -1.079885       7.780000 
      10.524129       -1.150340       7.290000 
      10.540409       -1.077674       7.320000 
      10.554980       -1.018635       7.610000 
      10.571060       -1.083526       7.570000 
      10.586885       -1.117162       7.320000 
      10.602112       -1.066140       6.920000 
      10.618804       -1.060205       7.030000 
      10.633763       -1.098394       7.170000 
      10.649555       -1.133262       6.940000 
      10.665512       -1.124349       6.700000 
      10.680106       -1.040464       7.040000 
      10.695508       -1.009205       7.110000 
      10.710986       -1.002754       6.860000 
      10.727444       -0.952228       6.740000 
      10.743022       -0.907351       6.820000 
      10.758600       -0.889369       7.350000 
      10.774436       -0.858527       7.300000 
      10.790365       -0.856685       7.010000 
      10.804796       -0.886255       7.140000 
      10.821206       -0.891251       7.430000 
      10.835167       -0.948145       7.390000 
      10.850994       -1.009995       7.180000 
      10.865443       -1.039188       7.200000 
      10.881034       -1.109122       7.320000 
      10.896767       -1.137762       7.470000 
      10.911570       -1.147315       7.080000 
      10.926800       -1.218011       6.970000 
      10.943330       -1.275454       7.120000 
      10.958580       -1.260160       7.300000 
      10.972734       -1.203780       7.150000 
      10.988986       -1.157544       6.910000 
      11.004748       -1.150926       7.010000 
      11.019687       -1.157531       7.180000 
      11.035562       -1.203350       7.010000 
      11.050804       -1.255218       6.880000 
      11.066037       -1.257113       7.120000 
      11.081782       -1.208196       7.360000 
      11.097962       -1.193898       7.070000 
      11.112726       -1.235560       6.990000 
      11.128523       -1.235893       7.090000 
      11.143475       -1.132517       7.430000 
      11.158393       -1.041847       7.350000 
      11.173341       -1.019076       7.200000 
      11.187982       -0.995251       7.220000 
      11.203960       -1.044172       7.380000 
      11.219307       -1.078127       7.220000 
      11.234555       -1.067039       7.110000 
      11.249513       -1.110455       6.970000 
      11.264686       -1.189783       7.270000 
      11.279649       -1.239532       7.340000 
      11.294647       -1.181687       7.250000 
      11.310005       -1.072426       7.000000 
      11.325191       -1.031173       7.070000 
      11.342103       -1.031577       7.190000 
      11.358387       -1.076965       7.130000 
      11.373873       -1.195972       7.000000 
      11.388988       -1.241830       7.070000 
      11.404235       -1.182559       7.200000 
      11.419690       -1.146428       7.200000 
      11.436227       -1.096443       7.110000 
      11.452147       -1.064895       7.130000 
      11.466676       -1.065061       7.290000 
      11.481638       -1.054482       7.230000 
      11.496598       -0.987115       7.180000 
      11.525720       -0.969365       7.360000 
      11.540680       -1.009470       7.300000 
      11.557699       -1.032570       7.160000 
      11.573591       -1.070044       7.050000 
      11.588551       -1.106880       7.220000 
      11.604510       -1.099213       7.200000 
      11.619839       -1.161183       7.130000 
      11.635982       -1.172644       7.020000 
      11.651908       -1.059013       7.100000 
      11.665759       -1.043706       7.130000 
      11.681840       -1.157942       7.100000 
      11.697001       -1.165153       7.030000 
      11.712164       -1.078201       7.090000 
      11.727841       -1.075557       7.150000 
      11.757276       -1.150758       7.080000 
      11.773495       -1.172810       7.060000 
      11.789006       -1.115797       7.170000 
      11.805017       -1.109165       7.160000 
      11.821237       -1.126078       7.190000 
      11.836025       -1.087180       7.130000 
      11.851780       -1.013650       7.230000 
      11.866851       -0.990339       7.310000 
      11.881712       -1.029347       7.070000 
      11.897928       -1.090294       7.050000 
      11.913692       -1.128350       7.220000 
      11.928974       -1.112280       7.210000 
      11.943044       -1.131547       7.180000 
      11.959030       -1.174556       7.090000 
      11.976123       -1.155772       7.160000 
      11.991453       -1.158499       7.200000 
      12.007372       -1.189315       7.170000 
      12.022408       -1.205577       7.150000 
      12.037623       -1.230564       7.170000 
      12.051971       -1.203736       7.250000 
      12.068762       -1.122149       7.160000 
      12.084635       -1.115935       7.090000 
      12.100061       -1.162000       7.140000 
      12.116094       -1.187166       7.200000 
      12.130949       -1.177258       7.200000 
      12.145216       -1.177298       7.160000 
      12.160784       -1.188496       7.200000 
      12.176578       -1.178198       7.220000 
      12.193419       -1.188539       7.130000 
      12.208626       -1.242289       7.130000 
      12.223958       -1.282183       7.070000 
      12.239775       -1.276827       7.240000 
      12.256309       -1.277257       7.190000 
      12.270489       -1.287555       7.060000 
      12.285050       -1.265586       7.090000 
      12.301952       -1.217219       7.170000 
      12.316905       -1.149474       7.190000 
      12.332835       -1.100251       7.040000 
      12.348702       -1.132005       7.100000 
      12.364832       -1.192508       7.200000 
      12.379838       -1.166446       7.300000 
      12.395360       -1.122219       7.120000 
      12.412013       -1.132834       7.150000 
      12.428415       -1.115905       7.300000 
      12.443740       -1.086808       7.250000 
      12.459770       -1.170557       7.140000 
      12.474340       -1.257932       7.180000 
      12.490061       -1.301480       7.290000 
      12.506760       -1.332335       7.240000 
      12.522938       -1.243175       7.190000 
      12.538928       -1.149185       7.150000 
      12.554029       -1.201040       7.140000 
      12.568878       -1.276394       7.160000 
      12.583911       -1.289797       7.200000 
      12.599806       -1.274143       7.240000 
      12.615488       -1.256644       7.190000 
      12.631134       -1.269201       7.140000 
      12.646732       -1.270999       7.160000 
      12.661706       -1.260684       7.030000 
      12.676913       -1.216321       7.150000 
      12.693409       -1.163457       7.220000 
      12.707659       -1.234303       7.180000 
      12.722731       -1.336363       7.160000 
      12.739636       -1.340059       7.220000 
      12.755216       -1.306854       7.220000 
      12.769699       -1.294297       7.200000 
      12.784603       -1.277298       7.150000 
      12.799730       -1.271456       7.120000 
      12.814924       -1.258430       7.280000 
      12.831902       -1.207821       7.250000 
      12.847649       -1.189439       7.150000 
      12.863194       -1.223934       7.250000 
      12.877499       -1.266069       7.200000 
      12.893048       -1.287542       7.140000 
      12.909514       -1.276371       7.110000 
      12.924644       -1.266069       7.090000 
      12.941147       -1.235119       7.100000 
      12.956934       -1.178738       7.140000 
      12.972800       -1.214079       7.210000 
      12.988253       -1.303709       7.120000 
      13.002489       -1.337761       6.990000 
      13.018749       -1.332406       7.050000 
      13.034117       -1.272758       7.050000 
      13.049721       -1.218618       7.010000 
      13.065518       -1.224364       7.070000 
      13.080127       -1.241873       7.100000 
      13.096551       -1.241846       7.190000 
      13.111815       -1.223464       7.120000 
      13.126898       -1.207310       7.070000 
      13.142265       -1.216762       7.130000 
      13.157771       -1.201908       7.160000 
      13.173720       -1.135203       7.150000 
      13.189708       -1.109194       7.210000 
      13.205256       -1.193881       7.140000 
      13.221196       -1.270485       7.120000 
      13.235761       -1.264700       7.090000 
      13.252132       -1.223451       7.110000 
      13.281912       -1.184053       7.120000 
      13.298278       -1.184053       7.090000 
      13.312454       -1.223505       7.120000 
      13.328132       -1.266499       7.100000 
      13.344061       -1.292942       7.080000 
      13.360128       -1.300609       7.130000 
      13.375072       -1.307306       7.130000 
      13.390949       -1.275943       7.250000 
      13.406641       -1.261671       7.150000 
      13.421045       -1.352587       7.200000 
      13.437689       -1.387525       7.190000 
      13.451824       -1.325736       7.120000 
      13.468268       -1.333833       7.240000 
      13.483242       -1.367771       7.240000 
      13.499190       -1.333403       7.110000 
      13.515452       -1.320793       7.090000 
      13.530293       -1.369157       7.110000 
      13.545866       -1.341832       7.050000 
      13.562244       -1.295696       7.140000 
      13.576648       -1.304153       7.130000 
      13.593554       -1.261583       7.100000 
      13.608849       -1.194409       7.160000 
      13.625359       -1.189883       7.070000 
      13.640682       -1.242772       7.180000 
      13.655053       -1.287582       7.150000 
      13.671762       -1.301011       7.200000 
      13.685953       -1.316695       7.170000 
      13.702601       -1.305964       7.140000 
      13.717993       -1.243189       7.220000 
      13.734139       -1.176040       7.230000 
      13.749824       -1.192513       7.220000 
      13.764972       -1.272381       7.130000 
      13.780037       -1.269087       7.190000 
      13.796744       -1.190368       7.210000 
      13.810629       -1.152189       7.160000 
      13.826604       -1.204676       7.070000 
      13.842879       -1.213150       7.160000 
      13.857953       -1.202022       7.220000 
      13.872553       -1.269630       7.100000 
      13.888533       -1.330577       7.020000 
      13.903481       -1.340046       7.120000 
      13.918625       -1.312169       7.250000 
      13.934043       -1.252670       7.240000 
      13.948859       -1.203281       7.260000 
      13.963616       -1.180510       7.210000 
      13.978921       -1.181325       7.140000 
      13.994517       -1.214978       7.140000 
      14.010801       -1.226122       7.040000 
      14.025881       -1.246372       7.180000 
      14.042569       -1.253433       7.190000 
      14.057201       -1.212333       7.160000 
      14.072757       -1.208224       7.140000 
      14.087015       -1.239618       7.070000 
      14.103374       -1.249929       7.110000 
      14.118679       -1.263385       7.060000 
      14.134673       -1.248561       7.150000 
      14.149978       -1.242346       7.230000 
      14.165586       -1.287583       7.210000 
      14.180648       -1.301451       7.080000 
      14.196884       -1.258486       7.090000 
      14.212476       -1.243206       7.140000 
      14.228234       -1.287596       7.120000 
      14.243279       -1.300995       7.180000 
      14.258940       -1.252644       7.140000 
      14.275199       -1.213636       7.150000 
      14.290923       -1.224350       7.110000 
      14.306206       -1.246372       7.100000 
      14.320220       -1.255231       7.170000 
      14.335651       -1.214508       7.150000 
      14.351129       -1.145917       7.150000 
      14.367708       -1.145514       7.130000 
      14.382919       -1.144089       7.150000 
      14.397458       -1.147799       7.110000 
      14.413604       -1.218495       7.150000 
      14.428980       -1.281740       7.110000 
      14.444881       -1.295182       7.170000 
      14.460505       -1.292955       7.200000 
      14.476456       -1.272341       7.180000 
      14.492197       -1.253530       7.130000 
      14.507594       -1.253101       7.220000 
      14.521729       -1.266943       7.180000 
      14.538560       -1.268798       7.100000 
      14.554414       -1.256618       7.200000 
      14.570277       -1.273767       7.180000 
      14.586660       -1.286627       7.130000 
      14.601615       -1.279609       7.210000 
      14.615942       -1.286657       7.250000 
      14.631245       -1.338274       7.270000 
      14.647720       -1.354748       7.170000 
      14.662724       -1.315862       7.070000 
      14.678727       -1.243175       7.120000 
      14.693175       -1.165712       7.200000 
      14.709750       -1.149545       7.220000 
      14.725449       -1.217649       7.180000 
      14.740709       -1.270498       7.110000 
      14.755531       -1.241362       7.170000 
      14.771755       -1.188082       7.210000 
      14.787745       -1.173202       7.110000 
      14.803231       -1.168408       7.050000 
      14.818585       -1.146746       7.100000 
      14.834639       -1.137031       7.150000 
      14.850870       -1.165158       7.170000 
      14.865434       -1.249029       7.260000 
      14.879952       -1.260603       7.130000 
      14.895782       -1.235604       7.080000 
      14.910920       -1.234192       7.160000 
      14.927402       -1.197009       7.160000 
      14.941774       -1.163913       7.150000 
      14.957988       -1.173242       7.180000 
      14.972292       -1.193895       7.040000 
      14.988975       -1.206881       7.150000 
      15.005026       -1.241362       7.180000 
      15.020338       -1.251660       7.180000 
      15.035928       -1.195653       7.140000 
      15.052040       -1.129347       7.180000 
      15.067265       -1.084940       7.140000 
      15.081125       -1.089023       7.130000 
      15.098275       -1.142303       7.120000 
      15.113747       -1.182183       7.170000 
      15.128962       -1.176841       7.190000 
      15.143359       -1.177714       7.210000 
      15.160320       -1.193438       7.050000 
      15.175087       -1.196552       7.100000 
      15.190504       -1.198850       7.190000 
      15.205905       -1.202784       7.120000 
      15.221056       -1.227091       7.190000 
      15.236817       -1.249402       7.050000 
      15.253835       -1.204193       7.120000 
      15.269913       -1.109181       7.180000 
      15.285850       -1.124461       7.120000 
      15.300376       -1.218035       7.160000 
      15.315372       -1.235547       7.090000 
      15.329970       -1.211367       7.040000 
      15.346665       -1.212666       7.120000 
      15.375872       -1.188509       7.120000 
      15.392822       -1.143246       7.170000 
      15.407795       -1.158930       7.060000 
      15.422962       -1.206864       7.160000 
      15.438805       -1.212236       7.190000 
      15.455589       -1.188082       7.140000 
      15.470176       -1.202354       7.220000 
      15.486549       -1.232889       7.250000 
      15.501183       -1.214880       7.190000 
      15.516617       -1.173754       7.180000 
      15.532583       -1.127922       7.130000 
      15.546834       -1.110146       7.130000 
      15.561980       -1.127949       7.200000 
      15.578942       -1.174654       7.210000 
      15.594540       -1.226135       7.220000 
      15.609739       -1.287098       7.170000 
      15.625694       -1.310853       7.150000 
      15.640936       -1.289783       7.180000 
      15.656742       -1.239202       7.110000 
      15.671488       -1.163843       7.120000 
      15.688277       -1.151413       7.040000 
      15.703309       -1.221596       7.020000 
      15.718690       -1.295678       7.020000 
      15.734071       -1.274002       7.190000 
      15.748990       -1.184955       7.250000 
      15.764248       -1.122123       7.170000 
      15.780974       -1.133829       7.160000 
      15.795367       -1.107751       7.240000 
      15.810827       -1.048229       7.160000 
      15.828113       -1.059830       7.160000 
      15.843196       -1.113149       7.190000 
      15.858362       -1.146829       7.170000 
      15.873234       -1.172315       7.100000 
      15.888439       -1.198837       7.060000 
      15.903997       -1.226605       7.030000 
      15.920141       -1.269214       7.100000 
      15.935435       -1.301481       7.190000 
      15.951127       -1.341335       7.160000 
      15.965711       -1.356173       7.150000 
      15.981097       -1.309481       7.160000 
      15.996821       -1.225803       7.170000 
      16.011793       -1.148146       7.140000 
      16.028030       -1.161738       7.130000 
      16.043387       -1.216694       7.130000 
      16.074700       -1.267911       7.200000 
      16.091527       -1.296055       7.140000 
      16.106679       -1.317138       7.180000 
      16.122947       -1.316292       7.090000 
      16.138298       -1.285740       7.100000 
      16.153483       -1.226232       7.210000 
      16.168823       -1.176802       7.200000 
      16.184525       -1.218617       7.150000 
      16.199755       -1.234078       7.140000 
      16.214710       -1.149140       7.160000 
      16.229832       -1.058905       7.190000 
      16.244928       -1.086379       7.160000 
      16.260381       -1.156628       7.170000 
      16.274974       -1.193008       7.150000 
      16.290358       -1.212683       7.250000 
      16.305350       -1.270998       7.110000 
      16.320368       -1.317081       7.100000 
      16.335915       -1.275968       7.130000 
      16.352273       -1.232433       7.050000 
      16.366784       -1.221666       7.100000 
      16.381969       -1.214521       7.130000 
      16.398774       -1.245845       7.090000 
      16.413967       -1.193341       7.160000 
      16.431004       -1.061684       7.150000 
      16.445959       -1.035633       7.160000 
      16.461113       -1.054427       7.220000 
      16.477000       -1.037431       7.150000 
      16.491028       -1.063859       7.110000 
      16.507477       -1.131047       7.180000 
      16.522430       -1.152130       7.140000 
      16.537910       -1.112293       7.140000 
      16.554863       -1.108223       7.140000 
      16.570938       -1.139631       7.170000 
      16.585961       -1.150346       7.270000 
      16.601166       -1.167898       7.220000 
      16.617048       -1.161960       7.220000 
      16.633145       -1.133873       7.200000 
      16.649084       -1.132878       7.190000 
      16.663825       -1.169268       7.150000 
      16.680076       -1.196996       7.120000 
      16.694043       -1.228447       7.100000 
      16.709069       -1.272301       7.100000 
      16.724921       -1.316708       7.090000 
      16.740457       -1.335103       7.170000 
      16.757021       -1.307253       7.130000 
      16.772120       -1.239675       7.180000 
      16.789143       -1.216280       7.200000 
      16.804254       -1.249043       7.190000 
      16.818347       -1.209938       7.200000 
      16.834365       -1.138829       7.140000 
      16.850378       -1.104155       7.190000 
      16.865415       -1.104760       7.170000 
      16.880607       -1.127479       7.120000 
      16.895862       -1.173767       7.050000 
      16.911270       -1.215740       7.170000 
      16.927533       -1.242788       7.190000 
      16.942416       -1.239534       7.160000 
      16.957823       -1.214991       7.150000 
      16.972998       -1.168329       7.110000 
      16.988475       -1.188525       7.180000 
      17.003790       -1.251647       7.150000 
      17.019252       -1.248072       7.160000 
      17.035387       -1.163345       7.150000 
      17.052141       -1.049061       7.140000 
      17.067124       -1.013247       7.080000 
      17.082981       -1.024375       7.130000 
      17.097972       -0.984094       7.050000 
      17.114189       -0.984514       7.070000 
      17.130663       -1.092968       7.170000 
      17.145977       -1.183454       7.180000 
      17.160545       -1.156630       7.120000 
      17.175970       -1.073271       7.140000 
      17.191140       -1.065671       7.120000 
      17.206849       -1.118119       7.130000 
      17.238343       -1.160698       7.170000 
      17.254940       -1.169657       7.070000 
      17.268793       -1.172815       7.060000 
      17.283618       -1.246788       7.180000 
      17.299966       -1.311266       7.150000 
      17.329405       -1.270999       7.130000 
      17.345842       -1.218565       7.030000 
      17.361027       -1.224336       7.140000 
      17.375840       -1.240933       7.150000 
      17.392901       -1.229275       7.190000 
      17.408812       -1.153460       7.080000 
      17.424941       -1.030317       7.130000 
      17.440600       -1.004279       7.200000 
      17.456628       -1.080909       7.090000 
      17.473194       -1.120763       7.070000 
      17.488265       -1.157130       7.130000 
      17.503226       -1.206756       7.150000 
      17.519129       -1.210449       7.270000 
      17.534257       -1.166043       7.200000 
      17.549439       -1.100153       7.230000 
      17.565073       -1.048632       7.150000 
      17.579187       -1.071509       7.140000 
      17.594785       -1.088896       7.130000 
      17.610148       -1.024475       7.190000 
      17.625220       -1.038764       7.150000 
      17.641530       -1.173683       7.180000 
      17.657083       -1.238161       7.150000 
      17.671128       -1.202866       7.090000 
      17.686905       -1.167805       7.120000 
      17.703181       -1.192537       7.150000 
      17.718159       -1.195112       7.080000 
      17.733780       -1.116306       7.150000 
      17.749775       -1.008251       7.110000 
      17.765426       -0.936559       7.140000 
      17.780857       -0.919989       7.130000 
      17.796432       -0.978211       7.140000 
      17.811542       -1.057516       7.090000 
      17.825971       -1.089353       7.180000 
      17.843078       -1.087556       7.110000 
      17.858676       -1.053530       7.090000 
      17.873944       -1.037860       7.190000 
      17.889890       -1.069684       7.130000 
      17.905409       -1.096539       7.090000 
      17.921217       -1.122161       7.060000 
      17.937013       -1.137266       7.250000 
      17.953010       -1.127117       7.170000 
      17.968243       -1.115767       7.180000 
      17.983710       -1.090351       7.060000 
      17.999763       -1.041418       7.030000 
      18.015082       -1.056312       7.120000 
      18.029893       -1.097855       7.120000 
      18.045116       -1.151327       7.090000 
      18.061158       -1.200928       7.110000 
      18.076766       -1.186723       7.130000 
      18.091992       -1.132890       7.160000 
      18.107763       -1.116794       7.110000 
      18.123784       -1.161144       7.090000 
      18.139515       -1.239989       7.160000 
      18.154937       -1.216209       7.140000 
      18.170546       -1.096622       7.140000 
      18.186215       -1.041904       7.090000 
      18.200763       -1.054471       7.070000 
      18.216491       -1.096149       7.120000 
      18.230429       -1.133735       7.130000 
      18.246785       -1.130594       7.210000 
      18.262043       -1.140006       7.110000 
      18.277696       -1.110849       7.120000 
      18.291875       -0.973255       7.130000 
      18.307752       -0.847428       7.040000 
      18.322706       -0.870129       7.140000 
      18.337345       -0.978693       7.100000 
      18.354195       -1.027823       7.170000 
      18.369649       -1.018107       7.090000 
      18.383868       -0.975416       7.090000 
      18.399695       -0.945083       7.120000 
      18.414898       -0.909540       7.110000 
      18.432049       -0.922702       7.230000 
      18.446690       -0.996455       7.180000 
      18.462539       -1.002863       7.110000 
      18.477241       -0.945877       7.010000 
      18.493732       -0.955829       7.070000 
      18.508975       -0.986667       7.050000 
      18.523188       -0.998851       7.110000 
      18.538436       -1.012709       7.000000 
      18.555016       -1.066016       7.120000 
      18.570168       -1.096994       7.160000 
      18.584569       -1.045390       7.110000 
      18.600928       -0.991280       7.170000 
      18.616498       -0.987557       7.040000 
      18.632547       -1.037898       7.120000 
      18.648221       -1.050692       7.180000 
      18.663430       -1.008333       7.080000 
      18.677818       -0.982158       7.190000 
      18.694219       -0.996193       7.160000 
      18.709833       -1.005053       7.090000 
      18.725144       -1.038342       7.140000 
      18.741105       -1.038649       7.100000 
      18.754706       -1.028960       7.060000 
      18.771113       -1.101898       7.120000 
      18.786555       -1.186155       7.150000 
      18.801746       -1.158871       7.130000 
      18.817591       -1.078157       7.150000 
      18.832953       -1.016834       7.050000 
      18.849039       -1.017220       7.070000 
      18.864538       -1.084482       7.150000 
      18.894466       -1.109025       7.260000 
      18.910371       -1.091678       7.180000 
      18.926398       -1.044008       7.090000 
      18.942529       -0.998907       7.060000 
      18.957694       -1.020750       7.180000 
      18.972802       -1.038701       7.130000 
      18.988046       -0.962044       7.130000 
      19.003170       -0.929417       7.190000 
      19.020113       -0.984399       7.190000 
      19.035311       -1.016802       7.120000 
      19.050766       -1.026136       7.070000 
      19.066073       -1.045030       7.070000 
      19.081884       -1.057101       7.150000 
      19.097834       -1.104196       7.220000 
      19.113089       -1.165143       7.040000 
      19.128542       -1.195112       7.050000 
      19.143830       -1.143647       7.080000 
      19.159360       -1.070074       7.110000 
      19.173915       -1.060338       7.180000 
      19.189830       -1.012637       7.080000 
      19.204981       -0.961326       7.070000 
      19.221019       -1.011325       7.150000 
      19.235917       -1.108205       7.160000 
      19.251233       -1.090213       7.180000 
      19.266681       -1.046832       7.070000 
      19.282616       -1.058845       7.060000 
      19.297613       -1.036916       7.150000 
      19.314158       -0.988110       7.140000 
      19.328580       -0.978614       7.140000 
      19.345553       -0.993478       7.150000 
      19.360709       -0.996969       7.130000 
      19.376945       -1.003350       7.060000 
      19.391120       -1.015740       7.160000 
      19.407814       -1.013245       7.200000 
      19.423858       -0.971373       7.200000 
      19.439850       -0.942470       7.080000 
      19.454567       -0.966514       7.090000 
      19.470339       -1.060714       7.110000 
      19.486589       -1.119393       7.230000 
      19.502162       -1.159717       7.190000 
      19.518323       -1.154375       7.090000 
      19.534260       -1.088884       7.120000 
      19.549021       -1.070626       7.120000 
      19.565324       -1.035477       7.160000 
      19.580716       -0.979140       7.190000 
      19.596662       -0.931549       7.140000 
      19.611969       -0.907804       7.070000 
      19.625990       -0.852230       7.150000 
      19.641351       -0.822677       7.120000 
      19.657655       -0.939202       7.050000 
      19.673441       -1.030963       7.170000 
      19.687916       -1.010480       7.190000 
      19.704019       -1.006384       7.170000 
      19.719772       -1.017604       7.110000 
      19.734503       -0.948615       7.050000 
      19.750881       -0.889926       7.250000 
      19.766397       -0.953504       7.110000 
      19.782027       -1.034616       7.000000 
      19.797969       -1.000055       7.160000 
      19.812408       -0.893012       7.190000 
      19.827695       -0.832904       7.160000 
      19.842128       -0.810949       7.160000 
      19.859043       -0.767497       7.180000 
      19.875148       -0.783584       7.110000 
      19.890730       -0.833775       7.090000 
      19.906230       -0.844490       7.140000 
      19.921216       -0.843218       7.200000 
      19.937650       -0.815780       7.200000 
      19.967950       -0.774640       7.070000 
      19.984316       -0.737847       7.080000 
      19.999661       -0.748198       7.160000 
      20.015068       -0.765185       7.160000 
      20.029961       -0.772856       7.210000 
      20.045034       -0.852631       7.160000 
      20.060394       -0.941305       7.150000 
      20.075896       -0.940489       7.210000 
      20.091834       -0.906867       7.210000 
      20.106960       -0.894338       7.230000 
      20.121923       -0.878654       7.220000 
      20.136949       -0.888553       7.090000 
      20.152252       -0.942249       7.100000 
      20.168113       -0.980867       7.050000 
      20.182850       -0.961060       7.100000 
      20.197996       -0.909649       7.140000 
      20.213686       -0.887570       7.100000 
      20.229709       -0.919933       7.110000 
      20.244673       -0.939091       7.190000 
      20.259895       -0.932473       7.030000 
      20.275231       -0.873712       7.140000 
      20.290478       -0.831646       7.160000 
      20.306065       -0.900211       7.110000 
      20.321366       -1.048502       7.190000 
      20.337397       -1.119724       7.140000 
      20.353473       -1.023879       7.200000 
      20.368050       -0.913609       7.170000 
      20.384482       -0.852203       7.130000 
      20.400137       -0.815971       7.130000 
      20.415236       -0.835562       7.110000 
      20.431527       -0.834249       7.170000 
      20.446967       -0.862499       7.140000 
      20.462932       -0.919336       7.150000 
      20.476638       -0.826619       7.110000 
      20.492656       -0.749186       7.110000 
      20.507622       -0.817650       7.110000 
      20.522994       -0.891206       7.160000 
      20.538078       -0.951731       7.090000 
      20.553941       -1.011726       7.140000 
      20.570315       -1.035560       7.100000 
      20.585686       -1.018065       7.100000 
      20.600948       -0.988982       7.080000 
      20.614910       -1.007780       7.140000 
      20.630114       -1.057516       7.140000 
      20.646709       -1.059744       7.110000 
      20.662887       -1.017192       7.150000 
      20.677554       -0.954403       7.240000 
      20.692713       -0.918619       7.110000 
      20.706740       -0.942786       7.110000 
      20.723449       -0.959289       7.160000 
      20.738602       -0.946402       7.170000 
      20.754282       -0.984800       7.120000 
      20.771378       -0.983511       7.110000 
      20.785997       -0.864231       7.200000 
      20.801918       -0.790408       7.170000 
      20.817777       -0.758414       7.200000 
      20.832436       -0.711032       7.070000 
      20.847560       -0.708281       7.150000 
      20.864169       -0.806381       7.080000 
      20.879670       -0.856170       7.040000 
      20.894976       -0.780855       7.230000 
      20.911193       -0.733018       7.090000 
      20.926287       -0.788027       7.180000 
      20.941835       -0.902486       7.170000 
      20.957322       -0.951095       7.160000 
      20.972146       -0.947787       7.160000 
      20.988052       -0.988357       7.120000 
      21.003346       -1.005507       7.090000 
