

 time    ||    gripping force   ||   raspberry measurement 

      0       110.390000       -798.966667 
      0       18.300000       -798.966667 
      0       7.150000       -798.966667 
      0       7.360000       -798.966667 
      0       8.030000       -798.966667 
      0       7.830000       -798.966667 
      1       6.210000       -790.977000 
      1       6.170000       -783.067230 
      1       6.030000       -775.236558 
      1       6.120000       -767.484187 
      2       5.980000       -759.808174 
      2       5.980000       -752.104630 
      2       6.210000       -748.577013 
      2       6.230000       -705.604662 
      3       6.370000       -513.050816 
      3       6.380000       -195.744656 
      3       6.430000       -3.572928 
      3       6.480000       39.125547 
      3       6.490000       42.611474 
      3       6.540000       42.730501 
      3       6.580000       42.737931 
      4       6.650000       42.736926 
      4       6.630000       42.738378 
      4       6.710000       42.736939 
      4       6.720000       42.738378 
      4       6.710000       42.736940 
      4       6.760000       42.738391 
      6       6.800000       42.737396 
      6       6.750000       42.744207 
      6       6.770000       42.766106 
      6       6.790000       42.797500 
      6       6.860000       42.781803 
      7       6.880000       42.747334 
      7       6.860000       42.740137 
      7       6.870000       42.747764 
      7       6.960000       42.786772 
      7       6.860000       42.816728 
      7       6.940000       42.786772 
      7       6.960000       42.747738 
      7       6.850000       42.739264 
      8       6.970000       42.736993 
      8       7.000000       42.739264 
      8       7.370000       42.747738 
      8       7.510000       42.786785 
      9       7.830000       42.817185 
      9       7.910000       42.792628 
      9       8.850000       42.777790 
      9       8.810000       42.809211 
      9       8.800000       42.831110 
      10       8.770000       42.837895 
      10       8.810000       42.836039 
      10       8.800000       42.827553 
      10       8.770000       42.787659 
      10       8.730000       42.747791 
      10       8.780000       42.740151 
      10       8.850000       42.747764 
      10       8.810000       42.786772 
      10       9.010000       42.816728 
      11       36.980000       42.786785 
      11       154.570000       42.748194 
      11       302.890000       42.745093 
      11       292.030000       42.766159 
      11       152.350000       42.798400 
      11       114.500000       42.793058 
      11       110.230000       42.801558 
      11       159.500000       42.849092 
      11       238.480000       42.855307 
      11       293.350000       42.843320 
      11       274.120000       42.837370 
      11       195.810000       42.838517 
      11       142.310000       42.841474 
      11       141.070000       42.905628 
      12       174.630000       43.301942 
      12       224.400000       44.560746 
      12       245.820000       46.605441 
      12       236.290000       47.969065 
      12       198.170000       47.404938 
      12       172.590000       45.919970 
      12       171.220000       45.118862 
      12       188.910000       45.422887 
      13       203.400000       46.581983 
      13       203.130000       47.791611 
      14       202.730000       48.154134 
      14       202.580000       47.532426 
      14       202.290000       46.516210 
      14       202.240000       45.929844 
      16       202.240000       46.094570 
      16       202.200000       46.746083 
      16       202.180000       47.350294 
      16       202.140000       47.492004 
      16       202.040000       47.179683 
      16       202.000000       46.651876 
      16       201.960000       46.197534 
      16       201.850000       46.193933 
      17       201.550000       46.539703 
      17       201.520000       46.769117 
      17       201.390000       46.783093 
      17       201.390000       46.747629 
      18       201.330000       46.739276 
      18       201.300000       46.737409 
      18       201.230000       46.743777 
      18       201.250000       46.761136 
      20       200.770000       46.778272 
      20       200.720000       46.761136 
      21       200.750000       46.743777 
      21       200.770000       46.737383 
      21       200.700000       46.738391 
      21       200.590000       46.736940 
      21       200.530000       46.738378 
      21       201.250000       46.736939 
      21       201.310000       46.738378 
      22       201.200000       46.736939 
      22       201.220000       46.738378 
      22       201.140000       46.736939 
      22       201.120000       46.738378 
      22       201.070000       46.736939 
      22       201.070000       46.738378 
      23       201.000000       46.736966 
      23       200.990000       46.739251 
      23       200.920000       46.747308 
      23       200.900000       46.781803 
      24       200.870000       46.797500 
      24       200.880000       46.766106 
      24       200.790000       46.744207 
      24       200.870000       46.737396 
      24       200.830000       46.738391 
      24       200.780000       46.736940 
      24       200.790000       46.738378 
      25       200.820000       46.736939 
      25       200.770000       46.738378 
      25       200.740000       46.736939 
      25       200.740000       46.738378 
      26       200.580000       46.736926 
      26       200.680000       46.737935 
      26       200.600000       46.731540 
      26       200.650000       46.714154 
      26       200.580000       46.696172 
      26       200.570000       46.703812 
      27       200.530000       46.688115 
      27       200.570000       46.677374 
      27       200.620000       46.709198 
      27       200.580000       46.731110 
      27       200.470000       46.737921 
      27       200.560000       46.736926 
      27       200.380000       46.738378 
      27       200.440000       46.736939 
      28       200.470000       46.738378 
      28       200.490000       46.736939 
      28       200.430000       46.738378 
      28       200.450000       46.736939 
      28       200.400000       46.738378 
      28       200.360000       46.736926 
      29       200.350000       46.737935 
      29       200.370000       46.731540 
      29       200.300000       46.714181 
      29       200.310000       46.697045 
      29       200.330000       46.714181 
      29       200.280000       46.731540 
      30       200.290000       46.737934 
      30       200.270000       46.736913 
      30       199.940000       46.737934 
      30       199.960000       46.731540 
      30       199.940000       46.714181 
      30       199.940000       46.697045 
      30       199.930000       46.714181 
      30       199.890000       46.731540 
      31       199.870000       46.737935 
      31       199.900000       46.736926 
      31       199.820000       46.738377 
      31       199.800000       46.736926 
      31       199.960000       46.737935 
      31       199.880000       46.731540 
      31       199.860000       46.714181 
      32       199.510000       46.697045 
      32       199.100000       46.714181 
      32       199.670000       46.731527 
      32       199.990000       46.737491 
      33       199.760000       46.731527 
      33       199.850000       46.714154 
      33       199.870000       46.696172 
      33       199.980000       46.703812 
      33       199.770000       46.688115 
      33       200.210000       46.677374 
      33       200.190000       46.709198 
      34       200.000000       46.731110 
      34       200.050000       46.737921 
      34       200.020000       46.736926 
      34       200.020000       46.738377 
      34       199.940000       46.736926 
      34       199.800000       46.737921 
      34       199.840000       46.731110 
      35       199.920000       46.709212 
      35       199.910000       46.677817 
      35       199.840000       46.693514 
      35       199.920000       46.728010 
      35       199.860000       46.736066 
      36       199.870000       46.738351 
      36       199.870000       46.736912 
      36       199.920000       46.737465 
      36       199.890000       46.725255 
      36       200.060000       46.679159 
      37       199.970000       46.607884 
      37       199.960000       46.599827 
      37       199.920000       46.634322 
      37       200.050000       46.666133 
      37       199.900000       46.708298 
      37       199.890000       46.731083 
      37       199.910000       46.737921 
      37       199.700000       46.736926 
      37       199.870000       46.738377 
      37       200.080000       46.736926 
      38       200.060000       46.737935 
      38       200.040000       46.731540 
      38       200.010000       46.714181 
      38       199.990000       46.697045 
      39       199.990000       46.714181 
      39       199.930000       46.731540 
      39       199.930000       46.737934 
      39       200.100000       46.736913 
      39       199.840000       46.737934 
      39       199.870000       46.731540 
      40       199.620000       46.714181 
      40       199.920000       46.697045 
      41       199.890000       46.714181 
      41       200.170000       46.731540 
      41       200.100000       46.737935 
      41       200.090000       46.736926 
      41       199.950000       46.738378 
      41       199.890000       46.736939 
      41       199.930000       46.738378 
      42       200.110000       46.736939 
      42       200.120000       46.738378 
      42       200.110000       46.736939 
      42       200.060000       46.738378 
      42       199.890000       46.736939 
      42       199.850000       46.738378 
      42       200.090000       46.736939 
      42       200.270000       46.738378 
      42       200.140000       46.736939 
      42       200.070000       46.738378 
      43       200.190000       46.736939 
      43       200.100000       46.738351 
      43       200.120000       46.736066 
      43       199.850000       46.728010 
      43       200.150000       46.693514 
      43       200.210000       46.677817 
      43       200.080000       46.709212 
      43       199.900000       46.731110 
      44       199.860000       46.737921 
      44       200.020000       46.736926 
      44       199.980000       46.738378 
      44       199.950000       46.736939 
      44       199.960000       46.738378 
      44       199.930000       46.736939 
      44       199.960000       46.738378 
      44       199.910000       46.736939 
      45       199.960000       46.738378 
      45       200.170000       46.736939 
      45       199.870000       46.738378 
      45       199.920000       46.736939 
      46       200.060000       46.738378 
      46       199.770000       46.736939 
      46       199.840000       46.738378 
      46       200.110000       46.736939 
      46       200.060000       46.738378 
      46       200.000000       46.736939 
      46       199.950000       46.738378 
      46       200.040000       46.736939 
      46       199.970000       46.738378 
      46       200.010000       46.736939 
      47       199.880000       46.738378 
      47       200.000000       46.736939 
      47       199.950000       46.738378 
      47       200.060000       46.736939 
      47       199.940000       46.738378 
      47       200.050000       46.736939 
      47       199.920000       46.738378 
      47       200.020000       46.736940 
      47       200.160000       46.738391 
      47       199.990000       46.737383 
      48       200.020000       46.743777 
      48       199.780000       46.761123 
      48       199.710000       46.777816 
      48       200.010000       46.755307 
      48       200.050000       46.714611 
      48       199.740000       46.678260 
      48       199.980000       46.693528 
      48       199.920000       46.728010 
      49       199.980000       46.736053 
      49       199.730000       46.737908 
      49       199.970000       46.731540 
      49       199.960000       46.714181 
      49       199.960000       46.697045 
      49       199.910000       46.714154 
      50       200.140000       46.730654 
      50       200.060000       46.727136 
      50       200.090000       46.688532 
      50       200.030000       46.658589 
      50       199.990000       46.688545 
      50       199.990000       46.727580 
      50       199.940000       46.736053 
      50       199.950000       46.738351 
      50       199.950000       46.736939 
      51       199.930000       46.738378 
      51       199.900000       46.736926 
      51       200.070000       46.737921 
      51       200.040000       46.731084 
      51       199.990000       46.708338 
      51       200.090000       46.667449 
      52       200.000000       46.650089 
      52       199.950000       46.667435 
      52       199.970000       46.707882 
      52       199.910000       46.725255 
      52       200.240000       46.708755 
      52       200.080000       46.677804 
      52       200.070000       46.693514 
      52       200.150000       46.728010 
      52       200.060000       46.736066 
      53       200.100000       46.738351 
      53       200.090000       46.736939 
      53       200.060000       46.738378 
      53       200.060000       46.736939 
      53       200.050000       46.738378 
      53       200.080000       46.736939 
      53       200.050000       46.738378 
      54       200.030000       46.736939 
      54       200.060000       46.738378 
      54       200.020000       46.736939 
      54       200.040000       46.738378 
      54       200.050000       46.736939 
      54       200.040000       46.738378 
      54       200.080000       46.736926 
      55       200.060000       46.737921 
      55       200.040000       46.731110 
      55       200.030000       46.709212 
      55       200.030000       46.677817 
      56       199.980000       46.693514 
      56       200.000000       46.728010 
      56       200.050000       46.736066 
      56       199.980000       46.738351 
      56       199.990000       46.736939 
      56       199.950000       46.738378 
      56       200.040000       46.736939 
      57       200.040000       46.738378 
      57       200.000000       46.736939 
      57       199.990000       46.738351 
      57       200.000000       46.736066 
      57       199.990000       46.728010 
      57       199.950000       46.693514 
      57       200.000000       46.677817 
      58       199.990000       46.709212 
      58       199.950000       46.731110 
      58       199.950000       46.737921 
      58       200.000000       46.736926 
      58       199.950000       46.738378 
      58       199.960000       46.736939 
      58       200.010000       46.738378 
      59       199.990000       46.736939 
      59       199.970000       46.738378 
      59       199.980000       46.736939 
      59       199.940000       46.738378 
      59       199.990000       46.736939 
      59       199.990000       46.738378 
      59       200.030000       46.736939 
      59       199.880000       46.738378 
      59       200.110000       46.736939 
      59       199.990000       46.738378 
      59       200.010000       46.736939 
      60       200.020000       46.738378 
      60       199.980000       46.736939 
      60       200.070000       46.738378 
      60       199.980000       46.736939 
      60       200.050000       46.738378 
      60       200.010000       46.736939 
      60       200.010000       46.738378 
