{
    "0": [
        0.4851394875377399,
        11.733958777220192
    ],
    "1": [
        2.462867678887519,
        8.388225054385583
    ],
    "2": [
        1.567983721122886,
        5.111001623031459
    ],
    "3": [
        0.17790300618647514,
        8.513360576606848
    ],
    "4": [
        4.282217225642594,
        1.8643265209891462
    ],
    "5": [
        0.5500024884851373,
        6.44022409787257
    ],
    "6": [
        0.8773071122547302,
        4.094099857188741
    ],
    "7": [
        1.3158476044561982,
        9.139805269199936
    ],
    "8": [
        0.2678212348686508,
        5.629344977651857
    ],
    "9": [
        0.1829065301647908,
        1.9226947924332791
    ],
    "10": [
        1.6946194053103096,
        4.20711632625601
    ]
}