

 time    ||    gripping force   ||   raspberry measurement 

      0       61.150000       -794.959091 
      0       41.700000       -794.959091 
      0       35.810000       -794.959091 
      0       30.940000       -794.959091 
      0       18.160000       -794.959091 
      0       16.780000       -794.959091 
      0       16.090000       -794.959091 
      0       15.500000       -794.959091 
      1       12.820000       -787.009500 
      1       12.200000       -779.139400 
      1       11.340000       -771.346837 
      1       10.710000       -763.528157 
      1       10.960000       -760.008840 
      1       20.380000       -717.135043 
      2       26.670000       -524.991060 
      2       32.610000       -208.210263 
      2       49.550000       -16.083267 
      2       54.750000       26.772535 
      2       57.530000       30.232743 
      2       59.480000       30.283413 
      2       59.820000       30.291791 
      2       60.030000       30.308282 
      2       60.260000       30.314220 
      2       60.350000       30.308255 
      2       60.230000       30.290909 
      2       60.100000       30.273774 
      2       60.110000       30.290910 
      3       60.060000       30.308349 
      3       60.230000       30.317363 
      3       60.400000       30.347473 
      3       60.630000       30.479696 
      3       60.690000       30.667072 
      3       61.420000       30.796211 
      3       63.960000       30.938780 
      3       66.570000       31.068318 
      3       66.510000       31.130221 
      3       66.370000       31.154437 
      4       66.320000       31.136091 
      4       66.480000       31.099339 
      4       66.650000       31.022292 
      4       66.650000       30.974770 
      4       66.660000       31.037506 
      4       66.670000       31.095711 
      4       66.560000       31.097593 
      4       66.580000       31.041950 
      4       66.770000       31.007134 
      5       69.140000       31.101155 
      5       69.070000       31.237890 
      5       69.020000       31.288942 
      5       69.080000       31.254934 
      5       69.180000       31.184571 
      5       69.140000       31.176125 
      5       69.110000       31.206081 
      5       69.150000       31.223633 
      5       69.090000       31.264360 
      6       69.060000       31.304241 
      6       69.040000       31.311465 
      6       69.100000       31.299312 
      6       69.080000       31.246045 
      6       69.060000       31.214651 
      6       68.940000       31.261743 
      6       68.940000       31.302439 
      6       68.940000       31.314180 
      7       68.980000       31.312768 
      7       68.930000       31.304738 
      7       68.980000       31.270243 
      7       68.990000       31.254546 
      7       68.900000       31.285940 
      7       68.920000       31.307839 
      7       69.100000       31.314650 
      7       69.250000       31.313654 
      7       69.290000       31.315106 
      7       69.260000       31.313668 
      7       69.370000       31.315106 
      7       69.260000       31.313668 
      8       69.310000       31.315106 
      8       69.370000       31.313668 
      8       69.290000       31.315106 
      8       69.300000       31.313668 
      8       69.320000       31.315106 
      8       69.370000       31.313668 
      9       69.320000       31.315106 
      9       69.320000       31.313668 
      9       69.330000       31.315106 
      9       69.340000       31.313668 
      9       69.330000       31.315106 
      9       69.390000       31.313654 
      9       69.340000       31.314650 
      9       69.360000       31.307839 
      9       69.350000       31.285940 
      9       69.380000       31.254546 
      10       69.310000       31.270243 
      10       69.380000       31.304738 
      10       69.380000       31.312795 
      10       69.250000       31.315080 
      10       69.400000       31.313667 
      10       69.350000       31.315080 
      10       69.440000       31.312795 
      10       69.270000       31.304738 
      11       69.340000       31.270243 
      11       69.300000       31.254546 
      11       69.360000       31.285940 
      11       69.270000       31.307839 
      12       69.360000       31.314650 
      12       69.340000       31.313654 
      12       69.310000       31.315106 
      12       69.350000       31.313654 
      13       69.300000       31.314663 
      13       69.380000       31.308269 
      13       69.350000       31.290909 
      13       69.340000       31.273774 
      13       69.310000       31.290909 
      13       69.350000       31.308255 
      14       69.230000       31.314220 
      14       69.360000       31.308255 
      14       69.340000       31.290909 
      14       69.210000       31.273774 
      14       69.340000       31.290909 
      14       69.330000       31.308255 
      14       69.210000       31.314220 
      14       69.310000       31.308255 
      15       69.280000       31.290909 
      15       69.250000       31.273774 
      15       69.270000       31.290909 
      15       69.350000       31.308269 
      15       69.300000       31.314663 
      15       69.300000       31.313654 
      15       69.310000       31.315106 
      16       69.300000       31.313668 
      16       69.340000       31.315106 
      16       69.340000       31.313668 
      16       69.340000       31.315106 
      16       69.320000       31.313668 
      16       69.410000       31.315106 
      16       69.260000       31.313668 
      16       69.330000       31.315106 
      17       69.310000       31.313668 
      17       69.290000       31.315106 
      17       69.340000       31.313668 
      17       69.360000       31.315106 
      17       69.430000       31.313668 
      17       69.300000       31.315106 
      17       69.330000       31.313668 
      17       69.290000       31.315079 
      17       69.370000       31.312781 
      17       69.270000       31.304308 
      18       69.310000       31.265260 
      18       69.350000       31.234861 
      18       69.300000       31.259445 
      18       69.270000       31.275142 
      18       69.200000       31.253659 
      18       69.390000       31.270216 
      18       69.310000       31.304738 
      19       70.110000       31.312795 
      19       70.190000       31.315080 
      19       70.180000       31.313668 
      19       70.100000       31.315106 
      19       70.210000       31.313654 
      19       70.210000       31.314623 
      20       70.200000       31.306952 
      20       70.090000       31.275142 
      20       70.110000       31.206152 
      20       70.120000       31.190454 
      20       70.120000       31.256344 
      20       70.100000       31.301997 
      20       70.120000       31.314193 
      20       70.150000       31.313641 
      20       70.110000       31.315106 
      21       70.060000       31.313668 
      21       70.150000       31.315106 
      21       70.100000       31.313668 
      21       70.180000       31.315106 
      21       70.110000       31.313668 
      21       70.240000       31.315106 
      21       70.130000       31.313668 
      21       70.100000       31.315106 
      21       70.180000       31.313654 
      21       70.090000       31.314663 
      21       70.250000       31.308269 
      21       70.150000       31.290909 
      21       70.160000       31.273773 
      22       70.110000       31.290869 
      22       70.150000       31.306939 
      22       70.130000       31.298466 
      22       70.170000       31.241063 
      22       70.100000       31.195423 
      22       70.120000       31.241077 
      22       70.160000       31.298909 
      22       70.110000       31.312338 
      22       70.140000       31.315039 
      22       70.040000       31.312781 
      23       70.130000       31.304308 
      23       70.140000       31.265273 
      23       70.140000       31.235291 
      23       70.130000       31.264401 
      23       70.100000       31.293940 
      23       70.160000       31.269356 
      23       70.120000       31.254506 
      23       70.100000       31.285497 
      23       70.090000       31.302440 
      23       70.170000       31.290453 
      24       70.190000       31.273760 
      24       70.160000       31.290909 
      24       70.070000       31.308268 
      24       70.210000       31.314636 
      24       70.060000       31.312781 
      24       70.140000       31.304724 
      24       70.090000       31.269786 
      24       70.170000       31.248717 
      24       70.070000       31.256774 
      24       70.110000       31.248717 
      25       70.070000       31.269786 
      25       70.140000       31.304724 
      25       70.060000       31.312795 
      25       70.070000       31.315080 
      25       70.160000       31.313668 
      26       70.040000       31.315106 
      26       70.170000       31.313654 
      26       70.180000       31.314663 
      26       70.070000       31.308268 
      26       70.080000       31.290882 
      26       70.160000       31.272887 
      27       70.130000       31.280111 
      27       70.080000       31.259875 
      27       70.120000       31.234875 
      27       70.120000       31.265260 
      27       70.070000       31.304281 
      28       70.110000       31.311908 
      28       70.070000       31.304711 
      28       70.110000       31.270216 
      28       70.120000       31.253659 
      29       70.060000       31.275142 
      29       70.110000       31.259445 
      29       70.070000       31.234861 
      29       70.090000       31.265260 
      29       70.060000       31.304308 
      29       70.120000       31.312781 
      29       70.110000       31.315079 
      29       70.080000       31.313668 
      29       70.110000       31.315106 
      30       70.070000       31.313668 
      30       70.140000       31.315106 
      30       70.070000       31.313668 
      30       70.120000       31.315106 
      30       70.070000       31.313668 
      31       70.090000       31.315106 
      31       70.160000       31.313668 
      31       70.080000       31.315106 
      31       70.090000       31.313668 
      31       70.060000       31.315106 
      31       70.110000       31.313668 
      31       70.090000       31.315106 
      32       70.060000       31.313668 
      32       70.110000       31.315106 
      32       70.130000       31.313668 
      32       70.120000       31.315106 
      32       70.120000       31.313668 
      32       70.130000       31.315106 
      32       70.160000       31.313654 
      32       70.110000       31.314650 
      32       70.050000       31.307839 
      33       70.100000       31.285940 
      33       70.130000       31.254546 
      33       70.180000       31.270243 
      33       70.020000       31.304711 
      33       70.100000       31.311908 
      34       70.050000       31.304281 
      34       70.110000       31.265273 
      34       70.160000       31.235318 
      34       70.190000       31.265274 
      34       70.010000       31.304308 
      34       70.140000       31.312781 
      34       70.130000       31.315079 
      34       70.040000       31.313668 
      34       70.060000       31.315106 
      34       70.140000       31.313654 
      35       70.130000       31.314650 
      35       70.050000       31.307839 
      35       70.130000       31.285940 
      35       70.080000       31.254546 
      35       70.060000       31.270243 
      35       70.100000       31.304738 
      35       70.070000       31.312754 
      35       70.080000       31.313737 
      35       70.080000       31.297040 
      35       70.070000       31.237546 
      36       70.070000       31.174757 
      36       70.120000       31.221848 
      36       70.090000       31.293913 
      36       70.060000       31.311035 
      36       70.080000       31.304685 
      36       70.060000       31.270242 
      36       70.130000       31.254532 
      36       70.160000       31.285484 
      36       70.090000       31.302010 
      36       70.100000       31.285484 
      36       70.180000       31.254532 
      37       70.070000       31.270229 
      37       70.030000       31.304295 
      37       70.070000       31.307396 
      37       70.130000       31.290883 
      38       70.020000       31.273773 
      38       70.100000       31.290883 
      38       70.160000       31.307396 
      38       70.090000       31.304295 
      38       70.090000       31.270229 
      38       70.150000       31.254532 
      38       70.050000       31.285497 
      38       70.080000       31.302426 
      39       70.050000       31.290010 
      39       70.130000       31.268388 
      39       70.090000       31.267585 
      39       70.040000       31.278743 
      39       70.070000       31.333891 
      39       70.080000       31.368789 
      39       70.080000       31.341517 
      39       70.110000       31.310540 
      39       70.100000       31.270243 
      40       70.080000       31.248730 
      40       70.100000       31.256774 
      40       70.130000       31.248690 
      40       70.100000       31.268913 
      40       70.140000       31.294356 
      40       70.070000       31.269370 
      40       70.070000       31.254519 
      40       70.100000       31.285940 
      41       70.090000       31.307825 
      41       70.140000       31.314207 
      41       70.110000       31.308255 
      41       70.140000       31.290909 
      41       70.140000       31.273774 
      41       70.110000       31.290909 
      41       70.080000       31.308255 
      41       70.110000       31.314220 
      41       70.130000       31.308242 
      41       70.140000       31.290466 
      41       70.070000       31.268375 
      42       70.150000       31.266712 
      42       70.060000       31.268375 
      42       70.130000       31.290466 
      42       70.100000       31.308255 
      42       70.160000       31.314663 
      42       70.120000       31.313654 
      42       70.100000       31.315106 
      42       70.110000       31.313668 
      42       70.190000       31.315106 
      43       70.110000       31.313668 
      43       70.200000       31.315106 
      43       70.070000       31.313668 
      43       70.100000       31.315106 
      43       70.150000       31.313668 
      43       70.120000       31.315079 
      43       70.160000       31.312781 
      43       70.120000       31.304308 
      43       70.150000       31.265274 
      43       70.050000       31.235318 
      44       70.120000       31.265274 
      44       70.060000       31.304308 
      44       70.150000       31.312781 
      44       70.090000       31.315079 
      44       70.150000       31.313654 
      44       70.110000       31.314663 
      44       70.180000       31.308269 
      44       70.090000       31.290909 
      44       70.090000       31.273774 
      44       70.120000       31.290909 
      44       70.160000       31.308268 
      44       70.150000       31.314636 
      44       70.080000       31.312768 
      45       70.150000       31.304308 
      45       70.080000       31.265274 
      45       70.110000       31.235318 
      45       70.080000       31.265260 
      45       70.040000       31.303865 
      45       70.120000       31.307382 
      45       70.080000       31.290882 
      45       70.140000       31.273773 
      45       70.120000       31.290909 
      45       70.100000       31.308269 
      46       70.090000       31.314663 
      46       70.060000       31.313654 
      46       70.120000       31.315106 
      46       70.060000       31.313668 
      46       70.110000       31.315106 
      46       70.120000       31.313668 
      47       70.110000       31.315106 
      47       70.070000       31.313668 
      47       70.150000       31.315106 
      47       70.090000       31.313668 
      47       70.090000       31.315106 
      47       70.120000       31.313668 
      47       70.120000       31.315106 
      47       70.090000       31.313668 
      47       70.100000       31.315106 
      47       70.140000       31.313668 
      47       70.110000       31.315106 
      48       70.130000       31.313654 
      48       70.080000       31.314663 
      48       70.070000       31.308269 
      48       70.090000       31.290909 
      48       70.110000       31.273773 
      48       70.060000       31.290883 
      48       70.070000       31.307396 
      48       70.150000       31.304295 
      48       70.080000       31.270229 
      48       70.140000       31.254545 
      48       70.090000       31.285913 
      48       70.150000       31.306966 
      49       70.150000       31.304268 
      49       70.080000       31.269773 
      49       70.100000       31.248716 
      49       70.120000       31.256774 
      49       70.050000       31.248716 
      49       70.100000       31.269773 
      49       70.080000       31.304281 
      49       70.100000       31.307395 
      49       70.080000       31.290856 
      50       70.100000       31.272887 
      50       70.090000       31.280111 
      50       70.090000       31.259875 
      50       70.140000       31.234875 
      50       70.090000       31.265260 
      50       70.080000       31.304281 
      50       70.050000       31.311908 
      50       70.120000       31.304711 
      50       70.100000       31.270215 
      50       70.130000       31.253632 
      51       70.070000       31.274229 
      51       70.130000       31.247773 
      51       70.120000       31.176099 
      51       70.100000       31.142047 
      51       70.100000       31.195340 
      51       70.090000       31.273799 
      52       70.080000       31.301097 
      52       70.070000       31.285457 
      52       70.100000       31.254532 
      52       70.110000       31.270229 
      52       70.100000       31.304295 
      52       70.090000       31.307382 
      52       70.080000       31.290426 
      53       70.180000       31.267944 
      53       70.120000       31.261743 
      53       70.140000       31.249147 
      53       70.140000       31.269800 
      53       70.100000       31.304724 
      53       70.120000       31.312781 
      53       70.100000       31.314636 
      54       70.120000       31.308268 
      54       70.130000       31.290909 
      54       70.100000       31.273774 
      54       70.070000       31.290909 
      54       70.100000       31.308269 
      54       70.090000       31.314663 
      54       70.150000       31.313654 
      54       70.140000       31.315106 
      54       70.070000       31.313668 
      54       70.080000       31.315106 
      54       70.090000       31.313668 
      54       70.080000       31.315106 
      54       70.150000       31.313668 
      55       70.120000       31.315079 
      55       70.090000       31.312781 
      55       70.100000       31.304308 
      55       70.110000       31.265273 
      55       70.150000       31.235291 
      55       70.060000       31.264387 
      55       70.110000       31.293510 
      55       70.110000       31.264387 
      56       70.160000       31.235251 
      56       70.110000       31.263944 
      56       70.110000       31.288084 
      56       70.030000       31.239317 
      56       70.110000       31.185029 
      56       70.100000       31.197651 
      56       70.140000       31.238348 
      56       70.130000       31.284610 
      56       70.140000       31.307799 
      56       70.100000       31.314649 
      56       70.110000       31.313654 
      57       70.130000       31.315079 
      57       70.120000       31.312755 
      57       70.100000       31.303422 
      57       70.110000       31.254476 
      57       70.090000       31.186924 
      57       70.140000       31.185485 
      57       70.110000       31.255914 
      57       70.110000       31.301956 
      57       70.160000       31.313280 
      57       70.130000       31.301956 
      58       70.120000       31.255914 
      58       70.150000       31.185485 
      58       70.100000       31.186897 
      58       70.120000       31.253602 
      58       70.120000       31.293040 
      58       70.170000       31.268887 
      58       70.080000       31.249119 
      58       70.110000       31.261716 
      59       70.070000       31.267071 
      59       70.120000       31.280084 
      59       70.140000       31.264830 
      59       70.140000       31.254102 
      59       70.120000       31.285927 
      59       70.120000       31.307839 
      59       70.060000       31.314650 
      59       70.100000       31.313654 
      59       70.140000       31.315106 
      59       70.140000       31.313668 
      60       70.120000       31.315080 
      60       70.090000       31.312795 
      60       70.080000       31.304725 
      60       70.080000       31.269800 
      60       70.130000       31.249133 
      60       70.140000       31.261300 
      60       70.120000       31.262545 
      60       70.110000       31.266229 
      61       70.110000       31.267475 
