

 time    ||    gripping force   ||   raspberry measurement 

      0       0.040000       -802.182692 
      0       0.100000       -802.182692 
      0       0.060000       -802.182692 
      0       0.080000       -802.182692 
      0       0.060000       -802.182692 
      0       0.100000       -802.182692 
      0       0.130000       -802.182692 
      0       0.060000       -802.182692 
      0       0.060000       -802.182692 
      0       0.050000       -802.182692 
      0       0.070000       -802.182692 
      0       0.000000       -802.182692 
      0       0.680000       -802.182692 
      0       0.500000       -802.182692 
      0       0.000000       -802.182692 
      0       0.350000       -802.182692 
      0       0.060000       -802.182692 
      0       0.060000       -802.182692 
      0       0.280000       -802.182692 
      0       0.220000       -802.182692 
      1       0.360000       -802.182692 
      1       0.060000       -802.182692 
      1       0.050000       -802.182692 
      1       0.260000       -802.182692 
      1       0.150000       -794.160865 
      1       0.110000       -786.219257 
      1       0.230000       -778.357064 
      1       0.260000       -778.357064 
      1       0.290000       -778.357064 
      1       0.200000       -778.357064 
      1       0.450000       -778.357064 
      1       0.600000       -770.573494 
      1       0.390000       -762.867754 
      1       0.650000       -762.867754 
      1       5.130000       -762.867754 
      2       20.360000       -755.237896 
      2       35.040000       -747.579258 
      2       58.920000       -747.579258 
      2       81.160000       -744.024903 
      2       93.620000       -700.723718 
      2       105.370000       -700.723718 
      2       105.900000       -506.658254 
      2       103.840000       -186.688177 
      2       108.160000       7.383072 
      2       109.380000       50.648916 
      2       108.760000       54.164237 
      2       108.270000       54.164237 
      2       106.950000       54.268454 
      2       103.730000       54.290686 
      2       93.230000       54.322100 
      2       77.150000       54.307826 
      2       61.790000       54.292672 
      3       43.130000       54.396410 
      3       35.380000       54.702070 
      3       27.580000       55.161179 
      3       26.320000       55.161179 
      3       26.860000       55.620120 
      3       27.120000       55.620120 
      3       27.320000       55.620120 
      3       27.630000       56.011095 
      3       28.640000       56.215511 
      3       29.670000       56.257816 
      3       30.800000       56.262383 
      3       32.510000       56.256002 
      3       34.940000       56.235515 
      3       36.920000       56.179672 
      3       38.750000       56.015676 
      4       39.170000       55.692368 
      4       38.960000       55.374178 
      4       38.250000       55.085348 
      4       37.350000       54.815095 
      4       35.450000       54.642411 
      4       34.470000       54.573747 
      4       33.740000       54.553106 
      4       33.360000       54.513588 
      4       32.690000       54.489018 
      4       32.190000       54.543641 
      4       32.010000       54.628895 
      4       31.940000       54.697863 
      4       31.820000       54.809119 
      4       31.450000       54.972586 
      4       30.920000       55.082479 
      4       29.740000       55.007054 
      5       28.880000       55.007054 
      5       27.860000       54.832013 
      5       27.470000       54.693363 
      5       27.360000       54.693363 
      5       27.350000       54.592615 
      5       27.270000       54.592615 
      5       27.290000       54.522628 
      5       27.320000       54.563823 
      5       27.380000       54.611274 
      5       27.420000       54.611274 
      5       27.430000       54.584392 
      5       27.480000       54.544542 
      5       27.460000       54.522086 
      5       27.550000       54.539639 
      5       27.510000       54.566897 
      6       27.550000       54.610860 
      6       27.600000       54.610860 
      6       27.860000       54.640360 
      6       28.390000       54.599632 
      6       28.930000       54.512647 
      6       29.410000       54.429757 
      6       29.710000       54.402416 
      6       29.910000       54.423428 
      6       30.160000       54.412218 
      6       30.130000       54.401059 
      6       30.260000       54.423831 
      6       30.280000       54.417616 
      6       30.280000       54.425243 
      6       30.340000       54.425243 
      6       30.400000       54.463269 
      6       30.490000       54.435984 
      7       30.410000       54.401503 
      7       30.430000       54.405476 
      7       30.450000       54.401932 
      7       30.410000       54.401932 
      7       30.420000       54.401932 
      7       30.460000       54.440941 
      7       30.380000       54.482107 
      7       30.480000       54.442283 
      7       30.430000       54.418586 
      7       30.440000       54.418586 
      7       30.430000       54.483937 
      7       30.340000       54.551709 
      7       30.330000       54.551709 
      7       30.440000       54.584848 
      7       30.370000       54.609935 
      8       30.370000       54.630628 
      8       30.410000       54.695093 
      8       30.340000       54.707689 
      8       30.390000       54.628747 
      8       30.360000       54.594817 
      8       30.370000       54.594817 
      8       30.360000       54.570840 
      8       30.390000       54.519082 
      8       30.270000       54.476351 
      8       30.360000       54.486745 
      8       30.340000       54.508661 
      8       30.310000       54.600575 
      8       30.350000       54.720591 
      8       30.360000       54.712118 
      8       30.440000       54.616716 
      9       30.300000       54.525688 
      9       30.350000       54.489930 
      9       30.350000       54.489930 
      9       30.320000       54.489930 
      9       30.290000       54.543157 
      9       30.360000       54.621185 
      9       30.350000       54.643475 
      9       30.320000       54.607383 
      9       30.330000       54.607383 
      9       30.340000       54.543074 
      9       30.360000       54.523653 
      9       30.360000       54.603595 
      9       30.350000       54.743207 
      9       30.320000       54.736662 
      10       30.420000       54.664351 
      10       30.310000       54.646203 
      10       30.330000       54.662462 
      10       30.610000       54.606818 
      10       30.340000       54.537371 
      10       30.250000       54.539599 
      10       30.470000       54.539599 
      10       30.410000       54.550283 
      10       30.490000       54.532454 
      10       30.580000       54.491994 
      10       30.540000       54.474661 
      10       30.610000       54.474661 
      10       30.690000       54.492464 
      10       30.570000       54.538726 
      10       30.490000       54.538726 
      11       30.430000       54.584849 
      11       30.260000       54.622971 
      11       30.180000       54.622971 
      11       30.210000       54.623861 
      11       30.050000       54.660198 
      11       29.910000       54.750241 
      11       29.930000       54.724189 
      11       29.780000       54.587177 
      11       29.750000       54.509118 
      11       29.780000       54.506000 
      11       29.780000       54.502443 
      11       29.800000       54.548112 
      11       29.770000       54.627874 
      11       29.770000       54.627874 
      11       29.750000       54.678093 
      11       29.840000       54.691979 
      12       29.790000       54.642283 
      12       29.740000       54.608688 
      12       29.790000       54.645884 
      12       29.800000       54.714444 
      12       29.810000       54.714444 
      12       29.780000       54.785680 
      12       29.780000       54.769995 
      12       29.790000       54.696036 
      12       29.760000       54.644541 
      12       29.780000       54.610415 
      12       29.860000       54.579963 
      12       29.880000       54.579963 
      12       29.960000       54.531972 
      12       30.000000       54.541867 
      12       30.070000       54.564169 
      13       30.070000       54.530669 
      13       30.220000       54.542270 
      13       30.200000       54.542270 
      13       30.210000       54.569621 
      13       30.200000       54.556625 
      13       30.250000       54.603278 
      13       30.270000       54.603278 
      13       30.160000       54.683864 
      13       30.210000       54.680750 
      13       30.250000       54.680750 
      13       30.210000       54.680750 
      13       30.150000       54.582195 
      13       30.210000       54.532441 
      13       30.220000       54.532441 
      13       30.220000       54.545841 
      14       30.190000       54.525726 
      14       30.140000       54.525726 
      14       30.190000       54.541800 
      14       30.190000       54.541800 
      14       30.190000       54.568239 
      14       30.080000       54.539152 
      14       30.100000       54.516288 
      14       30.020000       54.514047 
      14       29.980000       54.595217 
      14       29.980000       54.691922 
      14       29.820000       54.659738 
      14       29.920000       54.612690 
      14       29.900000       54.634616 
      14       29.970000       54.634616 
      14       29.970000       54.654809 
      15       29.940000       54.651655 
      15       29.960000       54.651655 
      15       29.940000       54.612203 
      15       29.940000       54.572323 
      15       29.910000       54.563823 
      15       29.940000       54.561565 
      15       29.910000       54.564266 
      15       29.930000       54.577682 
      15       29.950000       54.635084 
      15       29.930000       54.675768 
      15       29.980000       54.610874 
      15       29.890000       54.531945 
      15       29.970000       54.510029 
      15       29.960000       54.486648 
      15       29.960000       54.474178 
      16       29.930000       54.491121 
      16       29.940000       54.491121 
      16       29.880000       54.522555 
      16       29.960000       54.513130 
      16       29.930000       54.513617 
      16       29.920000       54.513617 
      16       29.940000       54.593405 
      16       29.930000       54.689706 
      16       29.910000       54.689706 
      16       29.930000       54.720675 
      16       29.920000       54.689321 
      16       29.980000       54.653441 
      16       29.950000       54.599744 
      16       29.920000       54.587108 
      16       29.890000       54.653980 
      17       29.900000       54.653980 
      17       29.930000       54.687852 
      17       29.970000       54.658492 
      17       29.820000       54.600910 
      17       29.910000       54.595301 
      17       29.900000       54.605420 
      17       29.920000       54.605420 
      17       29.950000       54.605420 
      17       29.920000       54.608699 
      17       29.960000       54.596910 
      17       29.900000       54.596910 
      17       29.910000       54.616299 
      17       29.950000       54.636331 
      17       29.910000       54.587160 
      17       29.900000       54.532845 
      18       29.960000       54.545024 
      18       29.920000       54.580309 
      18       29.920000       54.580309 
      18       29.910000       54.601958 
      18       29.930000       54.580725 
      18       29.980000       54.549537 
      18       30.090000       54.546244 
      18       30.030000       54.546244 
      18       30.080000       54.578660 
      18       30.050000       54.578660 
      18       29.970000       54.580726 
      18       30.010000       54.572848 
      18       30.010000       54.580712 
      18       30.080000       54.578203 
      18       30.010000       54.540388 
      19       30.010000       54.519484 
      19       30.030000       54.519484 
      19       29.970000       54.510792 
      19       30.000000       54.508270 
      19       30.020000       54.486581 
      19       30.010000       54.473748 
      19       29.940000       54.486165 
      19       29.980000       54.503730 
      19       30.000000       54.503730 
      19       30.030000       54.496493 
      19       29.940000       54.516756 
      19       30.040000       54.516756 
      19       29.920000       54.542642 
      19       30.120000       54.523028 
      19       30.030000       54.523028 
      19       29.970000       54.531515 
      20       30.080000       54.592918 
      20       30.000000       54.601392 
      20       29.970000       54.581348 
      20       30.000000       54.602265 
      20       30.040000       54.603314 
      20       29.940000       54.603314 
      20       30.070000       54.575866 
      20       29.980000       54.575866 
      20       30.110000       54.595664 
      20       30.160000       54.633229 
      20       30.160000       54.656150 
      20       30.160000       54.583481 
      20       30.210000       54.508328 
      20       30.130000       54.565582 
      20       30.150000       54.646725 
      21       30.150000       54.683009 
      21       30.130000       54.691079 
      21       30.100000       54.626072 
      21       30.100000       54.535170 
      21       30.150000       54.514074 
      21       30.130000       54.577235 
      21       30.130000       54.616230 
      21       30.130000       54.590194 
      21       30.120000       54.568322 
      21       30.150000       54.568322 
      21       30.150000       54.557038 
      21       30.040000       54.557038 
      21       30.120000       54.545482 
      21       30.130000       54.562024 
      21       30.070000       54.652085 
      22       30.160000       54.652085 
      22       30.100000       54.709943 
      22       30.070000       54.679826 
      22       30.080000       54.630296 
      22       29.990000       54.621104 
      22       29.970000       54.662564 
      22       30.030000       54.696409 
      22       30.010000       54.696409 
      22       29.910000       54.757509 
      22       30.000000       54.714764 
      22       30.050000       54.611884 
      22       29.920000       54.571385 
      22       29.970000       54.571932 
      22       29.990000       54.600963 
      22       30.010000       54.597405 
      23       29.970000       54.544968 
      23       30.000000       54.516301 
      23       29.910000       54.508661 
      23       29.990000       54.570980 
      23       30.010000       54.650698 
      23       29.970000       54.619343 
      23       30.010000       54.619343 
      23       29.990000       54.534687 
      23       29.940000       54.514100 
      23       30.030000       54.578578 
      23       29.980000       54.632843 
      23       29.940000       54.667311 
      23       29.990000       54.701833 
      23       29.970000       54.626072 
      23       29.960000       54.524402 
      24       30.030000       54.529341 
      24       29.940000       54.586108 
      24       29.970000       54.586108 
      24       30.020000       54.582717 
      24       29.980000       54.548874 
      24       29.950000       54.556707 
      24       29.940000       54.538090 
      24       29.980000       54.533893 
      24       29.990000       54.501323 
      24       30.020000       54.501323 
      24       29.940000       54.460819 
      24       29.950000       54.481696 
      24       29.980000       54.567822 
      24       30.010000       54.594663 
      24       29.960000       54.565567 
      25       29.980000       54.565567 
      25       29.950000       54.539559 
      25       29.940000       54.539559 
      25       29.930000       54.520770 
      25       29.950000       54.528814 
      25       29.980000       54.518073 
      25       29.930000       54.518073 
      25       29.960000       54.526170 
      25       29.910000       54.574994 
      25       29.990000       54.574994 
      25       29.960000       54.596560 
      25       29.940000       54.647642 
      25       29.920000       54.727457 
      25       29.960000       54.773996 
      25       30.000000       54.773996 
      26       29.940000       54.773996 
      26       29.960000       54.783066 
      26       29.970000       54.763241 
      26       29.910000       54.763241 
      26       29.990000       54.743155 
      26       30.010000       54.661524 
      26       29.940000       54.583604 
      26       29.920000       54.583604 
      26       29.950000       54.570525 
      26       29.940000       54.590275 
      26       29.920000       54.616700 
      26       29.940000       54.583534 
      26       29.970000       54.549525 
      26       30.010000       54.629287 
      26       29.980000       54.759237 
      27       29.920000       54.759237 
      27       29.960000       54.804464 
      27       29.950000       54.745386 
      27       29.980000       54.691120 
      27       29.980000       54.651240 
      27       29.870000       54.591661 
      27       29.980000       54.617643 
      27       29.990000       54.658340 
      27       29.920000       54.625270 
      27       29.910000       54.623418 
      27       29.960000       54.652527 
      27       29.970000       54.653909 
      27       29.930000       54.622489 
      27       30.000000       54.622489 
      27       29.890000       54.622489 
      28       29.960000       54.548126 
      28       29.900000       54.548126 
      28       29.940000       54.508259 
      28       29.960000       54.535153 
      28       29.970000       54.567796 
      28       29.930000       54.626615 
      28       29.980000       54.708075 
      28       29.870000       54.703216 
      28       29.960000       54.703216 
      28       29.960000       54.603292 
      28       29.910000       54.623972 
      28       30.030000       54.747085 
      28       30.010000       54.763764 
      28       30.010000       54.700979 
      28       29.920000       54.700979 
      29       29.970000       54.669610 
      29       29.940000       54.661054 
      29       30.020000       54.650809 
      29       29.990000       54.596450 
      29       29.980000       54.596450 
      29       29.980000       54.504701 
      29       30.010000       54.463395 
      29       29.900000       54.510473 
      29       30.010000       54.560652 
      29       29.960000       54.605945 
      29       30.000000       54.628760 
      29       29.930000       54.631058 
      29       30.020000       54.681265 
      29       30.050000       54.706331 
      29       30.100000       54.648139 
      29       30.080000       54.624845 
      30       30.040000       54.624845 
      30       30.090000       54.712646 
      30       30.130000       54.804531 
      30       30.140000       54.794193 
      30       30.100000       54.722518 
      30       30.090000       54.672322 
      30       30.070000       54.672322 
      30       30.040000       54.653467 
      30       30.030000       54.617616 
      30       30.100000       54.617616 
      30       29.980000       54.595647 
      30       30.090000       54.595647 
      30       30.090000       54.593376 
      30       30.110000       54.543210 
      30       30.130000       54.519473 
      31       30.090000       54.593875 
      31       30.100000       54.690150 
      31       30.080000       54.725657 
      31       30.030000       54.708938 
      31       30.040000       54.677707 
      31       30.090000       54.604989 
      31       30.140000       54.521285 
      31       30.130000       54.468794 
      31       30.050000       54.518556 
      31       30.160000       54.592919 
      31       30.100000       54.614432 
      31       30.060000       54.638269 
      31       30.150000       54.656958 
      31       30.110000       54.672861 
      31       30.120000       54.704896 
      32       30.060000       54.723067 
      32       30.070000       54.684296 
      32       30.160000       54.684296 
      32       30.140000       54.652266 
      32       30.000000       54.654797 
      32       30.100000       54.719844 
      32       30.160000       54.735475 
      32       30.100000       54.737325 
      32       30.020000       54.725589 
      32       29.960000       54.616314 
      32       29.970000       54.616314 
      32       30.040000       54.594377 
      32       29.890000       54.594377 
      32       29.970000       54.664222 
      32       29.950000       54.679892 
      33       30.000000       54.679892 
      33       29.990000       54.679892 
      33       29.920000       54.678194 
      33       29.960000       54.704493 
      33       29.940000       54.713611 
      33       29.950000       54.652059 
      33       29.930000       54.643739 
      33       29.990000       54.643739 
      33       29.930000       54.643739 
      33       29.910000       54.709848 
      33       29.920000       54.709848 
      33       29.930000       54.707743 
      33       29.920000       54.615845 
      33       29.970000       54.606016 
      33       30.000000       54.659739 
      34       29.960000       54.659739 
      34       29.950000       54.659739 
      34       29.930000       54.718944 
      34       29.970000       54.718944 
      34       30.000000       54.718944 
      34       29.960000       54.718944 
      34       29.950000       54.785237 
      34       29.970000       54.760070 
      34       30.000000       54.760070 
      34       29.950000       54.760070 
      34       29.940000       54.657594 
      34       29.990000       54.603732 
      34       29.930000       54.603732 
      34       30.000000       54.603732 
      34       29.920000       54.611386 
      35       29.960000       54.631985 
      35       29.990000       54.710847 
      35       29.940000       54.710847 
      35       29.980000       54.774881 
      35       29.950000       54.724259 
      35       30.030000       54.628414 
      35       29.910000       54.574109 
      35       29.930000       54.569732 
      35       29.970000       54.592021 
      35       29.940000       54.638310 
      35       29.990000       54.680752 
      35       30.010000       54.714018 
      35       29.900000       54.743544 
      35       29.970000       54.780280 
      35       29.970000       54.716163 
      36       29.950000       54.584972 
      36       29.970000       54.513105 
      36       29.980000       54.470676 
      36       29.920000       54.529284 
      36       29.960000       54.640401 
      36       29.970000       54.640401 
      36       29.930000       54.616672 
      36       29.940000       54.598348 
      36       29.920000       54.605463 
      36       29.960000       54.604683 
      36       29.940000       54.656156 
      36       29.900000       54.656156 
      36       29.900000       54.696090 
      36       29.960000       54.760168 
      36       29.960000       54.813518 
      36       29.900000       54.793281 
      37       30.010000       54.788049 
      37       29.920000       54.764098 
      37       29.970000       54.684529 
      37       29.900000       54.593797 
      37       29.910000       54.593797 
      37       30.020000       54.593797 
      37       29.930000       54.593797 
      37       29.970000       54.608770 
      37       30.010000       54.674437 
      37       30.010000       54.643638 
      37       29.940000       54.643638 
      37       29.890000       54.643638 
      37       29.950000       54.557113 
      37       29.870000       54.599705 
      37       30.100000       54.682147 
      38       30.070000       54.684848 
      38       30.120000       54.679510 
      38       30.060000       54.715277 
      38       30.070000       54.715277 
      38       30.070000       54.761106 
      38       30.110000       54.720646 
      38       30.120000       54.639656 
      38       30.020000       54.632415 
      38       30.090000       54.687533 
      38       30.120000       54.676336 
      38       30.030000       54.676336 
      38       30.030000       54.631542 
      38       30.160000       54.640472 
      38       30.040000       54.666520 
      38       30.020000       54.706805 
      39       30.050000       54.732843 
      39       30.020000       54.739045 
      39       30.090000       54.739045 
      39       30.000000       54.748138 
      39       30.110000       54.705888 
      39       30.080000       54.662069 
      39       30.040000       54.690748 
      39       30.050000       54.795049 
      39       30.030000       54.795049 
      39       30.060000       54.782566 
      39       30.030000       54.782566 
      39       30.090000       54.671409 
      39       30.100000       54.647669 
      39       30.150000       54.647669 
      39       30.050000       54.587521 
      40       30.020000       54.546920 
      40       29.990000       54.546920 
      40       30.010000       54.594639 
      40       30.050000       54.605999 
      40       30.000000       54.596587 
      40       30.120000       54.617564 
      40       30.070000       54.671023 
      40       30.070000       54.806706 
      40       30.030000       54.841227 
      40       30.080000       54.841227 
      40       30.050000       54.664225 
      40       30.000000       54.664225 
      40       30.100000       54.562609 
      40       30.060000       54.562609 
      40       30.000000       54.562609 
      41       30.030000       54.604534 
      41       30.130000       54.650862 
      41       30.040000       54.654730 
      41       30.030000       54.632870 
      41       30.060000       54.592034 
      41       30.010000       54.575534 
      41       30.060000       54.602792 
      41       30.060000       54.680848 
      41       30.040000       54.730031 
      41       30.000000       54.686676 
      41       30.050000       54.632388 
      41       30.040000       54.632388 
      41       30.070000       54.639571 
      41       30.010000       54.654326 
      41       30.070000       54.640064 
      42       30.040000       54.555670 
      42       30.050000       54.476535 
      42       30.100000       54.580876 
      42       30.040000       54.743483 
      42       30.100000       54.718460 
      42       29.970000       54.694710 
      42       30.050000       54.743500 
      42       29.990000       54.668704 
      42       29.990000       54.545969 
      42       29.910000       54.520762 
      42       29.970000       54.605985 
      42       29.960000       54.669953 
      42       29.860000       54.610834 
      42       29.950000       54.536484 
      42       29.940000       54.524758 
      42       29.880000       54.494386 
      43       29.960000       54.492508 
      43       29.910000       54.492508 
      43       29.940000       54.583993 
      43       29.970000       54.583993 
      43       29.940000       54.656953 
      43       29.980000       54.643168 
      43       29.940000       54.643168 
      43       29.940000       54.568270 
      43       29.890000       54.588573 
      43       29.950000       54.683410 
      43       29.910000       54.709974 
      43       29.910000       54.713048 
      43       29.940000       54.703189 
      43       29.920000       54.597432 
      44       29.940000       54.529815 
      44       29.930000       54.583077 
      44       29.970000       54.630542 
      44       29.900000       54.592103 
      44       29.940000       54.557472 
      44       29.940000       54.590318 
      44       29.940000       54.628770 
      44       29.910000       54.649481 
      44       29.860000       54.632831 
      44       29.920000       54.682220 
      44       29.940000       54.682220 
      44       29.890000       54.781140 
      44       29.910000       54.787491 
      44       29.920000       54.705918 
      44       29.950000       54.601047 
      45       29.910000       54.550022 
      45       29.920000       54.618986 
      45       29.960000       54.716645 
      45       29.930000       54.752916 
      45       29.910000       54.744026 
      45       29.940000       54.661883 
      45       29.950000       54.661883 
      45       29.880000       54.521785 
      45       29.860000       54.482707 
      45       29.960000       54.482707 
      45       29.960000       54.585372 
      45       29.890000       54.621130 
      45       29.940000       54.621130 
      45       29.930000       54.621130 
      45       30.120000       54.622199 
      46       30.100000       54.707637 
      46       30.090000       54.707637 
      46       30.110000       54.786162 
      46       30.030000       54.783425 
      46       30.060000       54.756167 
      46       30.080000       54.697375 
      46       30.060000       54.697375 
      46       30.080000       54.697375 
      46       30.050000       54.611429 
      46       30.120000       54.603332 
      46       30.030000       54.717102 
      46       30.040000       54.774465 
      46       30.120000       54.774465 
      46       30.080000       54.774465 
      46       30.030000       54.713531 
      47       30.050000       54.645374 
      47       30.030000       54.601972 
      47       30.040000       54.602345 
      47       30.050000       54.585349 
      47       30.120000       54.585349 
      47       30.070000       54.564226 
      47       30.040000       54.618528 
      47       30.100000       54.610304 
      47       30.060000       54.538783 
      47       30.020000       54.532389 
      47       30.070000       54.587559 
      47       30.000000       54.577222 
      47       30.020000       54.542314 
      47       30.040000       54.588007 
      47       30.050000       54.636424 
      48       30.000000       54.618503 
      48       30.040000       54.623502 
      48       30.020000       54.725589 
      48       30.090000       54.796031 
      48       30.100000       54.739045 
      48       30.090000       54.684962 
      48       30.010000       54.687467 
      48       30.050000       54.707826 
      48       30.020000       54.707826 
      48       30.020000       54.704467 
      48       30.080000       54.683159 
      48       30.070000       54.635889 
      48       30.070000       54.635889 
      48       30.060000       54.601157 
      48       30.070000       54.601004 
      48       30.050000       54.655766 
      48       30.040000       54.655766 
      49       30.100000       54.696050 
      49       30.070000       54.696050 
      49       30.000000       54.759308 
      49       29.990000       54.803606 
      49       30.010000       54.755725 
      49       30.060000       54.757984 
      49       30.000000       54.811703 
      49       30.050000       54.795146 
      49       30.040000       54.728388 
      49       30.070000       54.702389 
      49       30.080000       54.702389 
      49       29.990000       54.702389 
      49       30.060000       54.702389 
      49       30.010000       54.723871 
      50       30.090000       54.717643 
      50       30.070000       54.726116 
      50       30.090000       54.773650 
      50       29.990000       54.779852 
      50       30.080000       54.767436 
      50       29.940000       54.756528 
      50       29.910000       54.738725 
      50       29.810000       54.720717 
      50       29.870000       54.720717 
      50       29.830000       54.720717 
      50       29.800000       54.727941 
      50       29.790000       54.707678 
      50       29.780000       54.681818 
      50       29.830000       54.702252 
      50       29.850000       54.702401 
      51       29.770000       54.702401 
      51       29.730000       54.702401 
      51       29.830000       54.664169 
      51       29.860000       54.636082 
      51       29.870000       54.601447 
      51       29.780000       54.626200 
      51       29.800000       54.690194 
      51       29.820000       54.758351 
      51       29.810000       54.732760 
      51       29.850000       54.621244 
      51       29.840000       54.605573 
      51       30.000000       54.605573 
      51       29.990000       54.648928 
      51       30.040000       54.669677 
      51       30.070000       54.669677 
      52       30.070000       54.695093 
      52       30.070000       54.668681 
      52       30.080000       54.591218 
      52       30.090000       54.594789 
      52       30.000000       54.630157 
      52       30.030000       54.660695 
      52       30.040000       54.660695 
      52       30.100000       54.660695 
      52       30.070000       54.751145 
      52       30.020000       54.798675 
      52       30.010000       54.725159 
      52       30.020000       54.615902 
      52       30.050000       54.588048 
      52       30.030000       54.650367 
      52       30.010000       54.650367 
      53       30.020000       54.684392 
      53       30.020000       54.705488 
      53       30.040000       54.699150 
      53       29.990000       54.699150 
      53       30.090000       54.661111 
      53       30.040000       54.686677 
      53       30.050000       54.701348 
      53       30.050000       54.701348 
      53       30.070000       54.622572 
      53       30.050000       54.566968 
      53       30.010000       54.566968 
      53       29.990000       54.593832 
      53       30.010000       54.577719 
      53       30.070000       54.543240 
      53       30.060000       54.599678 
      54       30.010000       54.599678 
      54       30.080000       54.695160 
      54       30.040000       54.740857 
      54       30.020000       54.722545 
      54       30.000000       54.726519 
      54       30.030000       54.772764 
      54       30.070000       54.768584 
      54       30.110000       54.712756 
      54       30.040000       54.641731 
      54       30.070000       54.641731 
      54       30.020000       54.601627 
      54       30.070000       54.601461 
      54       30.020000       54.601461 
      54       30.040000       54.601461 
      54       29.980000       54.661165 
      55       30.030000       54.720220 
      55       29.990000       54.798289 
      55       30.020000       54.816092 
      55       30.000000       54.701019 
      55       30.100000       54.701019 
      55       30.100000       54.701019 
      55       30.070000       54.618573 
      55       30.070000       54.624758 
      55       30.040000       54.612324 
      55       30.010000       54.603235 
      55       30.050000       54.649457 
      55       30.000000       54.721074 
      55       30.060000       54.735912 
      55       30.090000       54.591564 
      55       30.030000       54.466233 
      56       29.980000       54.502834 
      56       30.040000       54.611841 
      56       30.050000       54.718431 
      56       30.030000       54.761912 
      56       30.040000       54.725605 
      56       30.010000       54.725605 
      56       29.980000       54.721685 
      56       29.970000       54.731831 
      56       30.030000       54.731831 
      56       30.010000       54.668389 
      56       30.050000       54.668389 
      56       30.090000       54.668389 
      56       30.070000       54.668389 
      56       30.040000       54.668389 
      56       30.040000       54.617578 
      57       30.000000       54.617578 
      57       29.990000       54.665692 
      57       30.100000       54.718415 
      57       30.050000       54.730186 
      57       30.000000       54.715321 
      57       30.030000       54.775434 
      57       30.050000       54.775434 
      57       30.040000       54.792338 
      57       30.030000       54.684033 
      57       30.020000       54.684033 
      57       30.050000       54.624359 
      57       30.050000       54.606416 
      57       30.050000       54.591674 
      57       30.060000       54.662883 
      57       30.020000       54.729601 
      57       30.000000       54.729601 
      58       30.090000       54.699619 
      58       30.050000       54.623002 
      58       30.000000       54.573692 
      58       29.960000       54.573692 
      58       30.090000       54.573692 
      58       29.990000       54.570565 
      58       30.080000       54.601489 
      58       29.970000       54.601489 
      58       29.860000       54.601489 
      58       29.830000       54.670479 
      58       29.820000       54.687023 
      58       29.800000       54.630628 
      58       29.800000       54.630628 
      58       29.810000       54.618033 
      58       29.850000       54.623012 
      59       29.860000       54.592034 
      59       29.840000       54.585419 
      59       29.810000       54.585419 
      59       29.740000       54.640401 
      59       29.800000       54.712685 
      59       29.850000       54.712685 
      59       29.860000       54.704036 
      59       29.760000       54.704036 
      59       29.850000       54.673277 
      59       29.780000       54.662343 
      59       29.900000       54.662050 
      59       29.930000       54.649814 
      59       29.950000       54.603770 
      59       29.900000       54.534188 
      59       29.910000       54.534188 
      60       29.970000       54.545108 
      60       29.880000       54.545108 
      60       29.870000       54.645287 
      60       29.870000       54.706427 
      60       29.930000       54.664585 
      60       30.020000       54.636568 
      60       30.090000       54.671367 
      60       30.050000       54.749037 
      60       30.080000       54.784755 
      60       30.130000       54.809531 
      60       30.010000       54.806304 
      60       30.050000       54.718999 
      60       30.050000       54.660767 
      60       30.040000       54.660767 
      60       30.050000       54.748542 
      60       30.040000       54.874479 
      61       30.100000       54.882522 
