Human trial picking the raspberry twin 

 time    ||     output     ||     loadcell

      0.000000       -797.121875       0.110000 
      0.015950       -797.121875       0.190000 
      0.030276       -797.121875       0.020000 
      0.047122       -797.121875       0.150000 
      0.061201       -797.121875       0.040000 
      0.076951       -797.121875       0.090000 
      0.090952       -797.121875       0.010000 
      0.106534       -797.121875       0.080000 
      0.123334       -797.121875       0.190000 
      0.138968       -797.121870       0.140000 
      0.153772       -797.120685       0.130000 
      0.169767       -797.013996       0.110000 
      0.186923       -793.480966       0.060000 
      0.201887       -750.440657       0.030000 
      0.216918       -557.556477       0.090000 
      0.232084       -239.576528       0.000000 
      0.246840       -46.729970       0.000000 
      0.262882       -3.665921       0.110000 
      0.276199       -0.121750       0.230000 
      0.293411       -0.048574       0.240000 
      0.307459       -0.090963       0.090000 
      0.321686       -0.110603       0.630000 
      0.337290       -0.097217       0.040000 
      0.353235       -0.081963       0.930000 
      0.369290       -0.097647       0.120000 
      0.385548       -0.115572       0.870000 
      0.400629       -0.110172       0.280000 
      0.415596       -0.067594       1.190000 
      0.430589       -0.011599       0.120000 
      0.446518       0.001426       1.320000 
      0.460681       0.001870       0.120000 
      0.477302       -0.005731       1.490000 
      0.492666       -0.037112       1.410000 
      0.507440       -0.035296       1.640000 
      0.523532       -0.003489       1.410000 
      0.539811       0.007695       1.680000 
      0.556002       -0.034826       1.330000 
      0.571250       -0.042024       0.230000 
      0.586619       0.039550       1.110000 
      0.601700       0.079387       0.270000 
      0.618236       0.046733       0.730000 
      0.634099       -0.015612       0.410000 
      0.650016       -0.055923       0.700000 
      0.665663       -0.046497       0.490000 
      0.681623       -0.038054       1.210000 
      0.696359       -0.070708       0.780000 
      0.711829       -0.101672       1.050000 
      0.726769       -0.070238       0.600000 
      0.743508       -0.031783       1.060000 
      0.757654       -0.011959       0.420000 
      0.773934       0.026483       0.990000 
      0.789895       0.057461       0.470000 
      0.805801       0.020694       0.870000 
      0.821938       -0.040239       0.410000 
      0.837905       -0.080119       0.690000 
      0.853035       -0.067111       0.280000 
      0.869039       -0.034896       0.350000 
      0.883588       -0.033055       0.290000 
      0.898611       0.001870       0.390000 
      0.915546       0.028751       0.240000 
      0.931697       -0.013787       0.500000 
      0.945832       -0.034840       0.730000 
      0.962251       -0.020985       0.400000 
      0.975934       0.001897       0.500000 
      0.992298       0.017567       0.390000 
      1.007600       -0.003073       0.610000 
      1.023274       -0.040642       0.280000 
      1.038607       -0.060436       0.610000 
      1.054605       -0.035269       0.150000 
      1.069759       0.020695       0.530000 
      1.084877       0.052505       0.180000 
      1.099579       0.007255       0.370000 
      1.115227       -0.032612       0.220000 
      1.129446       -0.034883       0.200000 
      1.146102       -0.067124       0.320000 
      1.160609       -0.080563       0.110000 
      1.176672       -0.045638       0.470000 
      1.192060       -0.003476       0.180000 
      1.207957       0.018440       0.450000 
      1.223332       0.012654       0.330000 
      1.238368       0.026080       0.510000 
      1.253669       0.028765       0.210000 
      1.269303       -0.037554       0.570000 
      1.284003       -0.075150       0.250000 
      1.300603       -0.050124       0.590000 
      1.314610       -0.021857       0.290000 
      1.330089       0.006826       0.240000 
      1.347023       0.036808       0.280000 
      1.361976       0.018037       0.260000 
      1.377991       -0.031725       0.220000 
      1.392056       -0.034800       0.240000 
      1.407519       -0.001743       0.480000 
      1.424527       0.027949       0.340000 
      1.438435       0.045322       0.430000 
      1.454081       0.039563       0.240000 
      1.469069       -0.007542       0.430000 
      1.485336       -0.011502       0.150000 
      1.500839       0.008138       0.460000 
      1.515794       -0.021414       0.130000 
      1.531809       -0.046024       0.320000 
      1.547415       -0.002630       0.130000 
      1.563390       0.028335       0.390000 
      1.579346       -0.013801       0.150000 
      1.595303       -0.034867       0.150000 
      1.611121       -0.021898       0.020000 
      1.626556       -0.009788       0.350000 
      1.641543       -0.041625       0.100000 
      1.655426       -0.131269       0.160000 
      1.671382       -0.169294       0.350000 
      1.687752       -0.125900       0.100000 
      1.702712       -0.081506       0.240000 
      1.719294       -0.063095       0.090000 
      1.734348       -0.026867       0.310000 
      1.750486       -0.001245       0.130000 
      1.766695       0.004541       0.230000 
      1.780658       0.009510       0.040000 
      1.794687       -0.042524       0.190000 
      1.811612       -0.075607       0.120000 
      1.825807       -0.051024       0.090000 
      1.842345       -0.032656       0.020000 
      1.857027       -0.041568       0.240000 
      1.873434       -0.042981       0.240000 
      1.888570       -0.030384       0.170000 
      1.903528       -0.043410       0.350000 
      1.918724       -0.046538       0.200000 
      1.935165       -0.051924       0.350000 
      1.950034       -0.073006       0.020000 
      1.965160       -0.094919       0.200000 
      1.982239       -0.112471       0.050000 
      1.997950       -0.095349       0.170000 
      2.013305       -0.078002       0.060000 
      2.027876       -0.072024       0.220000 
      2.045199       -0.077519       0.050000 
      2.060366       -0.088620       0.290000 
      2.075728       -0.072090       0.030000 
      2.091891       0.017124       0.170000 
      2.106101       0.065475       0.070000 
      2.121714       0.001910       0.120000 
      2.137658       -0.068462       0.010000 
      2.152813       -0.050054       0.190000 
      2.183583       0.037291       0.040000 
      2.199748       0.081658       0.100000 
      2.215496       0.055206       0.050000 
      2.230609       0.023396       0.080000 
      2.245476       -0.026813       0.120000 
      2.261869       -0.085908       0.110000 
      2.275881       -0.108789       0.170000 
      2.291441       -0.079220       0.100000 
      2.307739       0.012668       0.120000 
      2.322839       0.124210       0.010000 
      2.338083       0.140337       0.160000 
      2.355011       0.036865       0.120000 
      2.370027       -0.050067       0.080000 
      2.385993       -0.068466       0.110000 
      2.401956       -0.061738       0.090000 
      2.418677       -0.022757       0.080000 
      2.433638       0.007225       0.210000 
      2.448596       -0.021871       0.160000 
      2.463533       -0.050980       0.190000 
      2.479484       -0.021415       0.070000 
      2.495588       0.013054       0.160000 
      2.510545       0.006396       0.040000 
      2.524299       -0.003113       0.280000 
      2.541236       -0.030801       0.110000 
      2.557041       -0.087817       0.200000 
      2.572028       -0.108318       0.160000 
      2.586288       -0.093686       0.160000 
      2.601908       -0.061726       0.080000 
      2.618231       -0.083388       0.090000 
      2.633168       -0.129844       0.060000 
      2.648417       -0.130826       0.090000 
      2.665469       -0.075665       0.050000 
      2.679337       -0.028196       0.060000 
      2.695085       -0.004859       0.090000 
      2.710863       -0.017012       0.110000 
      2.725910       -0.086406       0.170000 
      2.742839       -0.125856       0.140000 
      2.758375       -0.099418       0.100000 
      2.772780       -0.072993       0.040000 
      2.789131       -0.046927       0.050000 
      2.803958       -0.025981       0.020000 
      2.819777       -0.006573       0.260000 
      2.836071       0.044865       0.090000 
      2.851584       0.068216       0.010000 
      2.865910       -0.013357       0.050000 
      2.882165       -0.069308       0.070000 
      2.898280       -0.044282       0.020000 
      2.913339       0.002353       0.110000 
      2.928253       0.046693       0.120000 
      2.943581       0.060105       0.050000 
      2.958733       0.012168       0.060000 
      2.974531       -0.085949       0.060000 
      2.991096       -0.149167       0.100000 
      3.007040       -0.134343       0.040000 
      3.022520       -0.078392       0.060000 
      3.036714       -0.036670       0.000000 
      3.052201       -0.043450       0.110000 
      3.068164       -0.041569       0.010000 
      3.085160       -0.032226       0.060000 
      3.100381       -0.046041       0.030000 
      3.115677       -0.055936       0.120000 
      3.131731       -0.016485       0.030000 
      3.147617       0.036365       0.070000 
      3.162393       0.035935       0.000000 
      3.179095       -0.021911       0.110000 
      3.194386       -0.081006       0.030000 
      3.210580       -0.096304       0.000000 
      3.225684       -0.099834       0.030000 
      3.241641       -0.107045       0.030000 
      3.255604       -0.064893       0.030000 
      3.272352       -0.003530       0.040000 
      3.287585       0.035921       0.040000 
      3.302645       0.017527       0.090000 
      3.317232       -0.038455       0.000000 
      3.331551       -0.075248       0.020000 
      3.348024       -0.115988       0.100000 
      3.363650       -0.137071       0.020000 
      3.378947       -0.123628       0.020000 
      3.393894       -0.107515       0.000000 
      3.408858       -0.047398       0.050000 
      3.424700       0.002229       0.100000 
      3.440546       -0.017801       0.010000 
      3.456796       -0.037568       0.020000 
      3.472192       -0.029042       0.090000 
      3.486949       -0.032169       0.010000 
      3.501830       0.006826       0.030000 
      3.518316       0.047133       0.090000 
      3.534576       -0.002643       0.030000 
      3.548899       -0.065252       0.020000 
      3.566145       -0.047010       0.030000 
      3.580724       -0.013774       0.050000 
      3.598308       -0.024555       0.070000 
      3.613165       0.022953       0.020000 
      3.627728       0.047549       0.030000 
      3.642759       -0.014217       0.140000 
      3.658975       -0.058620       0.070000 
      3.675087       -0.061309       0.040000 
      3.690125       -0.027686       0.050000 
      3.705074       -0.011613       0.090000 
      3.720341       -0.038898       0.020000 
      3.736157       -0.051494       0.050000 
      3.752536       -0.075678       0.050000 
      3.767853       -0.107958       0.030000 
      3.784356       -0.100720       0.020000 
      3.797862       -0.106216       0.060000 
      3.814379       -0.118602       0.080000 
      3.828283       -0.053305       0.050000 
      3.843751       0.067329       0.020000 
      3.874631       0.073961       0.010000 
      3.890698       -0.006560       0.060000 
      3.906727       -0.054620       0.020000 
      3.921633       -0.040186       0.020000 
      3.937013       -0.003059       0.000000 
      3.953301       0.017567       0.020000 
      3.967947       0.001870       0.150000 
      3.984519       -0.021884       0.050000 
      3.998801       -0.046028       0.040000 
      4.015473       -0.065835       0.050000 
      4.031934       -0.054524       0.050000 
      4.045512       -0.000442       0.020000 
      4.062476       0.042702       0.090000 
      4.078104       -0.029152       0.000000 
      4.092416       -0.113660       0.010000 
      4.108844       -0.111584       0.010000 
      4.123662       -0.065769       0.030000 
      4.137827       -0.073020       0.000000 
      4.153562       -0.081490       0.020000 
      4.168365       -0.051950       0.020000 
      4.184031       -0.038941       0.060000 
      4.200922       -0.076134       0.050000 
      4.216530       -0.126313       0.060000 
      4.231804       -0.115572       0.030000 
      4.246893       -0.081506       0.050000 
      4.263403       -0.073450       0.050000 
      4.292865       -0.070748       0.030000 
      4.309378       -0.067608       0.050000 
      4.323590       -0.051494       0.010000 
      4.339740       -0.046954       0.040000 
      4.355913       -0.048367       0.090000 
      4.371955       -0.049209       0.070000 
      4.386599       -0.059564       0.010000 
      4.402408       -0.036643       0.030000 
      4.417226       -0.061379       0.020000 
      4.433674       -0.115474       0.060000 
      4.448667       -0.079690       0.040000 
      4.465083       0.013067       0.040000 
      4.480590       0.065061       0.000000 
      4.494663       0.065048       0.090000 
      4.511556       0.012624       0.160000 
      4.526293       -0.085049       0.030000 
      4.541638       -0.138369       0.020000 
      4.555897       -0.085962       0.010000 
      4.572036       0.000940       0.090000 
      4.587736       0.005856       0.110000 
      4.603495       -0.063121       0.050000 
      4.618227       -0.115129       0.000000 
      4.633932       -0.139299       0.010000 
      4.650167       -0.131671       0.000000 
      4.668672       -0.075664       0.010000 
      4.680931       -0.027297       0.030000 
      4.696130       0.006382       0.000000 
      4.711207       0.036781       0.100000 
      4.726362       0.017580       0.010000 
      4.740563       -0.037568       0.060000 
      4.756128       -0.064436       0.090000 
      4.772623       -0.067137       0.010000 
      4.786953       -0.051453       0.040000 
      4.802146       -0.046054       0.060000 
      4.817712       -0.037138       0.170000 
      4.835085       0.004155       0.110000 
      4.848232       0.039466       0.060000 
      4.864122       0.032834       0.130000 
      4.881023       -0.042537       0.030000 
      4.896700       -0.099361       0.110000 
      4.910658       -0.090931       0.100000 
      4.925549       -0.057739       0.050000 
      4.941936       -0.057779       0.010000 
      4.957113       -0.092275       0.000000 
      4.971544       -0.116029       0.050000 
      4.988337       -0.121427       0.060000 
      5.003941       -0.122287       0.100000 
      5.019245       -0.126826       0.140000 
      5.034426       -0.140642       0.000000 
      5.050230       -0.136681       0.030000 
      5.066318       -0.095362       0.100000 
      5.082528       -0.054235       0.030000 
      5.097624       -0.031727       0.050000 
      5.115295       -0.048810       0.030000 
      5.131053       -0.069835       0.070000 
      5.145015       -0.080563       0.000000 
      5.159116       -0.042941       0.040000 
      5.174958       0.009940       0.070000 
      5.190905       0.009926       0.060000 
      5.207003       0.022523       0.020000 
      5.222512       0.008084       0.010000 
      5.237215       -0.057253       0.080000 
      5.253721       -0.086432       0.160000 
      5.267644       -0.086462       0.070000 
      5.283551       -0.121790       0.070000 
      5.298579       -0.154579       0.010000 
      5.314638       -0.123572       0.010000 
      5.330670       -0.024626       0.010000 
      5.345339       0.066873       0.050000 
      5.360914       0.039466       0.040000 
      5.376457       -0.029884       0.120000 
      5.406192       -0.055036       0.020000 
      5.422696       -0.021387       0.040000 
      5.438039       0.018037       0.060000 
      5.453079       0.026510       0.050000 
      5.468805       0.028352       0.090000 
      5.484147       0.021124       0.040000 
      5.498954       -0.006173       0.010000 
      5.515090       -0.061751       0.020000 
      5.530802       -0.085505       0.020000 
      5.546258       -0.069822       0.100000 
      5.563261       -0.043410       0.060000 
      5.578418       -0.007087       0.000000 
      5.592584       -0.008942       0.080000 
      5.608109       -0.046954       0.030000 
      5.622772       -0.090945       0.010000 
      5.637484       -0.110589       0.050000 
      5.652590       -0.096760       0.160000 
      5.667955       -0.076081       0.130000 
      5.684589       -0.066748       0.070000 
      5.700094       -0.036170       0.050000 
      5.716266       0.015671       0.060000 
      5.731779       0.031934       0.110000 
      5.747902       -0.030038       0.080000 
      5.763507       -0.113716       0.030000 
      5.777312       -0.176092       0.020000 
      5.792871       -0.163926       0.050000 
      5.808238       -0.120970       0.040000 
      5.824133       -0.068480       0.060000 
      5.840141       -0.011613       0.020000 
      5.855747       0.001856       0.020000 
      5.871149       0.006812       0.000000 
      5.887322       0.012597       0.070000 
      5.903571       -0.027713       0.020000 
      5.918309       -0.086418       0.060000 
      5.934308       -0.115545       0.050000 
      5.949214       -0.120487       0.040000 
      5.965249       -0.110159       0.120000 
      5.979398       -0.062248       0.020000 
      5.994807       0.011268       0.030000 
      6.011361       0.025110       0.040000 
      6.025519       -0.046941       0.060000 
      6.041921       -0.124554       0.020000 
      6.057256       -0.123545       0.050000 
      6.071985       -0.053765       0.030000 
      6.087963       0.002795       0.010000 
      6.103489       -0.024639       0.050000 
      6.117703       -0.059937       0.030000 
      6.132984       -0.066721       0.040000 
      6.148829       -0.051454       0.020000 
      6.163769       -0.046537       0.020000 
      6.178696       -0.043854       0.020000 
      6.194640       -0.035797       0.010000 
      6.208837       -0.067608       0.040000 
      6.225774       -0.086432       0.150000 
      6.241800       -0.076121       0.050000 
      6.257822       -0.078392       0.000000 
      6.272789       -0.094905       0.010000 
      6.288712       -0.106628       0.060000 
      6.304797       -0.065296       0.030000 
      6.320557       -0.008069       0.040000 
      6.335637       0.021636       0.000000 
      6.350091       0.015242       0.050000 
      6.367082       -0.030814       0.020000 
      6.381879       -0.106602       0.100000 
      6.397295       -0.128513       0.050000 
      6.413899       -0.091321       0.060000 
      6.429034       -0.032239       0.080000 
      6.443894       0.003268       0.020000 
      6.459121       0.023768       0.080000 
      6.474869       0.030593       0.050000 
      6.490519       -0.034454       0.020000 
      6.505200       -0.059453       0.080000 
      6.521131       -0.050151       0.040000 
      6.536771       -0.038414       0.040000 
      6.551943       -0.006213       0.050000 
      6.568024       -0.003489       0.050000 
      6.582734       -0.021428       0.000000 
      6.599126       -0.034840       0.040000 
      6.613785       -0.013344       0.040000 
      6.630203       0.034150       0.010000 
      6.645723       0.026067       0.030000 
      6.660712       0.006839       0.040000 
      6.676721       -0.010713       0.020000 
      6.692016       -0.062168       0.030000 
      6.708679       -0.085519       0.080000 
      6.723761       -0.069835       0.130000 
      6.740236       -0.043840       0.420000 
      6.754649       -0.012043       0.660000 
      6.770608       -0.027740       0.320000 
      6.784880       -0.062651       0.000000 
      6.800543       -0.075207       0.240000 
      6.817005       -0.090462       0.390000 
      6.832490       -0.075607       0.390000 
      6.847808       -0.003086       0.170000 
      6.861874       0.052089       0.010000 
      6.877878       0.026510       0.160000 
      6.893215       -0.005673       0.240000 
      6.907934       0.003682       0.100000 
      6.923378       0.024309       0.020000 
      6.938402       0.036435       0.940000 
      6.954693       0.061005       2.950000 
      6.968399       0.033707       4.380000 
      6.983691       -0.053708       4.020000 
      7.000530       -0.089036       2.350000 
      7.015179       -0.100373       1.500000 
      7.031187       -0.100207       2.120000 
      7.047467       -0.042550       6.420000 
      7.063202       0.033264       12.410000 
      7.078101       0.044422       19.540000 
      7.094343       0.022966       34.540000 
      7.108874       -0.020998       42.180000 
      7.124656       -0.056313       59.140000 
      7.139893       -0.044751       68.750000 
      7.154901       -0.016875       78.360000 
      7.170596       0.021568       100.120000 
      7.185805       0.044505       112.320000 
      7.201949       0.035024       125.160000 
      7.217846       0.044573       151.420000 
      7.232352       0.023838       167.660000 
      7.248236       0.011962       204.110000 
      7.265105       0.100182       220.760000 
      7.279323       0.271483       245.750000 
      7.294724       0.438222       254.180000 
      7.310767       0.635979       261.070000 
      7.326888       0.841210       274.170000 
      7.341553       0.935505       281.940000 
      7.357356       0.968261       293.620000 
      7.372998       1.047289       294.580000 
      7.388528       1.188483       286.250000 
      7.402701       1.375500       280.710000 
      7.418822       1.556658       277.280000 
      7.435230       1.749917       276.070000 
      7.450321       1.947719       277.770000 
      7.465073       2.211837       284.500000 
      7.481025       2.574475       289.360000 
      7.496783       2.854290       295.170000 
      7.512001       3.055219       306.010000 
      7.527631       3.251180       310.520000 
      7.543090       3.440394       317.670000 
      7.558721       3.661503       320.610000 
      7.573802       3.814244       323.380000 
      7.589333       3.851218       327.680000 
      7.605146       3.862338       329.040000 
      7.620192       3.898768       330.550000 
      7.635187       3.915738       332.280000 
      7.651816       3.899199       332.900000 
      7.665961       3.867375       336.550000 
      7.681395       3.872770       339.220000 
      7.697184       3.865587       342.140000 
      7.712721       3.833806       347.290000 
      7.727332       3.894797       349.150000 
      7.743788       4.002727       347.620000 
      7.759385       4.047258       344.060000 
      7.774506       4.069202       340.360000 
      7.789343       4.148202       335.340000 
      7.805031       4.299241       334.170000 
      7.820165       4.522537       331.800000 
      7.836210       4.719254       330.980000 
      7.851549       4.811241       332.070000 
      7.866917       4.842694       333.630000 
      7.882321       4.908638       334.760000 
      7.898189       4.995183       335.160000 
      7.913321       5.067845       336.020000 
      7.929934       5.183059       339.080000 
      7.944499       5.306796       341.980000 
      7.959661       5.367358       345.870000 
      7.975680       5.401043       352.060000 
      7.991511       5.503337       353.620000 
      8.006483       5.678972       357.930000 
      8.023196       5.798796       360.660000 
      8.037028       5.900058       363.530000 
      8.053020       6.060175       367.150000 
      8.068729       6.158679       366.730000 
      8.083683       6.201898       363.390000 
      8.097963       6.215228       363.460000 
      8.115103       6.188428       358.140000 
      8.130633       6.119505       241.470000 
      8.145814       6.101054       160.260000 
      8.161061       6.174282       17.480000 
      8.177621       6.315338       11.310000 
      8.192649       6.505967       8.520000 
      8.208176       6.623782       3.090000 
      8.223934       6.728378       5.980000 
      8.239635       6.824699       10.630000 
      8.255641       6.915391       5.660000 
      8.271009       7.034538       3.550000 
      8.286814       7.100770       7.000000 
      8.302798       7.142509       9.760000 
      8.318273       7.067055       4.630000 
      8.333688       6.329522       2.650000 
      8.349080       4.219645       7.490000 
      8.365104       1.687661       9.300000 
      8.380608       1.093586       4.920000 
      8.395755       1.940485       3.900000 
      8.411770       2.506937       8.510000 
      8.426077       2.486908       9.520000 
      8.441406       2.249050       7.910000 
      8.457562       1.954513       5.640000 
      8.472570       1.578433       7.480000 
      8.488797       1.095848       9.970000 
      8.502912       0.497395       8.110000 
      8.518874       -0.198971       6.250000 
      8.535353       -0.804388       7.780000 
      8.551239       -1.199347       9.490000 
      8.567151       -1.462749       7.050000 
      8.582528       -1.616028       5.100000 
      8.597451       -1.662115       5.270000 
      8.612880       -1.830509       8.280000 
      8.628193       -2.003210       8.050000 
      8.643793       -2.063161       6.200000 
      8.658739       -2.064316       5.120000 
      8.672687       -2.037580       6.890000 
      8.688487       -1.982863       7.790000 
      8.705146       -1.968578       6.220000 
      8.720699       -2.016485       5.210000 
      8.735269       -2.050967       7.350000 
      8.750391       -2.026357       8.400000 
      8.767333       -2.005690       6.210000 
      8.783498       -2.007528       5.690000 
      8.797990       -1.965779       6.530000 
      8.813582       -1.913884       8.840000 
      8.828276       -1.907047       7.850000 
      8.844719       -1.937151       6.210000 
      8.859699       -1.935243       7.270000 
      8.875047       -1.901730       8.980000 
      8.890810       -1.871138       7.820000 
      8.905594       -1.842994       6.470000 
      8.921135       -1.801258       7.170000 
      8.935665       -1.779762       8.120000 
      8.951643       -1.787335       7.020000 
      8.966860       -1.838868       6.040000 
      8.981901       -1.854429       5.940000 
      8.997221       -1.737969       7.620000 
      9.013859       -1.576134       7.480000 
      9.029541       -1.427325       5.620000 
      9.044581       -1.314397       5.790000 
      9.061543       -1.339480       6.780000 
      9.076928       -1.422311       7.260000 
      9.092319       -1.446108       6.290000 
      9.106602       -1.468081       6.330000 
      9.122975       -1.546040       7.310000 
      9.137362       -1.619974       7.940000 
      9.152747       -1.608386       6.750000 
      9.167853       -1.541085       6.370000 
      9.184432       -1.460521       7.890000 
      9.199573       -1.421470       8.290000 
      9.215107       -1.465447       7.850000 
      9.230130       -1.495806       6.670000 
      9.245899       -1.530937       7.130000 
      9.260817       -1.576923       7.990000 
      9.275817       -1.578432       7.400000 
      9.290545       -1.595419       6.670000 
      9.306864       -1.677865       6.870000 
      9.321961       -1.703860       7.440000 
      9.337447       -1.668935       6.760000 
      9.353745       -1.614244       6.140000 
      9.369340       -1.542982       6.160000 
      9.384930       -1.543964       7.300000 
      9.400851       -1.606546       7.310000 
      9.415814       -1.636238       6.190000 
      9.431280       -1.624031       6.200000 
      9.447590       -1.612404       7.510000 
      9.461933       -1.564006       7.440000 
      9.477889       -1.487359       6.940000 
      9.495202       -1.391903       6.700000 
      9.509582       -1.367250       7.110000 
      9.524945       -1.477476       7.530000 
      9.541870       -1.528470       7.020000 
      9.557158       -1.455496       6.730000 
      9.572902       -1.392251       7.390000 
      9.587924       -1.381046       7.680000 
      9.603186       -1.327227       6.930000 
      9.618598       -1.222399       6.690000 
      9.633586       -1.188316       6.890000 
      9.648384       -1.210242       7.560000 
      9.664762       -1.217496       7.240000 
      9.679912       -1.287779       6.710000 
      9.694868       -1.406629       6.880000 
      9.710473       -1.472462       7.300000 
      9.725966       -1.470322       7.040000 
      9.741492       -1.461353       6.490000 
      9.757112       -1.567177       6.790000 
      9.772968       -1.655825       7.220000 
      9.788510       -1.628141       7.020000 
      9.803945       -1.602576       6.610000 
      9.819329       -1.587788       6.580000 
      9.833784       -1.558250       7.480000 
      9.848822       -1.568578       7.430000 
      9.863682       -1.641099       7.060000 
      9.878606       -1.700786       6.840000 
      9.894696       -1.689023       7.200000 
      9.911240       -1.652866       7.440000 
      9.925477       -1.620485       7.010000 
      9.942141       -1.595472       6.750000 
      9.956791       -1.571638       7.060000 
      9.971034       -1.620098       7.380000 
      9.986290       -1.650453       7.330000 
      10.002968       -1.551480       6.700000 
      10.017534       -1.463612       6.710000 
      10.032911       -1.491818       7.220000 
      10.049386       -1.504314       7.080000 
      10.065139       -1.397258       6.610000 
      10.080228       -1.289649       6.690000 
      10.094318       -1.315241       7.060000 
      10.111096       -1.400287       7.140000 
      10.126630       -1.430356       6.940000 
      10.142656       -1.398935       6.970000 
      10.157072       -1.361792       7.150000 
      10.173757       -1.294101       7.330000 
      10.189432       -1.235466       6.910000 
      10.205527       -1.299531       6.800000 
      10.220765       -1.451006       7.280000 
      10.236747       -1.544614       7.450000 
      10.252563       -1.554153       6.810000 
      10.268228       -1.559413       6.730000 
      10.283256       -1.529068       6.970000 
      10.297891       -1.445223       7.350000 
      10.313833       -1.436780       7.040000 
      10.328995       -1.477894       6.690000 
      10.345145       -1.549761       6.980000 
      10.360501       -1.616375       7.170000 
      10.375395       -1.602629       6.960000 
      10.390597       -1.601261       6.810000 
      10.406440       -1.683734       7.040000 
      10.422334       -1.728957       7.180000 
      10.437537       -1.719601       7.100000 
      10.451943       -1.685949       6.880000 
      10.467511       -1.617398       6.960000 
      10.483774       -1.545267       7.170000 
      10.499175       -1.547482       7.200000 
      10.515528       -1.626340       6.990000 
      10.530693       -1.645098       6.920000 
      10.545904       -1.585576       7.190000 
      10.562817       -1.552353       7.120000 
      10.576779       -1.538911       6.930000 
      10.592903       -1.511170       7.040000 
      10.609473       -1.522301       7.200000 
      10.624479       -1.537554       7.230000 
      10.640281       -1.524086       6.910000 
      10.656713       -1.512955       6.950000 
      10.672788       -1.472965       7.030000 
      10.688511       -1.455219       7.130000 
      10.703470       -1.531700       7.100000 
      10.718503       -1.646966       6.890000 
      10.732731       -1.682321       6.940000 
      10.749258       -1.666707       7.160000 
      10.763634       -1.628532       7.080000 
      10.779956       -1.615682       6.880000 
      10.796088       -1.646468       6.970000 
      10.811544       -1.613813       7.050000 
      10.827015       -1.560441       7.030000 
      10.842505       -1.612028       6.850000 
      10.858640       -1.624428       7.020000 
      10.874087       -1.513455       7.140000 
      10.889835       -1.443415       7.000000 
      10.905657       -1.513384       6.870000 
      10.921618       -1.558550       6.930000 
      10.936965       -1.496344       7.120000 
      10.952121       -1.423687       7.090000 
      10.967173       -1.434025       6.940000 
      10.982771       -1.486446       7.020000 
      10.999022       -1.510200       7.070000 
      11.013521       -1.497634       7.060000 
      11.028559       -1.486919       6.930000 
      11.043935       -1.516485       6.890000 
      11.058264       -1.532652       7.110000 
      11.075045       -1.512446       7.250000 
      11.090032       -1.543011       7.040000 
      11.105672       -1.624015       7.010000 
      11.119631       -1.641580       7.040000 
      11.134706       -1.565809       7.130000 
      11.151567       -1.544340       7.080000 
      11.166394       -1.586848       6.900000 
      11.183085       -1.603914       6.950000 
      11.198585       -1.561766       7.020000 
      11.212960       -1.488302       7.040000 
      11.229103       -1.470391       6.960000 
      11.243873       -1.534025       7.030000 
      11.260447       -1.639769       7.130000 
      11.275663       -1.719101       7.080000 
      11.289932       -1.704330       7.060000 
      11.305956       -1.633985       7.020000 
      11.321769       -1.604459       7.020000 
      11.336863       -1.670735       7.050000 
      11.351395       -1.736141       7.000000 
      11.367195       -1.693132       6.910000 
      11.383018       -1.627243       7.090000 
      11.397676       -1.574349       7.030000 
      11.414625       -1.536267       6.980000 
      11.429504       -1.543438       6.940000 
      11.444884       -1.541596       7.050000 
      11.460996       -1.533139       7.090000 
      11.475935       -1.557752       6.940000 
      11.492190       -1.616001       6.890000 
      11.507110       -1.655010       6.910000 
      11.522026       -1.634370       7.130000 
      11.537851       -1.573516       7.120000 
      11.553786       -1.520088       6.850000 
      11.569210       -1.554762       6.900000 
      11.585825       -1.678694       7.040000 
      11.599880       -1.755894       7.050000 
      11.614875       -1.696152       6.920000 
      11.630691       -1.622343       7.070000 
      11.646125       -1.531254       7.130000 
      11.661130       -1.410795       6.990000 
      11.676378       -1.347138       6.960000 
      11.691648       -1.442565       7.040000 
      11.706594       -1.606532       7.070000 
      11.722678       -1.650912       7.010000 
      11.737660       -1.614202       6.980000 
      11.752501       -1.539300       6.980000 
      11.768366       -1.452921       7.140000 
      11.782935       -1.458263       7.100000 
      11.799273       -1.503929       7.090000 
      11.814607       -1.511170       7.020000 
      11.829848       -1.557283       7.070000 
      11.846218       -1.631685       7.000000 
      11.861338       -1.658150       6.950000 
      11.876822       -1.637542       6.950000 
      11.891737       -1.587845       6.950000 
      11.907053       -1.588719       7.050000 
      11.922520       -1.648823       7.060000 
      11.937757       -1.713260       6.950000 
      11.953189       -1.751492       6.990000 
      11.969144       -1.714979       7.040000 
      11.984770       -1.668660       7.070000 
      12.000414       -1.664354       7.110000 
      12.014983       -1.656047       6.970000 
      12.030908       -1.599447       6.990000 
      12.045015       -1.630025       7.060000 
      12.060307       -1.681866       7.010000 
      12.076686       -1.698168       7.040000 
      12.092355       -1.703392       7.110000 
      12.108396       -1.662708       7.100000 
      12.124287       -1.664950       6.980000 
      12.139480       -1.713274       6.950000 
      12.153619       -1.669848       7.010000 
      12.170035       -1.616529       7.130000 
      12.185729       -1.614714       7.040000 
      12.201653       -1.601687       6.960000 
      12.216797       -1.612945       7.110000 
      12.232100       -1.658607       7.120000 
      12.248126       -1.662178       7.030000 
      12.263414       -1.574380       7.030000 
      12.278774       -1.565893       6.990000 
      12.294909       -1.677835       7.120000 
      12.309289       -1.668891       7.080000 
      12.324517       -1.575265       7.010000 
      12.340495       -1.549696       6.960000 
      12.354481       -1.537149       7.010000 
      12.370420       -1.515215       7.080000 
      12.385378       -1.551981       6.990000 
      12.401365       -1.669804       6.840000 
      12.416560       -1.712816       7.060000 
      12.431520       -1.659084       6.990000 
      12.446479       -1.695833       7.010000 
      12.461439       -1.715444       6.920000 
      12.476399       -1.580674       7.010000 
      12.491359       -1.464565       7.110000 
      12.506765       -1.475693       7.050000 
      12.522536       -1.515666       7.020000 
      12.538569       -1.535270       6.960000 
      12.553523       -1.524156       7.110000 
      12.570481       -1.515130       7.060000 
      12.586442       -1.564520       7.020000 
      12.602398       -1.589963       7.000000 
      12.616793       -1.601730       6.960000 
      12.632196       -1.616418       6.920000 
      12.648124       -1.615612       6.960000 
      12.664081       -1.592705       6.980000 
      12.681037       -1.563179       7.020000 
      12.695996       -1.582003       6.990000 
      12.711953       -1.633068       6.950000 
      12.727911       -1.651454       7.010000 
      12.744866       -1.680163       6.950000 
      12.760216       -1.720887       6.960000 
      12.774805       -1.685975       7.000000 
      12.791275       -1.616959       6.970000 
      12.806730       -1.603516       7.040000 
      12.822237       -1.611556       7.000000 
      12.837336       -1.597701       6.950000 
      12.853128       -1.587805       6.940000 
      12.868583       -1.627256       7.000000 
      12.885343       -1.680107       7.060000 
      12.899967       -1.679690       7.030000 
      12.915606       -1.622313       7.000000 
      12.932157       -1.569410       7.010000 
      12.946562       -1.586060       6.950000 
      12.962483       -1.634796       7.000000 
      12.977715       -1.583761       6.930000 
      12.992584       -1.496363       7.080000 
      13.009186       -1.548823       7.030000 
      13.023150       -1.605616       7.000000 
      13.037830       -1.555577       7.050000 
      13.053001       -1.517818       7.050000 
      13.069357       -1.543880       7.020000 
      13.085553       -1.565349       6.990000 
      13.099716       -1.572577       6.960000 
      13.116653       -1.576550       7.070000 
      13.130672       -1.597203       7.080000 
      13.147119       -1.615572       7.050000 
      13.163125       -1.610602       7.000000 
      13.178154       -1.572563       7.020000 
      13.193161       -1.530814       7.030000 
      13.208258       -1.518810       7.080000 
      13.223612       -1.496705       7.010000 
      13.239011       -1.488828       7.000000 
      13.255473       -1.520889       7.030000 
      13.270743       -1.563660       7.070000 
      13.286558       -1.574252       7.040000 
      13.300555       -1.599045       7.030000 
      13.315789       -1.619116       7.030000 
      13.331263       -1.631739       7.050000 
      13.346986       -1.598077       7.110000 
      13.363144       -1.570818       7.130000 
      13.378455       -1.608804       7.080000 
      13.392824       -1.615128       7.050000 
      13.409259       -1.593576       7.070000 
      13.424832       -1.553682       7.010000 
      13.439861       -1.460933       7.030000 
      13.455451       -1.415671       6.990000 
      13.470882       -1.434026       7.050000 
      13.486176       -1.494502       7.000000 
      13.501612       -1.546953       7.060000 
      13.517397       -1.519142       7.050000 
      13.532210       -1.484691       7.110000 
      13.547252       -1.487832       7.140000 
      13.562791       -1.541152       7.070000 
      13.578237       -1.583304       7.190000 
      13.592879       -1.584137       7.100000 
      13.607675       -1.616944       6.990000 
      13.623686       -1.618615       6.970000 
      13.639648       -1.543007       6.950000 
      13.654579       -1.454197       7.160000 
      13.669141       -1.469048       7.110000 
      13.685720       -1.551450       7.050000 
      13.700916       -1.580576       7.070000 
      13.715869       -1.561782       7.060000 
      13.732682       -1.575650       7.010000 
      13.748066       -1.596717       6.980000 
      13.764441       -1.546094       6.950000 
      13.779433       -1.493191       6.950000 
      13.795226       -1.503059       6.990000 
      13.810485       -1.529454       7.050000 
      13.855289       -1.507529       7.080000 
      13.872056       -1.442109       6.940000 
      13.887177       -1.440297       6.970000 
      13.902907       -1.503073       7.080000 
      13.918919       -1.582804       7.080000 
      13.934649       -1.617303       7.020000 
      13.948862       -1.559080       7.030000 
      13.965608       -1.527713       7.120000 
      13.980589       -1.514687       7.130000 
      13.996573       -1.489630       6.860000 
      14.012429       -1.513358       6.970000 
      14.027850       -1.511543       7.140000 
      14.043387       -1.487402       7.160000 
      14.060135       -1.509305       7.100000 
      14.075627       -1.569365       6.980000 
      14.091924       -1.613742       6.980000 
      14.106910       -1.551397       7.100000 
      14.122077       -1.434123       6.980000 
      14.137165       -1.425501       6.880000 
      14.152675       -1.519280       7.030000 
      14.168853       -1.608318       7.010000 
      14.184881       -1.662237       6.990000 
      14.200440       -1.667456       6.960000 
      14.215663       -1.657348       7.020000 
      14.232470       -1.591332       7.030000 
      14.247812       -1.526482       7.070000 
      14.262589       -1.553310       7.050000 
      14.276622       -1.674734       6.960000 
      14.293550       -1.729829       7.040000 
      14.308474       -1.652768       7.070000 
      14.323337       -1.578849       7.040000 
      14.338308       -1.524113       6.970000 
      14.353945       -1.492801       6.930000 
      14.368840       -1.521401       6.850000 
      14.384364       -1.544681       7.070000 
      14.400390       -1.485963       7.080000 
      14.414402       -1.392815       7.000000 
      14.430365       -1.359996       6.930000 
      14.446328       -1.384342       6.940000 
      14.460480       -1.444670       7.090000 
      14.476441       -1.508913       7.040000 
      14.490401       -1.522176       6.980000 
      14.507355       -1.538080       7.040000 
      14.523342       -1.509634       7.000000 
      14.539361       -1.459245       7.020000 
      14.554757       -1.438456       7.080000 
      14.570343       -1.484758       7.070000 
      14.587299       -1.570708       7.080000 
      14.602254       -1.655009       6.980000 
      14.618312       -1.679649       7.000000 
      14.633273       -1.646027       7.090000 
      14.647406       -1.608015       7.080000 
      14.663367       -1.595832       7.010000 
      14.677909       -1.589160       6.910000 
      14.694411       -1.559967       6.970000 
      14.708808       -1.566734       7.050000 
      14.724410       -1.551853       7.090000 
      14.741119       -1.486973       7.150000 
      14.756977       -1.464052       7.030000 
      14.773750       -1.498144       7.050000 
      14.788345       -1.540695       7.070000 
      14.805696       -1.567137       6.990000 
      14.818958       -1.575207       7.020000 
      14.834450       -1.585949       7.070000 
      14.850593       -1.561778       7.070000 
      14.865758       -1.506630       6.970000 
      14.881036       -1.484718       7.040000 
      14.896907       -1.501258       7.110000 
      14.912380       -1.538051       7.080000 
      14.927527       -1.552340       7.070000 
      14.942831       -1.586045       7.010000 
      14.958082       -1.651356       7.070000 
      14.975075       -1.660435       7.050000 
      14.990930       -1.624542       6.970000 
      15.005932       -1.595875       6.890000 
      15.020371       -1.571692       7.210000 
      15.035984       -1.621427       7.130000 
      15.052670       -1.666624       7.010000 
      15.068158       -1.623199       7.020000 
      15.082231       -1.573020       7.060000 
      15.099215       -1.524127       7.040000 
      15.115354       -1.499100       7.060000 
      15.129249       -1.557283       6.970000 
      15.145874       -1.643781       7.000000 
      15.160219       -1.638812       7.050000 
      15.176896       -1.532655       7.020000 
      15.191933       -1.453740       7.050000 
      15.206983       -1.473503       6.970000 
      15.223111       -1.500301       7.090000 
      15.239874       -1.472564       7.120000 
      15.254095       -1.441182       7.030000 
      15.270340       -1.463081       6.940000 
      15.285053       -1.466748       7.060000 
      15.300858       -1.449196       7.160000 
      15.317182       -1.440767       7.070000 
      15.332410       -1.416070       7.090000 
      15.347885       -1.460521       7.090000 
      15.361938       -1.546471       7.140000 
      15.378027       -1.632611       6.990000 
      15.392514       -1.660808       6.980000 
      15.408156       -1.582862       7.170000 
      15.424410       -1.545310       7.110000 
      15.439199       -1.646900       7.080000 
      15.454426       -1.752736       7.040000 
      15.470527       -1.710961       7.020000 
      15.486473       -1.554235       7.080000 
      15.502483       -1.416089       6.990000 
      15.518076       -1.431519       6.990000 
      15.532449       -1.550468       6.990000 
      15.548849       -1.626825       7.110000 
      15.563697       -1.626206       7.040000 
      15.580077       -1.627228       7.050000 
      15.595777       -1.554511       7.100000 
      15.610890       -1.438592       7.160000 
      15.627867       -1.371251       7.120000 
      15.643307       -1.393728       7.030000 
      15.657934       -1.486419       7.120000 
      15.673512       -1.549610       7.160000 
      15.688808       -1.539285       7.060000 
      15.704696       -1.496760       6.990000 
      15.720078       -1.447438       6.920000 
      15.735320       -1.409868       7.120000 
      15.750845       -1.418758       7.060000 
      15.766741       -1.502146       7.020000 
      15.781102       -1.592149       6.840000 
      15.797544       -1.583662       7.000000 
      15.811918       -1.451897       7.070000 
      15.827836       -1.335009       6.980000 
      15.842111       -1.335826       6.960000 
      15.857578       -1.397754       7.080000 
      15.872833       -1.465296       7.130000 
      15.888525       -1.516956       7.080000 
      15.903938       -1.537860       7.000000 
      15.919820       -1.532681       6.960000 
      15.935749       -1.469296       7.070000 
      15.951657       -1.410811       6.990000 
      15.967235       -1.386878       7.010000 
      15.982678       -1.424693       7.160000 
      15.997636       -1.472038       7.190000 
      16.014592       -1.531339       6.970000 
      16.029755       -1.604706       6.910000 
      16.045186       -1.624970       7.100000 
      16.061390       -1.570278       7.020000 
      16.077374       -1.509815       7.070000 
      16.091815       -1.494105       6.980000 
      16.108324       -1.551077       6.970000 
      16.123004       -1.615945       7.090000 
      16.138877       -1.596317       7.060000 
      16.155003       -1.565339       7.000000 
      16.170821       -1.583291       6.940000 
      16.186743       -1.559507       7.010000 
      16.202889       -1.503086       7.030000 
      16.218014       -1.464052       6.990000 
      16.234705       -1.482003       7.030000 
      16.249732       -1.532196       7.030000 
      16.265553       -1.541085       7.090000 
      16.282555       -1.536725       7.060000 
      16.297930       -1.559896       7.030000 
      16.313262       -1.553252       7.060000 
      16.328533       -1.489590       7.060000 
      16.343721       -1.473477       7.040000 
      16.359650       -1.463605       7.050000 
      16.374894       -1.442539       7.070000 
      16.389471       -1.489244       7.060000 
      16.404599       -1.579594       6.970000 
      16.420141       -1.632681       6.940000 
      16.436488       -1.627589       7.040000 
      16.452272       -1.639409       7.100000 
      16.467611       -1.620432       7.020000 
      16.482901       -1.607155       7.020000 
      16.498515       -1.611462       7.060000 
      16.513850       -1.590958       7.140000 
      16.528917       -1.546511       7.040000 
      16.544587       -1.503516       7.030000 
      16.559955       -1.481990       7.040000 
      16.575579       -1.492275       7.080000 
      16.590833       -1.491818       7.090000 
      16.607062       -1.475691       7.010000 
      16.623403       -1.468037       7.090000 
      16.639360       -1.451494       7.050000 
      16.654689       -1.446511       7.000000 
      16.669501       -1.442967       7.060000 
      16.685119       -1.424999       7.170000 
      16.700246       -1.419240       7.150000 
      16.714881       -1.407517       7.010000 
      16.731088       -1.438108       7.030000 
      16.745943       -1.511475       7.070000 
      16.760873       -1.560422       7.100000 
      16.776882       -1.563939       6.980000 
      16.791840       -1.537111       7.000000 
      16.807547       -1.476993       7.040000 
      16.823838       -1.438081       7.030000 
      16.837980       -1.441086       6.980000 
      16.854999       -1.430893       6.960000 
      16.870483       -1.366692       7.050000 
      16.884974       -1.302245       7.100000 
      16.900217       -1.331368       7.050000 
      16.917144       -1.461735       6.960000 
      16.933101       -1.496260       6.970000 
      16.947595       -1.454168       7.120000 
      16.963594       -1.494532       7.210000 
      16.979456       -1.525317       6.940000 
      16.994910       -1.505356       6.940000 
      17.008876       -1.484067       6.980000 
      17.023834       -1.429108       7.040000 
      17.039843       -1.321873       7.060000 
      17.056362       -1.300956       6.960000 
      17.071944       -1.361253       7.050000 
      17.086099       -1.406212       7.070000 
      17.102197       -1.394436       7.140000 
      17.118433       -1.372590       7.000000 
      17.133099       -1.347894       6.950000 
      17.148365       -1.339868       7.030000 
      17.162661       -1.392332       7.020000 
      17.179657       -1.499347       7.100000 
      17.194850       -1.540626       6.990000 
      17.210183       -1.477382       6.970000 
      17.225698       -1.417897       6.970000 
      17.241966       -1.338399       7.050000 
      17.256510       -1.260659       7.110000 
      17.272842       -1.292290       7.140000 
      17.288961       -1.399915       6.970000 
      17.302793       -1.447812       6.930000 
      17.318091       -1.489548       7.010000 
      17.333770       -1.491264       7.030000 
      17.349455       -1.405757       7.010000 
      17.365942       -1.344824       7.050000 
      17.382166       -1.353696       7.030000 
      17.396586       -1.396358       7.030000 
      17.412808       -1.428984       6.990000 
      17.427254       -1.407918       7.010000 
      17.442642       -1.346138       6.990000 
      17.458987       -1.346995       6.950000 
      17.474746       -1.355078       7.040000 
      17.488572       -1.325955       7.020000 
      17.505197       -1.383792       7.000000 
      17.520909       -1.469764       6.930000 
      17.536531       -1.479689       7.020000 
      17.551969       -1.432589       7.060000 
      17.567919       -1.410686       7.040000 
      17.583711       -1.421867       6.980000 
      17.599065       -1.369434       7.080000 
      17.614401       -1.323758       7.000000 
      17.628819       -1.426786       6.960000 
      17.645190       -1.537855       7.100000 
      17.660979       -1.472921       7.130000 
      17.677242       -1.322358       6.880000 
      17.692443       -1.241251       6.970000 
      17.708253       -1.235852       7.090000 
      17.723974       -1.292372       7.140000 
      17.738962       -1.404733       7.060000 
      17.755271       -1.464837       6.980000 
      17.770678       -1.417773       6.970000 
      17.786255       -1.349266       7.030000 
      17.801227       -1.289605       7.000000 
      17.817029       -1.298241       7.020000 
      17.832655       -1.381906       7.000000 
      17.847980       -1.431269       7.010000 
      17.863145       -1.429000       7.060000 
      17.879547       -1.437044       7.120000 
      17.894536       -1.409729       7.000000 
      17.909146       -1.340710       7.040000 
      17.924801       -1.256062       7.100000 
      17.940186       -1.209830       7.000000 
      17.955750       -1.295100       6.950000 
      17.971335       -1.442812       7.090000 
      17.988219       -1.510131       7.080000 
      18.003437       -1.452728       6.980000 
      18.018395       -1.397217       6.890000 
      18.032391       -1.339810       6.990000 
      18.048495       -1.277534       7.130000 
      18.063421       -1.307599       7.060000 
      18.078882       -1.359867       6.980000 
      18.093713       -1.317924       7.120000 
      18.109754       -1.256841       7.240000 
      18.125138       -1.305827       6.940000 
      18.139349       -1.379165       7.010000 
      18.155511       -1.411155       7.170000 
      18.171139       -1.395295       7.140000 
      18.186327       -1.377545       7.030000 
      18.201976       -1.366195       7.040000 
      18.217224       -1.348379       7.080000 
      18.233148       -1.330358       7.120000 
      18.248688       -1.337151       7.020000 
      18.264989       -1.311946       6.940000 
      18.281994       -1.267691       7.070000 
      18.296418       -1.276577       7.120000 
      18.310633       -1.303002       7.070000 
      18.325996       -1.280648       6.990000 
      18.341163       -1.276161       6.910000 
      18.356295       -1.285561       7.000000 
      18.372106       -1.277547       7.020000 
      18.387726       -1.362252       7.080000 
      18.403683       -1.484978       6.960000 
      18.419653       -1.497588       7.060000 
      18.435887       -1.426773       7.010000 
      18.465552       -1.363608       7.050000 
      18.481732       -1.352837       7.030000 
      18.497978       -1.367648       7.020000 
      18.512420       -1.370735       7.010000 
      18.527424       -1.373007       6.980000 
      18.543375       -1.376120       7.070000 
      18.559801       -1.391804       7.080000 
      18.575207       -1.391375       7.130000 
      18.590392       -1.370708       7.030000 
      18.605217       -1.348353       7.020000 
      18.620466       -1.324958       7.090000 
      18.637234       -1.312498       7.090000 
      18.652851       -1.266236       6.990000 
      18.667846       -1.214825       7.010000 
      18.683295       -1.219202       7.010000 
      18.698920       -1.302670       7.010000 
      18.715952       -1.399818       7.050000 
      18.730531       -1.436655       7.020000 
      18.745982       -1.435300       7.060000 
      18.761409       -1.467593       7.100000 
      18.776351       -1.486378       7.050000 
      18.791651       -1.474348       7.120000 
      18.806903       -1.456769       7.010000 
      18.822390       -1.397230       6.970000 
      18.837680       -1.336240       6.950000 
      18.852261       -1.319697       7.000000 
      18.868971       -1.302144       7.100000 
      18.883169       -1.313885       7.040000 
      18.899479       -1.370708       7.020000 
      18.914632       -1.425883       7.070000 
      18.929617       -1.415974       7.020000 
      18.945735       -1.385992       7.070000 
      18.960849       -1.385949       7.020000 
      18.974716       -1.350993       7.060000 
      18.991424       -1.257780       6.990000 
      19.006936       -1.199087       7.070000 
      19.021553       -1.223214       6.970000 
      19.036510       -1.261375       6.910000 
      19.051603       -1.265296       7.080000 
      19.068288       -1.253309       7.140000 
      19.083599       -1.249625       6.970000 
      19.099560       -1.259148       6.960000 
      19.114478       -1.231727       7.070000 
      19.130299       -1.243924       7.060000 
      19.145581       -1.316458       7.000000 
      19.160743       -1.374720       7.020000 
      19.175815       -1.366238       7.110000 
      19.192707       -1.329901       7.080000 
      19.207791       -1.313384       7.050000 
      19.223603       -1.272092       7.020000 
      19.240341       -1.244421       7.020000 
      19.255681       -1.283293       7.000000 
      19.271680       -1.366748       7.020000 
      19.287938       -1.428958       7.030000 
      19.301936       -1.436668       7.060000 
      19.318186       -1.406563       7.130000 
      19.333367       -1.407585       7.080000 
      19.349126       -1.430314       6.970000 
      19.364627       -1.412954       7.030000 
      19.378522       -1.366669       7.010000 
      19.394866       -1.382932       7.000000 
      19.409412       -1.419086       7.040000 
      19.424942       -1.383331       7.130000 
      19.441048       -1.307090       6.990000 
      19.456568       -1.332655       7.050000 
      19.470708       -1.385462       6.990000 
      19.487290       -1.333941       7.020000 
      19.502457       -1.238095       7.040000 
      19.517738       -1.184649       7.080000 
      19.532310       -1.190158       7.100000 
      19.549011       -1.249222       7.030000 
      19.565000       -1.318230       7.050000 
      19.580872       -1.304831       6.960000 
      19.596261       -1.305730       6.980000 
      19.611256       -1.330357       6.990000 
      19.625919       -1.313827       6.980000 
      19.640991       -1.342940       7.000000 
      19.656858       -1.356782       7.010000 
      19.673017       -1.329094       7.080000 
      19.687063       -1.314647       7.170000 
      19.702578       -1.286932       7.130000 
      19.718308       -1.299902       7.070000 
      19.735217       -1.318686       7.050000 
      19.749960       -1.259993       7.040000 
      19.766780       -1.238028       6.980000 
      19.782108       -1.256352       7.050000 
      19.797513       -1.229011       7.020000 
      19.812024       -1.148810       7.090000 
      19.828355       -1.072605       7.100000 
      19.843531       -1.080259       7.180000 
      19.858944       -1.123255       7.100000 
      19.874470       -1.181560       7.070000 
      19.888639       -1.267580       7.040000 
      19.905530       -1.339741       7.020000 
      19.921087       -1.384592       7.020000 
      19.935620       -1.380106       7.010000 
      19.951249       -1.322327       7.000000 
      19.967113       -1.269437       7.050000 
      19.981920       -1.286906       7.110000 
      19.997091       -1.344292       7.010000 
      20.013463       -1.316858       7.040000 
      20.028478       -1.214801       7.010000 
      20.043776       -1.231327       7.030000 
      20.058742       -1.347809       7.020000 
      20.075056       -1.328554       7.110000 
      20.089884       -1.251511       7.020000 
      20.105529       -1.250125       6.950000 
      20.121001       -1.265805       6.910000 
      20.137547       -1.272134       7.040000 
      20.151510       -1.270708       6.980000 
      20.166571       -1.267621       6.870000 
      20.183076       -1.251923       7.100000 
      20.198149       -1.251911       7.070000 
      20.214926       -1.267218       6.830000 
      20.229927       -1.266665       7.110000 
      20.244822       -1.265007       6.920000 
      20.261331       -1.308831       7.110000 
      20.276563       -1.387720       6.970000 
      20.292358       -1.363523       7.030000 
      20.307188       -1.305300       6.990000 
      20.322768       -1.266723       7.080000 
      20.338058       -1.226438       7.030000 
      20.353724       -1.278863       7.110000 
      20.369282       -1.350953       7.090000 
      20.385145       -1.363536       6.970000 
      20.401627       -1.342457       7.110000 
      20.416628       -1.300304       7.060000 
      20.432475       -1.267191       6.950000 
      20.448092       -1.217385       7.140000 
      20.463748       -1.163635       7.160000 
      20.478990       -1.163166       7.140000 
      20.495168       -1.210656       6.980000 
      20.511014       -1.226770       7.080000 
      20.526160       -1.186919       7.020000 
      20.541933       -1.187362       7.070000 
      20.557201       -1.232625       7.050000 
      20.572805       -1.240655       7.110000 
      20.587940       -1.231326       7.080000 
      20.603475       -1.235726       6.990000 
      20.619232       -1.214284       6.940000 
      20.635575       -1.177548       6.990000 
      20.650592       -1.233542       7.070000 
      20.665732       -1.325883       7.080000 
      20.681730       -1.353154       7.000000 
      20.697289       -1.322799       7.040000 
      20.712948       -1.280081       7.150000 
      20.728508       -1.269502       7.110000 
      20.743466       -1.245100       7.070000 
      20.758609       -1.228735       7.000000 
      20.772926       -1.221332       7.090000 
      20.789764       -1.229152       7.060000 
      20.804922       -1.249599       7.030000 
      20.820649       -1.282458       7.050000 
      20.836072       -1.266195       7.090000 
      20.851478       -1.243481       7.050000 
      20.867210       -1.276550       7.050000 
      20.883800       -1.326313       7.080000 
      20.898124       -1.315115       7.100000 
      20.914023       -1.275664       7.040000 
      20.930767       -1.243853       7.010000 
      20.946500       -1.206630       6.980000 
      20.961128       -1.202630       7.090000 
      20.978062       -1.211100       7.120000 
      20.992616       -1.192745       7.120000 
      21.008809       -1.169034       7.100000 
