

 time    ||    gripping force   ||   raspberry measurement 

      0       0.190000       -802.956000 
      0       0.150000       -802.956000 
      0       0.130000       -802.956000 
      0       1.300000       -802.956000 
      0       0.500000       -802.956000 
      0       0.300000       -802.956000 
      0       0.710000       -802.956000 
      0       0.310000       -802.956000 
      0       0.720000       -802.956000 
      0       0.210000       -802.956000 
      0       0.040000       -802.956000 
      0       0.120000       -802.956000 
      0       0.200000       -802.956000 
      0       0.010000       -802.956000 
      0       0.210000       -802.956000 
      0       0.320000       -802.956000 
      0       0.170000       -802.956000 
      1       0.490000       -794.926440 
      1       0.680000       -794.926440 
      1       1.010000       -786.977176 
      1       7.530000       -786.977176 
      1       34.680000       -779.107404 
      1       33.000000       -771.316330 
      1       53.440000       -763.603162 
      1       66.770000       -755.965950 
      1       72.010000       -748.300032 
      1       71.210000       -748.300032 
      1       70.400000       -748.300032 
      1       70.360000       -748.300032 
      1       69.900000       -744.745703 
      1       69.460000       -744.745703 
      1       69.250000       -701.445377 
      1       69.120000       -701.445377 
      1       68.860000       -701.445377 
      1       68.670000       -701.445377 
      1       68.620000       -701.445377 
      1       68.440000       -507.389825 
      1       68.310000       -507.389825 
      1       68.190000       -507.389825 
      1       68.090000       -187.457345 
      1       68.040000       6.582510 
      1       67.900000       6.582510 
      2       67.790000       6.582510 
      2       67.690000       49.879735 
      2       67.580000       53.432236 
      2       67.590000       53.432236 
      2       67.540000       53.432236 
      2       67.430000       53.541934 
      2       67.380000       53.554312 
      2       67.320000       53.627519 
      2       67.270000       53.824253 
      2       67.240000       53.824253 
      2       67.190000       53.824253 
      2       67.160000       53.824253 
      2       67.200000       53.824253 
      2       67.050000       54.130451 
      2       67.080000       54.396176 
      2       67.040000       54.396176 
      2       67.030000       54.396176 
      2       66.860000       54.396176 
      2       66.860000       54.396176 
      2       66.840000       54.396176 
      2       66.850000       54.396176 
      2       66.780000       54.396176 
      2       66.780000       54.396176 
      2       66.640000       54.396176 
      2       66.750000       54.396176 
      2       66.650000       54.396176 
      2       66.610000       54.396176 
      2       66.680000       54.516886 
      2       66.600000       54.538843 
      2       66.570000       54.542108 
      2       66.560000       54.542108 
      3       66.490000       54.540710 
      3       66.510000       54.541720 
      3       66.520000       54.535325 
      3       66.440000       54.517966 
      3       66.430000       54.500830 
      3       66.390000       54.500830 
      3       66.450000       54.500830 
      3       66.390000       54.517966 
      3       66.400000       54.517966 
      3       66.350000       54.535325 
      3       66.320000       54.535325 
      3       66.340000       54.535325 
      3       66.280000       54.535325 
      3       66.280000       54.535325 
      3       66.270000       54.541720 
      3       66.220000       54.540711 
      3       66.280000       54.540711 
      3       66.220000       54.540711 
      3       66.200000       54.540711 
      3       66.230000       54.542163 
      3       66.150000       54.542163 
      3       66.190000       54.540724 
      3       66.110000       54.540724 
      3       66.100000       54.542163 
      3       66.120000       54.540711 
      3       66.110000       54.540711 
      3       66.040000       54.541719 
      3       66.060000       54.535312 
      3       66.110000       54.535312 
      4       66.070000       54.535312 
      4       66.020000       54.535312 
      4       66.010000       54.535312 
      4       66.050000       54.535312 
      4       65.950000       54.535312 
      4       66.020000       54.517523 
      4       65.990000       54.495431 
      4       66.020000       54.493769 
      4       65.970000       54.495431 
      4       66.000000       54.495431 
      4       65.940000       54.495431 
      4       65.930000       54.517523 
      4       65.910000       54.535312 
      4       65.880000       54.535312 
      4       65.920000       54.535312 
      4       65.920000       54.535312 
      4       65.920000       54.535312 
      4       65.900000       54.535312 
      4       65.890000       54.541719 
      4       65.890000       54.540711 
      4       65.880000       54.540711 
      4       65.830000       54.542163 
      4       65.790000       54.540711 
      4       65.810000       54.540711 
      4       65.840000       54.541720 
      4       65.840000       54.535325 
      4       65.790000       54.535325 
      4       65.740000       54.517966 
      4       65.800000       54.500817 
      4       65.790000       54.517522 
      5       65.780000       54.529913 
      5       65.800000       54.529913 
      5       65.780000       54.529913 
      5       65.770000       54.529913 
      5       65.730000       54.529913 
      5       65.710000       54.529913 
      5       65.810000       54.529913 
      5       65.740000       54.517079 
      5       65.730000       54.495418 
      5       65.720000       54.493769 
      5       65.700000       54.493769 
      5       65.740000       54.493769 
      5       65.740000       54.493769 
      5       65.710000       54.493769 
      5       65.720000       54.495431 
      5       65.710000       54.495431 
      5       65.670000       54.517523 
      5       65.690000       54.517523 
      5       65.670000       54.517523 
      5       65.620000       54.535312 
      5       65.630000       54.535312 
      5       65.660000       54.541719 
      5       65.690000       54.540711 
      5       65.640000       54.540711 
      5       65.650000       54.540711 
      5       65.700000       54.540711 
      5       65.650000       54.540711 
      5       65.630000       54.540711 
      5       65.570000       54.540711 
      6       65.650000       54.540711 
      6       65.670000       54.542163 
      6       65.640000       54.540724 
      6       65.600000       54.540724 
      6       65.580000       54.540724 
      6       65.570000       54.540724 
      6       65.570000       54.542163 
      6       65.590000       54.540724 
      6       65.590000       54.540724 
      6       65.590000       54.542163 
      6       65.560000       54.542163 
      6       65.570000       54.540724 
      6       65.560000       54.542163 
      6       65.610000       54.540724 
      6       65.580000       54.540724 
      6       65.570000       54.542163 
      6       65.550000       54.542163 
      6       65.600000       54.540724 
      6       65.500000       54.540724 
      6       65.560000       54.540724 
      6       65.600000       54.540724 
      6       65.470000       54.540724 
      6       65.610000       54.540724 
      6       65.570000       54.540724 
      6       65.430000       54.540724 
      6       65.600000       54.540724 
      6       65.580000       54.540724 
      6       65.440000       54.540724 
      6       65.550000       54.542163 
      6       65.560000       54.540724 
      7       65.450000       54.540724 
      7       65.510000       54.542163 
      7       65.490000       54.540724 
      7       65.540000       54.540724 
      7       65.430000       54.542163 
      7       65.550000       54.540724 
      7       65.480000       54.542163 
      7       65.510000       54.540724 
      7       65.520000       54.542163 
      7       65.400000       54.540724 
      7       65.450000       54.542163 
      7       65.530000       54.540724 
      7       65.450000       54.542163 
      7       65.510000       54.542163 
      7       65.530000       54.542163 
      7       65.420000       54.540724 
      7       65.440000       54.542163 
      7       65.490000       54.540724 
      7       65.380000       54.540724 
      7       65.420000       54.540724 
      7       65.520000       54.540724 
      7       65.500000       54.540724 
      7       65.410000       54.540724 
      7       65.430000       54.542163 
      7       65.440000       54.542163 
      7       65.460000       54.540711 
      7       65.530000       54.540711 
      7       65.380000       54.540711 
      7       65.450000       54.540711 
      7       65.460000       54.540711 
      8       65.420000       54.540711 
      8       65.390000       54.540711 
      8       65.460000       54.541706 
      8       65.410000       54.541706 
      8       65.450000       54.541706 
      8       65.370000       54.534895 
      8       65.410000       54.534895 
      8       65.470000       54.534895 
      8       65.380000       54.534895 
      8       65.410000       54.512983 
      8       65.390000       54.512983 
      8       65.370000       54.481146 
      8       65.370000       54.491444 
      8       65.440000       54.501742 
      8       65.360000       54.469931 
      8       65.460000       54.448879 
      8       65.380000       54.448879 
      8       65.330000       54.452006 
      8       65.350000       54.452006 
      8       65.350000       54.452006 
      8       65.430000       54.491457 
      8       65.420000       54.531338 
      8       65.370000       54.539838 
      8       65.410000       54.542136 
      8       65.350000       54.542136 
      8       65.400000       54.540724 
      8       65.440000       54.540724 
      8       65.390000       54.542136 
      8       65.400000       54.539851 
      8       65.400000       54.539851 
      8       65.330000       54.531795 
      9       65.400000       54.497299 
      9       65.350000       54.497299 
      9       65.320000       54.481602 
      9       65.390000       54.481602 
      9       65.330000       54.481602 
      9       65.330000       54.512997 
      9       65.350000       54.534895 
      9       65.290000       54.534895 
      9       65.380000       54.541680 
      9       65.300000       54.541680 
      9       65.300000       54.541680 
      9       65.280000       54.539838 
      9       65.290000       54.531794 
      9       65.370000       54.531794 
      9       65.360000       54.531794 
      9       65.310000       54.531794 
      9       65.320000       54.497299 
      9       65.400000       54.481589 
      9       65.280000       54.512553 
      9       65.270000       54.529496 
      9       65.360000       54.517509 
      9       65.290000       54.517509 
      9       65.290000       54.500817 
      9       65.370000       54.500817 
      9       65.270000       54.500817 
      9       65.350000       54.517966 
      9       65.250000       54.535325 
      9       65.300000       54.541719 
      10       65.210000       54.541719 
      10       65.270000       54.541719 
      10       65.250000       54.541719 
      10       65.300000       54.540698 
      10       65.340000       54.540698 
      10       65.300000       54.540698 
      10       65.260000       54.541719 
      10       65.320000       54.535325 
      10       65.240000       54.517966 
      10       65.290000       54.500817 
      10       65.290000       54.517523 
      10       65.230000       54.529926 
      10       65.270000       54.529926 
      10       65.270000       54.517523 
      10       65.270000       54.517523 
      10       65.260000       54.500817 
      10       65.290000       54.517939 
      10       65.250000       54.517939 
      10       65.250000       54.517939 
      10       65.230000       54.534452 
      10       65.220000       54.534452 
      10       65.310000       54.531351 
      10       65.210000       54.497286 
      10       65.260000       54.481602 
      10       65.270000       54.481602 
      10       65.230000       54.512997 
      10       65.230000       54.534895 
      10       65.310000       54.541666 
      10       65.180000       54.539394 
      11       65.310000       54.526382 
      11       65.190000       54.472659 
      11       65.210000       54.436309 
      11       65.210000       54.436309 
      11       65.240000       54.436309 
      11       65.300000       54.436309 
      11       65.190000       54.436309 
      11       65.190000       54.464602 
      11       65.280000       54.489589 
      11       65.220000       54.516623 
      11       65.260000       54.516623 
      11       65.240000       54.529899 
      11       65.230000       54.529899 
      11       65.260000       54.529899 
      11       65.250000       54.517496 
      11       65.220000       54.517496 
      11       65.240000       54.499944 
      11       65.210000       54.499944 
      11       65.240000       54.499944 
      11       65.210000       54.507597 
      11       65.180000       54.507597 
      11       65.230000       54.491900 
      11       65.240000       54.481146 
      11       65.200000       54.512527 
      11       65.230000       54.512527 
      11       65.240000       54.512527 
      11       65.150000       54.529066 
      11       65.190000       54.529066 
      11       65.200000       54.529066 
      11       65.250000       54.529066 
      12       65.190000       54.512540 
      12       65.220000       54.481589 
      12       65.210000       54.481589 
      12       65.190000       54.497299 
      12       65.180000       54.531795 
      12       65.200000       54.539851 
      12       65.220000       54.539851 
      12       65.220000       54.539851 
      12       65.210000       54.539851 
      12       65.230000       54.542136 
      12       65.170000       54.540724 
      12       65.210000       54.542163 
      12       65.180000       54.542163 
      12       65.200000       54.542163 
      12       65.130000       54.540724 
      12       65.180000       54.540724 
      12       65.210000       54.542163 
      12       65.200000       54.540724 
      12       65.190000       54.542136 
      12       65.210000       54.542136 
      12       65.150000       54.539851 
      12       65.230000       54.539851 
      12       65.200000       54.539851 
      12       65.180000       54.539851 
      12       65.180000       54.539851 
      12       65.190000       54.539851 
      12       65.180000       54.531794 
      12       65.250000       54.497273 
      12       65.140000       54.497273 
      13       65.170000       54.497273 
      13       65.130000       54.480729 
      13       65.170000       54.502628 
      13       65.260000       54.491470 
      13       65.170000       54.481146 
      13       65.150000       54.481146 
      13       65.170000       54.512983 
      13       65.130000       54.512983 
      13       65.210000       54.512983 
      13       65.220000       54.512983 
      13       65.200000       54.512983 
      13       65.220000       54.534895 
      13       65.160000       54.534895 
      13       65.170000       54.534895 
      13       65.170000       54.534895 
      13       65.170000       54.534895 
      13       65.140000       54.534895 
      13       65.130000       54.534895 
      13       65.220000       54.541706 
      13       65.170000       54.540711 
      13       65.160000       54.540711 
      13       65.210000       54.540711 
      13       65.180000       54.540711 
      13       65.200000       54.542163 
      13       65.180000       54.542163 
      13       65.190000       54.540724 
      13       65.200000       54.540724 
      13       65.190000       54.540724 
      13       65.180000       54.540724 
      13       65.190000       54.540724 
      14       65.140000       54.540724 
      14       65.110000       54.542163 
      14       65.150000       54.540711 
      14       65.220000       54.540711 
      14       65.080000       54.541720 
      14       65.100000       54.535325 
      14       65.170000       54.535325 
      14       65.200000       54.517966 
      14       65.110000       54.517966 
      14       65.120000       54.500830 
      14       65.130000       54.517966 
      14       65.100000       54.517966 
      14       65.150000       54.517966 
      14       65.150000       54.535325 
      14       65.140000       54.541720 
      14       65.140000       54.540711 
      14       65.170000       54.540711 
      14       65.160000       54.540711 
      14       65.170000       54.540711 
      14       65.130000       54.542163 
      14       65.080000       54.540724 
      14       65.110000       54.542163 
      14       65.110000       54.540724 
      14       65.180000       54.540724 
      14       65.170000       54.540724 
      14       65.110000       54.540724 
      14       65.110000       54.540724 
      14       65.190000       54.540724 
      14       65.160000       54.542163 
      15       65.110000       54.540724 
      15       65.200000       54.540724 
      15       65.060000       54.540724 
      15       65.230000       54.540724 
      15       65.110000       54.540724 
      15       65.150000       54.540724 
      15       65.180000       54.540724 
      15       65.140000       54.540724 
      15       65.050000       54.540724 
      15       65.130000       54.542136 
      15       65.150000       54.539838 
      15       65.100000       54.539838 
      15       65.120000       54.539838 
      15       65.160000       54.539838 
      15       65.050000       54.531365 
      15       65.160000       54.492330 
      15       65.120000       54.492330 
      15       65.110000       54.462374 
      15       65.140000       54.462374 
      15       65.110000       54.492317 
      15       65.090000       54.492317 
      15       65.170000       54.492317 
      15       65.120000       54.492317 
      15       65.130000       54.530921 
      15       65.130000       54.534426 
      15       65.080000       54.517496 
      15       65.110000       54.495431 
      15       65.100000       54.493769 
      15       65.150000       54.495431 
      16       65.100000       54.495431 
      16       65.150000       54.495431 
      16       65.120000       54.517523 
      16       65.110000       54.517523 
      16       65.140000       54.517523 
      16       65.120000       54.517523 
      16       65.090000       54.535312 
      16       65.090000       54.535312 
      16       65.120000       54.535312 
      16       65.070000       54.541719 
      16       65.100000       54.540711 
      16       65.160000       54.540711 
      16       65.120000       54.542163 
      16       65.150000       54.540724 
      16       65.120000       54.542163 
      16       65.140000       54.540724 
      16       65.130000       54.542163 
      16       65.140000       54.540724 
      16       65.120000       54.542163 
      16       65.150000       54.540724 
      16       65.080000       54.540724 
      16       65.150000       54.540724 
      16       65.100000       54.540724 
      16       65.110000       54.542163 
      16       65.130000       54.542163 
      16       65.130000       54.540724 
      16       65.060000       54.542163 
      16       65.170000       54.542163 
      16       65.110000       54.540724 
      16       65.070000       54.542163 
      17       65.110000       54.540724 
      17       65.130000       54.540724 
      17       65.130000       54.542163 
      17       65.100000       54.540711 
      17       65.040000       54.541720 
      17       65.080000       54.535325 
      17       65.120000       54.517966 
      17       65.110000       54.500830 
      17       65.110000       54.517966 
      17       65.130000       54.535312 
      17       65.150000       54.541263 
      17       65.070000       54.541263 
      17       65.120000       54.541263 
      17       65.120000       54.534882 
      17       65.110000       54.512996 
      17       65.100000       54.512996 
      17       65.050000       54.512996 
      17       65.080000       54.512996 
      17       65.070000       54.512996 
      17       65.050000       54.512996 
      17       65.070000       54.512996 
      17       65.140000       54.512996 
      17       65.100000       54.512996 
      17       65.070000       54.481602 
      17       65.120000       54.497299 
      17       65.100000       54.497299 
      17       65.050000       54.497299 
      17       65.100000       54.531794 
      17       65.050000       54.539825 
      17       65.090000       54.539825 
      18       65.110000       54.539825 
      18       65.080000       54.541250 
      18       65.100000       54.529926 
      18       65.100000       54.529926 
      18       65.100000       54.493769 
      18       65.120000       54.460936 
      18       65.040000       54.493769 
      18       65.080000       54.529926 
      18       65.090000       54.541276 
      18       65.110000       54.541276 
      18       65.070000       54.540698 
      18       65.080000       54.540698 
      18       65.090000       54.540698 
      18       65.130000       54.542163 
      18       65.080000       54.540751 
      18       65.100000       54.540751 
      18       65.060000       54.540751 
      18       65.150000       54.543049 
      18       65.070000       54.551523 
      18       65.110000       54.590557 
      18       65.110000       54.590557 
      18       65.140000       54.620513 
      18       65.050000       54.590557 
      18       65.050000       54.551523 
      18       65.080000       54.543049 
      18       65.090000       54.543049 
      18       65.060000       54.540751 
      18       65.070000       54.542163 
      18       65.100000       54.540711 
      18       65.070000       54.541720 
      18       65.080000       54.541720 
      19       65.060000       54.541720 
      19       65.140000       54.535325 
      19       65.090000       54.517966 
      19       65.050000       54.500830 
      19       65.040000       54.500830 
      19       65.120000       54.517939 
      19       65.090000       54.517939 
      19       65.090000       54.517939 
      19       65.090000       54.534452 
      19       65.090000       54.531351 
      19       65.100000       54.497286 
      19       65.100000       54.481602 
      19       65.120000       54.481602 
      19       65.060000       54.481602 
      19       65.040000       54.512997 
      19       65.060000       54.534895 
      19       65.110000       54.534895 
      19       65.070000       54.541706 
      19       65.140000       54.541706 
      19       65.100000       54.540711 
      19       65.060000       54.542163 
      19       65.040000       54.540724 
      19       65.130000       54.542163 
      19       65.060000       54.542163 
      19       65.100000       54.540724 
      19       65.060000       54.540724 
      19       65.070000       54.540724 
      19       65.060000       54.540724 
      19       65.120000       54.542163 
      19       65.070000       54.542163 
      20       65.140000       54.542163 
      20       65.110000       54.542163 
      20       65.060000       54.542163 
      20       65.070000       54.540724 
      20       65.090000       54.540724 
      20       65.100000       54.540724 
      20       65.060000       54.540724 
      20       65.080000       54.540724 
      20       65.090000       54.542163 
      20       65.060000       54.540724 
      20       65.020000       54.540724 
      20       65.060000       54.540724 
      20       65.040000       54.540724 
      20       65.110000       54.540724 
      20       65.090000       54.540724 
      20       65.010000       54.540724 
      20       65.080000       54.540724 
      20       65.070000       54.540724 
      20       65.040000       54.542163 
      20       65.100000       54.540724 
      20       65.080000       54.542163 
      20       65.040000       54.542163 
      20       65.110000       54.542163 
      20       65.120000       54.540724 
      20       65.110000       54.540724 
      20       65.100000       54.540724 
      20       65.090000       54.542163 
      20       65.070000       54.542163 
      20       65.030000       54.542163 
      20       65.090000       54.542163 
      21       65.080000       54.540724 
      21       65.080000       54.542163 
      21       65.100000       54.542163 
      21       65.040000       54.540724 
      21       65.060000       54.540724 
      21       65.120000       54.542163 
      21       65.140000       54.540724 
      21       65.040000       54.542163 
      21       65.110000       54.540724 
      21       65.110000       54.542163 
      21       65.120000       54.542163 
      21       65.050000       54.542163 
      21       65.050000       54.542163 
      21       65.080000       54.540724 
      21       65.080000       54.540724 
      21       65.020000       54.540724 
      21       65.020000       54.542163 
      21       65.060000       54.540724 
      21       65.090000       54.540724 
      21       65.100000       54.542136 
      21       65.050000       54.539838 
      21       65.050000       54.539838 
      21       65.030000       54.539838 
      21       65.050000       54.539838 
      21       65.060000       54.531365 
      21       65.040000       54.492330 
      21       65.080000       54.492330 
      21       65.080000       54.492330 
      21       65.080000       54.462374 
      22       65.090000       54.492330 
      22       65.050000       54.492330 
      22       65.070000       54.531338 
      22       65.050000       54.538952 
      22       65.090000       54.538952 
      22       65.120000       54.531338 
      22       65.120000       54.492330 
      22       65.090000       54.462374 
      22       65.050000       54.462374 
      22       65.060000       54.462374 
      22       65.080000       54.492330 
      22       65.020000       54.531365 
      22       64.990000       54.531365 
      22       65.080000       54.531365 
      22       65.030000       54.531365 
      22       65.050000       54.531365 
      22       65.110000       54.531365 
      22       65.060000       54.531365 
      22       65.040000       54.531365 
      22       65.070000       54.531365 
      22       65.040000       54.531365 
      22       65.030000       54.539838 
      22       65.070000       54.542136 
      22       65.000000       54.540724 
      22       65.070000       54.542163 
      22       65.090000       54.542163 
      22       65.100000       54.542163 
      22       65.050000       54.542163 
      22       65.010000       54.540724 
      22       65.020000       54.542163 
      23       65.040000       54.542163 
      23       65.070000       54.540724 
      23       64.980000       54.540724 
      23       65.020000       54.542163 
      23       65.090000       54.542163 
      23       65.090000       54.542163 
      23       65.120000       54.540724 
      23       65.090000       54.542136 
      23       65.090000       54.539851 
      23       65.090000       54.531781 
      23       65.000000       54.496856 
      23       65.070000       54.476203 
      23       65.060000       54.476203 
      23       65.040000       54.488800 
      23       65.000000       54.495001 
      23       65.110000       54.495001 
      23       65.060000       54.495001 
      23       65.050000       54.495001 
      23       65.070000       54.495001 
      23       65.040000       54.495001 
      23       65.050000       54.495001 
      23       65.040000       54.495001 
      23       65.050000       54.495001 
      23       65.040000       54.495001 
      23       65.040000       54.517509 
      23       65.070000       54.535312 
      23       65.100000       54.535312 
      23       65.010000       54.535312 
      23       65.010000       54.535312 
      23       65.110000       54.541719 
      24       65.040000       54.540711 
      24       65.060000       54.540711 
      24       65.050000       54.540711 
      24       65.060000       54.540711 
      24       65.040000       54.540711 
      24       65.060000       54.540711 
      24       65.020000       54.540711 
      24       65.100000       54.542163 
      24       65.060000       54.540724 
      24       65.020000       54.542163 
      24       65.040000       54.540724 
      24       65.090000       54.540724 
      24       65.090000       54.542163 
      24       65.050000       54.540724 
      24       65.070000       54.540724 
      24       65.020000       54.540724 
      24       65.040000       54.542163 
      24       65.050000       54.540724 
      24       65.030000       54.542163 
      24       65.100000       54.540724 
      24       65.040000       54.540724 
      24       65.070000       54.540724 
      24       65.060000       54.542163 
      24       65.060000       54.540724 
      24       65.020000       54.542163 
      24       65.050000       54.542163 
      24       65.070000       54.542163 
      24       65.040000       54.542163 
      24       65.060000       54.542163 
      25       65.060000       54.540724 
      25       65.020000       54.540724 
      25       65.080000       54.540724 
      25       65.080000       54.542163 
      25       65.050000       54.542163 
      25       65.050000       54.542163 
      25       65.070000       54.542163 
      25       65.020000       54.542163 
      25       65.040000       54.540711 
      25       65.080000       54.540711 
      25       65.050000       54.540711 
      25       65.080000       54.541720 
      25       65.030000       54.535325 
      25       65.060000       54.535325 
      25       65.060000       54.535325 
      25       65.040000       54.535325 
      25       65.070000       54.535325 
      25       65.030000       54.535325 
      25       65.050000       54.517966 
      25       65.050000       54.517966 
      25       65.040000       54.517966 
      25       65.050000       54.517966 
      25       65.040000       54.500830 
      25       65.090000       54.517966 
      25       65.050000       54.535325 
      25       65.070000       54.535325 
      25       65.010000       54.541693 
      25       65.120000       54.539838 
      25       65.080000       54.539838 
      25       65.080000       54.531794 
      26       65.040000       54.531794 
      26       65.050000       54.531794 
      26       65.060000       54.531794 
      26       65.070000       54.497299 
      26       65.050000       54.481602 
      26       65.040000       54.512997 
      26       65.040000       54.534895 
      26       65.060000       54.541706 
      26       65.060000       54.541706 
      26       65.030000       54.540711 
      26       65.050000       54.540711 
      26       65.070000       54.540711 
      26       65.080000       54.542163 
      26       65.030000       54.540724 
      26       65.020000       54.540724 
      26       65.030000       54.542163 
      26       65.030000       54.540724 
      26       65.060000       54.542163 
      26       65.030000       54.540724 
      26       65.110000       54.542163 
      26       65.050000       54.540724 
      26       65.060000       54.542163 
      26       65.060000       54.540724 
      26       65.050000       54.542163 
      26       65.090000       54.542163 
      26       65.050000       54.542163 
      26       65.070000       54.542163 
      26       65.100000       54.542163 
      26       65.040000       54.540724 
      26       65.020000       54.540724 
      27       65.020000       54.542163 
      27       65.050000       54.542163 
      27       65.050000       54.542163 
      27       65.010000       54.542163 
      27       65.040000       54.542163 
      27       65.070000       54.542163 
      27       65.030000       54.542163 
      27       65.140000       54.542163 
      27       65.080000       54.542163 
      27       64.990000       54.540724 
      27       65.070000       54.542163 
      27       65.080000       54.542163 
      27       65.040000       54.542163 
      27       65.070000       54.542163 
      27       65.080000       54.540724 
      27       65.010000       54.542163 
      27       65.100000       54.540711 
      27       65.030000       54.540711 
      27       65.060000       54.541706 
      27       65.020000       54.534895 
      27       65.090000       54.512997 
      27       65.060000       54.481602 
      27       65.050000       54.497299 
      27       65.090000       54.497299 
      27       65.070000       54.497299 
      27       65.030000       54.497299 
      27       65.040000       54.531795 
      27       65.110000       54.539851 
      27       65.050000       54.542136 
      27       65.120000       54.540724 
      28       65.040000       54.540724 
      28       65.100000       54.540724 
      28       65.010000       54.540724 
      28       65.000000       54.540724 
      28       65.080000       54.540724 
      28       65.060000       54.542163 
      28       65.050000       54.540724 
      28       65.090000       54.542163 
      28       65.110000       54.542163 
      28       65.030000       54.540724 
      28       65.070000       54.542163 
      28       65.100000       54.540724 
      28       65.120000       54.542163 
      28       65.070000       54.542163 
      28       65.060000       54.540724 
      28       65.090000       54.542163 
      28       65.060000       54.542163 
      28       65.080000       54.542163 
      28       65.080000       54.542163 
      28       65.030000       54.542163 
      28       65.040000       54.542163 
      28       65.070000       54.540724 
      28       65.040000       54.542163 
      28       65.070000       54.542163 
      28       65.080000       54.542163 
      28       65.030000       54.542163 
      28       65.040000       54.542163 
      28       65.070000       54.542163 
      28       65.030000       54.542163 
      28       65.050000       54.540724 
      29       65.050000       54.540724 
      29       65.040000       54.542136 
      29       65.080000       54.539851 
      29       65.020000       54.531795 
      29       65.080000       54.497299 
      29       65.070000       54.481602 
      29       65.080000       54.512997 
      29       65.080000       54.534895 
      29       65.060000       54.541706 
      29       65.070000       54.541706 
      29       65.070000       54.540711 
      29       65.120000       54.540711 
      29       65.100000       54.542163 
      29       65.060000       54.542163 
      29       65.090000       54.540724 
      29       65.070000       54.540724 
      29       65.060000       54.540724 
      29       65.090000       54.540724 
      29       65.070000       54.542123 
      29       65.110000       54.542123 
      29       65.110000       54.542123 
      29       65.080000       54.539395 
      29       65.090000       54.525979 
      29       65.090000       54.468576 
      29       65.080000       54.427879 
      29       65.110000       54.492330 
      29       65.120000       54.492330 
      29       65.070000       54.492330 
      29       65.040000       54.565860 
      30       65.060000       54.563592 
      30       65.110000       54.547522 
      30       65.100000       54.541167 
      30       65.070000       54.542176 
      30       65.110000       54.542176 
      30       65.080000       54.542176 
      30       65.020000       54.540724 
      30       65.050000       54.542136 
      30       65.070000       54.539851 
      30       65.100000       54.539851 
      30       65.070000       54.531768 
      30       65.080000       54.531768 
      30       65.140000       54.531768 
      30       65.090000       54.496400 
      30       65.040000       54.470374 
      30       65.110000       54.470374 
      30       65.050000       54.470374 
      30       65.100000       54.470374 
      30       65.100000       54.459620 
      30       65.080000       54.435436 
      30       65.100000       54.467233 
      30       65.070000       54.501728 
      30       65.090000       54.493685 
      30       65.110000       54.493685 
      30       65.060000       54.493685 
      30       65.080000       54.493685 
      30       65.120000       54.493685 
      30       65.080000       54.493685 
      30       65.080000       54.493685 
      30       65.110000       54.488746 
      30       65.120000       54.475760 
      31       65.110000       54.491457 
      31       65.070000       54.491457 
      31       65.100000       54.507584 
      31       65.100000       54.499957 
      31       65.060000       54.499957 
      31       65.090000       54.499957 
      31       65.120000       54.499957 
      31       65.170000       54.517939 
      31       65.010000       54.517939 
      31       65.050000       54.517939 
      31       65.110000       54.517939 
      31       65.130000       54.517939 
      31       64.990000       54.535325 
      31       65.170000       54.535325 
      31       65.180000       54.541720 
      31       65.020000       54.540711 
      31       65.140000       54.540711 
      31       65.060000       54.540711 
      31       65.060000       54.540711 
      31       65.060000       54.540711 
      31       65.140000       54.540711 
      31       65.090000       54.540711 
      31       64.990000       54.540711 
      31       65.160000       54.540711 
      31       65.140000       54.542136 
      31       65.070000       54.539851 
      31       65.100000       54.539851 
      31       65.110000       54.531794 
      31       65.110000       54.497273 
      32       65.100000       54.497273 
      32       65.090000       54.497273 
      32       65.130000       54.497273 
      32       65.100000       54.497273 
      32       65.100000       54.480729 
      32       65.180000       54.480729 
      32       65.050000       54.502628 
      32       65.060000       54.502628 
      32       65.150000       54.502628 
      32       65.130000       54.491470 
      32       65.110000       54.481146 
      32       65.150000       54.481146 
      32       65.120000       54.481146 
      32       65.120000       54.481146 
      32       65.160000       54.512983 
      32       65.110000       54.512983 
      32       65.140000       54.534895 
      32       65.110000       54.534895 
      32       65.030000       54.534895 
      32       65.160000       54.534895 
      32       65.130000       54.534895 
      32       65.170000       54.534895 
      32       65.130000       54.534895 
      32       65.090000       54.541707 
      32       65.210000       54.540738 
      32       65.120000       54.540738 
      32       65.060000       54.540738 
      32       65.150000       54.543049 
      32       65.140000       54.551523 
      32       65.110000       54.551523 
      32       65.130000       54.551523 
      33       65.100000       54.590557 
      33       65.140000       54.590557 
      33       65.080000       54.620513 
      33       65.130000       54.590557 
      33       65.110000       54.551523 
      33       65.140000       54.543049 
      33       65.150000       54.543049 
      33       65.170000       54.543049 
      33       65.140000       54.543049 
      33       65.140000       54.543049 
      33       65.100000       54.543049 
      33       65.140000       54.543049 
      33       65.100000       54.543049 
      33       65.140000       54.543049 
      33       65.120000       54.540751 
      33       65.080000       54.542163 
      33       65.160000       54.540724 
      33       65.060000       54.542163 
      33       65.070000       54.542163 
      33       65.190000       54.540724 
      33       65.130000       54.540724 
      33       65.040000       54.542163 
      33       65.120000       54.540724 
      33       65.140000       54.542136 
      33       65.170000       54.542136 
      33       65.150000       54.539851 
      33       65.120000       54.531795 
      33       65.130000       54.497299 
      33       65.130000       54.497299 
      33       65.140000       54.481602 
      34       65.120000       54.512997 
      34       65.100000       54.512997 
      34       65.140000       54.512997 
      34       65.110000       54.534895 
      34       65.120000       54.541706 
      34       65.160000       54.541706 
      34       65.110000       54.540711 
      34       65.190000       54.542163 
      34       65.110000       54.540724 
      34       65.080000       54.540724 
      34       65.160000       54.540724 
      34       65.120000       54.540724 
      34       65.110000       54.540724 
      34       65.120000       54.542163 
      34       65.160000       54.540711 
      34       65.110000       54.540711 
      34       65.130000       54.541706 
      34       65.120000       54.534895 
      34       65.160000       54.512997 
      34       65.080000       54.481602 
      34       65.150000       54.497299 
      34       65.250000       54.531795 
      34       65.190000       54.531795 
      34       65.110000       54.531795 
      34       65.120000       54.539851 
      34       65.170000       54.542136 
      34       65.120000       54.542136 
      34       65.150000       54.540724 
      34       65.120000       54.542163 
      35       65.130000       54.542163 
      35       65.190000       54.542163 
      35       65.200000       54.542163 
      35       65.170000       54.540724 
      35       65.100000       54.542123 
      35       65.160000       54.542123 
      35       65.150000       54.542123 
      35       65.120000       54.542123 
      35       65.150000       54.539408 
      35       65.070000       54.526395 
      35       65.100000       54.526395 
      35       65.150000       54.473102 
      35       65.140000       54.473102 
      35       65.130000       54.441695 
      35       65.110000       54.488356 
      35       65.110000       54.488356 
      35       65.150000       54.488356 
      35       65.120000       54.524084 
      35       65.150000       54.516623 
      35       65.170000       54.495404 
      35       65.130000       54.495404 
      35       65.180000       54.495404 
      35       65.170000       54.495404 
      35       65.210000       54.493768 
      35       65.130000       54.493768 
      35       65.160000       54.495431 
      35       65.200000       54.495431 
      35       65.100000       54.495431 
      35       65.160000       54.495431 
      35       65.120000       54.517523 
      36       65.200000       54.517523 
      36       65.180000       54.517523 
      36       65.120000       54.535312 
      36       65.190000       54.541719 
      36       65.200000       54.541719 
      36       65.070000       54.540711 
      36       65.210000       54.540711 
      36       65.180000       54.542163 
      36       65.160000       54.540724 
      36       65.160000       54.542163 
      36       65.160000       54.540724 
      36       65.150000       54.540724 
      36       65.120000       54.542163 
      36       65.130000       54.542163 
      36       65.130000       54.542163 
      36       65.180000       54.540724 
      36       65.100000       54.542163 
      36       65.140000       54.540724 
      36       65.140000       54.542163 
      36       65.180000       54.542163 
      36       65.150000       54.542163 
      36       65.150000       54.542163 
      36       65.120000       54.542163 
      36       65.130000       54.542163 
      36       65.170000       54.542163 
      36       65.150000       54.540724 
      36       65.160000       54.540724 
      36       65.190000       54.542163 
      36       65.200000       54.540724 
      37       65.160000       54.542136 
      37       65.130000       54.539851 
      37       65.180000       54.531795 
      37       65.090000       54.531795 
      37       65.150000       54.531795 
      37       65.170000       54.531795 
      37       65.200000       54.497299 
      37       65.120000       54.481602 
      37       65.180000       54.512997 
      37       65.190000       54.512997 
      37       65.170000       54.534895 
      37       65.190000       54.534895 
      37       65.140000       54.534895 
      37       65.170000       54.534895 
      37       65.160000       54.534895 
      37       65.190000       54.541706 
      37       65.100000       54.540711 
      37       65.140000       54.542163 
      37       65.210000       54.542163 
      37       65.170000       54.542163 
      37       65.160000       54.542163 
      37       65.150000       54.542163 
      37       65.130000       54.542163 
      37       65.100000       54.540711 
      37       65.130000       54.541720 
      37       65.160000       54.541720 
      37       65.150000       54.541720 
      37       65.150000       54.541720 
      37       65.140000       54.541720 
      38       65.170000       54.541720 
      38       65.180000       54.541720 
      38       65.140000       54.535325 
      38       65.180000       54.517966 
      38       65.180000       54.500830 
      38       65.160000       54.517966 
      38       65.110000       54.517966 
      38       65.180000       54.517966 
      38       65.190000       54.517966 
      38       65.190000       54.517966 
      38       65.170000       54.535325 
      38       65.150000       54.541719 
      38       65.170000       54.541719 
      38       65.130000       54.541719 
      38       65.140000       54.541719 
      38       65.180000       54.541719 
      38       65.180000       54.541719 
      38       65.160000       54.540698 
      38       65.180000       54.541706 
      38       65.150000       54.541706 
      38       65.160000       54.541706 
      38       65.180000       54.541706 
      38       65.130000       54.534895 
      38       65.170000       54.512997 
      38       65.180000       54.481602 
      38       65.180000       54.497299 
      38       65.170000       54.531795 
      38       65.220000       54.539851 
      38       65.140000       54.539851 
      38       65.200000       54.539851 
      39       65.260000       54.539851 
      39       65.180000       54.542136 
      39       65.130000       54.540724 
      39       65.150000       54.540724 
      39       65.220000       54.540724 
      39       65.210000       54.540724 
      39       65.180000       54.540724 
      39       65.170000       54.540724 
      39       65.200000       54.542163 
      39       65.180000       54.540724 
      39       65.210000       54.542163 
      39       65.220000       54.540724 
      39       65.170000       54.542163 
      39       65.120000       54.540724 
      39       65.200000       54.542163 
      39       65.190000       54.542163 
      39       65.140000       54.542163 
      39       65.260000       54.540724 
      39       65.220000       54.540724 
      39       65.130000       54.542163 
      39       65.230000       54.542163 
      39       65.110000       54.542163 
      39       65.160000       54.542163 
      39       65.170000       54.542163 
      39       65.190000       54.542163 
      39       65.190000       54.542163 
      39       65.230000       54.542163 
      39       65.110000       54.542163 
      39       65.210000       54.542163 
      39       65.210000       54.542163 
      39       65.160000       54.542163 
      40       65.160000       54.540724 
      40       65.180000       54.542163 
      40       65.210000       54.542163 
      40       65.160000       54.542163 
      40       65.150000       54.540724 
      40       65.160000       54.542163 
      40       65.110000       54.542163 
      40       65.140000       54.540711 
      40       65.210000       54.541706 
      40       65.190000       54.534895 
      40       65.260000       54.512997 
      40       65.150000       54.512997 
      40       65.110000       54.512997 
      40       65.160000       54.481602 
      40       65.150000       54.481602 
      40       65.200000       54.481602 
      40       65.140000       54.481602 
      40       65.180000       54.481602 
      40       65.140000       54.497299 
      40       65.190000       54.531795 
      40       65.240000       54.539878 
      40       65.120000       54.539878 
      40       65.150000       54.539878 
      40       65.220000       54.543023 
      40       65.110000       54.551522 
      40       65.150000       54.590557 
      40       65.170000       54.620499 
      40       65.090000       54.620499 
      40       65.210000       54.620499 
      41       65.140000       54.620499 
      41       65.170000       54.620499 
      41       65.200000       54.620499 
      41       65.110000       54.620499 
      41       65.150000       54.620499 
      41       65.160000       54.620499 
      41       65.170000       54.620499 
      41       65.140000       54.590114 
      41       65.220000       54.546124 
      41       65.200000       54.518852 
      41       65.160000       54.500857 
      41       65.130000       54.517966 
      41       65.190000       54.535325 
      41       65.170000       54.541720 
      41       65.100000       54.540711 
      41       65.150000       54.540711 
      41       65.180000       54.542163 
      41       65.180000       54.540724 
      41       65.110000       54.540724 
      41       65.270000       54.540724 
      41       65.140000       54.540724 
      41       65.050000       54.542163 
      41       65.140000       54.540724 
      41       65.170000       54.542163 
      41       65.110000       54.540724 
      41       65.120000       54.540724 
      41       65.190000       54.540724 
      41       65.120000       54.540724 
      41       65.150000       54.542163 
      41       65.170000       54.540724 
      42       65.140000       54.540724 
      42       65.140000       54.540724 
      42       65.180000       54.540724 
      42       65.140000       54.540724 
      42       65.140000       54.540724 
      42       65.140000       54.542163 
      42       65.240000       54.542163 
      42       65.160000       54.540711 
      42       65.190000       54.540711 
      42       65.200000       54.540711 
      42       65.180000       54.540711 
      42       65.170000       54.540711 
      42       65.160000       54.541720 
      42       65.190000       54.535325 
      42       65.100000       54.535325 
      42       65.140000       54.535325 
      42       65.190000       54.517966 
      42       65.180000       54.500830 
      42       65.130000       54.517966 
      42       65.160000       54.517966 
      42       65.180000       54.517966 
      42       65.140000       54.535325 
      42       65.130000       54.541720 
      42       65.150000       54.540711 
      42       65.100000       54.542163 
      42       65.160000       54.542163 
      42       65.070000       54.540724 
      42       65.220000       54.542163 
      42       65.160000       54.540711 
      42       65.110000       54.541720 
      43       65.150000       54.541720 
      43       65.190000       54.541720 
      43       65.150000       54.541720 
      43       65.180000       54.535325 
      43       65.140000       54.517966 
      43       65.120000       54.500830 
      43       65.130000       54.517939 
      43       65.140000       54.517939 
      43       65.140000       54.534439 
      43       65.130000       54.530921 
      43       65.170000       54.530921 
      43       65.120000       54.492317 
      43       65.170000       54.462374 
      43       65.220000       54.492330 
      43       65.210000       54.492330 
      43       65.160000       54.531324 
      43       65.160000       54.531324 
      43       65.150000       54.538509 
      43       65.140000       54.538509 
      43       65.140000       54.525939 
      43       65.190000       54.468133 
      43       65.180000       54.468133 
      43       65.130000       54.468133 
      43       65.190000       54.422480 
      43       65.130000       54.422480 
      43       65.140000       54.468133 
      43       65.230000       54.468133 
      43       65.120000       54.468133 
      43       65.150000       54.525966 
      43       65.150000       54.539395 
      43       65.100000       54.542123 
      44       65.140000       54.540711 
      44       65.160000       54.540711 
      44       65.150000       54.540711 
      44       65.160000       54.540711 
      44       65.150000       54.541720 
      44       65.160000       54.535325 
      44       65.220000       54.517966 
      44       65.090000       54.517966 
      44       65.180000       54.500817 
      44       65.190000       54.500817 
      44       65.140000       54.500817 
      44       65.130000       54.500817 
      44       65.200000       54.500817 
      44       65.110000       54.517523 
      44       65.120000       54.529926 
      44       65.100000       54.529926 
      44       65.160000       54.517523 
      44       65.160000       54.500817 
      44       65.160000       54.500817 
      44       65.150000       54.500817 
      44       65.190000       54.500817 
      44       65.130000       54.517939 
      44       65.130000       54.534439 
      44       65.170000       54.534439 
      44       65.170000       54.534439 
      44       65.100000       54.534439 
      44       65.110000       54.530921 
      44       65.120000       54.492317 
      44       65.120000       54.462347 
      44       65.130000       54.462347 
      45       65.110000       54.462347 
      45       65.230000       54.462347 
      45       65.210000       54.462347 
      45       65.170000       54.491444 
      45       65.130000       54.491444 
      45       65.140000       54.491444 
      45       65.110000       54.520566 
      45       65.180000       54.491444 
      45       65.110000       54.462348 
      45       65.160000       54.492330 
      45       65.150000       54.531365 
      45       65.120000       54.531365 
      45       65.170000       54.539838 
      45       65.150000       54.542136 
      45       65.140000       54.542136 
      45       65.150000       54.542136 
      45       65.160000       54.542136 
      45       65.170000       54.540724 
      45       65.140000       54.540724 
      45       65.150000       54.542136 
      45       65.150000       54.539851 
      45       65.120000       54.531795 
      45       65.190000       54.531795 
      45       65.110000       54.531795 
      45       65.160000       54.497300 
      45       65.130000       54.497300 
      45       65.100000       54.481629 
      45       65.150000       54.481629 
      45       65.150000       54.513883 
      45       65.150000       54.513883 
      46       65.140000       54.545694 
      46       65.190000       54.590101 
      46       65.150000       54.620499 
      46       65.150000       54.590557 
      46       65.150000       54.551523 
      46       65.190000       54.543049 
      46       65.130000       54.540738 
      46       65.090000       54.541707 
      46       65.160000       54.541707 
      46       65.100000       54.541707 
      46       65.140000       54.541707 
      46       65.190000       54.541707 
      46       65.080000       54.541707 
      46       65.170000       54.541707 
      46       65.140000       54.541707 
      46       65.110000       54.541707 
      46       65.100000       54.541707 
      46       65.100000       54.541707 
      46       65.120000       54.534895 
      46       65.170000       54.512997 
      46       65.160000       54.512997 
      46       65.160000       54.512997 
      46       65.170000       54.512997 
      46       65.190000       54.512997 
      46       65.170000       54.512997 
      46       65.200000       54.512997 
      46       65.120000       54.512997 
      46       65.130000       54.512997 
      46       65.210000       54.512997 
      47       65.200000       54.481602 
      47       65.150000       54.497299 
      47       65.140000       54.497299 
      47       65.170000       54.497299 
      47       65.130000       54.497299 
      47       65.110000       54.497299 
      47       65.120000       54.497299 
      47       65.140000       54.497299 
      47       65.200000       54.497299 
      47       65.100000       54.497299 
      47       65.150000       54.497299 
      47       65.120000       54.497299 
      47       65.150000       54.497299 
      47       65.130000       54.497299 
      47       65.190000       54.497299 
      47       65.120000       54.497299 
      47       65.160000       54.531795 
      47       65.150000       54.539851 
      47       65.150000       54.539851 
      47       65.130000       54.539851 
      47       65.140000       54.539851 
      47       65.150000       54.542136 
      47       65.120000       54.540724 
      47       65.140000       54.540724 
      47       65.130000       54.542163 
      47       65.120000       54.540724 
      47       65.210000       54.542163 
      47       65.140000       54.542163 
      47       65.160000       54.540724 
      47       65.110000       54.540724 
      47       65.130000       54.542163 
      48       65.140000       54.542163 
      48       65.130000       54.542163 
      48       65.120000       54.540724 
      48       65.140000       54.542163 
      48       65.120000       54.542163 
      48       65.090000       54.542163 
      48       65.180000       54.542163 
      48       65.130000       54.542163 
      48       65.100000       54.542163 
      48       65.140000       54.540724 
      48       65.150000       54.542163 
      48       65.100000       54.540724 
      48       65.140000       54.540724 
      48       65.140000       54.542163 
      48       65.140000       54.542163 
      48       65.150000       54.542163 
      48       65.150000       54.540724 
      48       65.130000       54.540724 
      48       65.170000       54.542136 
      48       65.150000       54.542136 
      48       65.130000       54.542136 
      48       65.150000       54.542136 
      48       65.150000       54.542136 
      48       65.150000       54.542136 
      48       65.140000       54.542136 
      48       65.120000       54.542136 
      48       65.110000       54.542136 
      48       65.100000       54.542136 
      48       65.100000       54.542136 
      48       65.200000       54.542136 
      49       65.180000       54.542136 
      49       65.100000       54.539851 
      49       65.150000       54.531795 
      49       65.180000       54.531795 
      49       65.080000       54.531795 
      49       65.130000       54.531795 
      49       65.180000       54.497299 
      49       65.170000       54.481602 
      49       65.180000       54.481602 
      49       65.130000       54.481602 
      49       65.090000       54.481602 
      49       65.140000       54.481602 
      49       65.150000       54.512997 
      49       65.160000       54.534895 
      49       65.140000       54.541706 
      49       65.180000       54.540711 
      49       65.210000       54.540711 
      49       65.130000       54.540711 
      49       65.130000       54.540711 
      49       65.080000       54.542163 
      49       65.120000       54.542163 
      49       65.080000       54.542163 
      49       65.170000       54.540724 
      49       65.120000       54.540724 
      49       65.130000       54.542163 
      49       65.170000       54.540724 
      49       65.180000       54.542163 
      49       65.110000       54.540724 
      49       65.100000       54.540724 
      49       65.090000       54.542163 
      50       65.190000       54.540724 
      50       65.140000       54.540724 
      50       65.120000       54.540724 
      50       65.140000       54.540724 
      50       65.190000       54.540724 
      50       65.170000       54.540724 
      50       65.160000       54.540724 
      50       65.110000       54.542163 
      50       65.160000       54.540724 
      50       65.170000       54.542163 
      50       65.180000       54.540724 
      50       65.130000       54.542163 
      50       65.150000       54.540724 
      50       65.190000       54.542163 
      50       65.100000       54.542163 
      50       65.090000       54.540724 
      50       65.170000       54.542163 
      50       65.150000       54.542163 
      50       65.120000       54.540724 
      50       65.130000       54.542163 
      50       65.110000       54.540724 
      50       65.090000       54.542163 
      50       65.140000       54.542163 
      50       65.220000       54.540724 
      50       65.130000       54.542163 
      50       65.140000       54.540724 
      50       65.210000       54.542163 
      50       65.130000       54.542163 
      50       65.140000       54.540724 
      50       65.160000       54.540724 
      51       65.160000       54.540724 
      51       65.100000       54.540724 
      51       65.150000       54.542163 
      51       65.080000       54.542163 
      51       65.130000       54.540724 
      51       65.150000       54.542163 
      51       65.160000       54.542163 
      51       65.140000       54.542163 
      51       65.200000       54.540711 
      51       65.120000       54.541706 
      51       65.100000       54.541706 
      51       65.160000       54.541706 
      51       65.100000       54.534895 
      51       65.170000       54.512997 
      51       65.110000       54.512997 
      51       65.090000       54.481602 
      51       65.190000       54.497299 
      51       65.160000       54.497299 
      51       65.140000       54.497299 
      51       65.160000       54.497299 
      51       65.200000       54.497299 
      51       65.110000       54.497299 
      51       65.120000       54.497299 
      51       65.140000       54.497299 
      51       65.130000       54.497299 
      51       65.110000       54.497299 
      51       65.130000       54.497299 
      51       65.110000       54.531795 
      51       65.160000       54.531795 
      51       65.120000       54.531795 
      52       65.080000       54.531795 
      52       65.090000       54.539851 
      52       65.120000       54.539851 
      52       65.060000       54.542136 
      52       65.150000       54.540724 
      52       65.160000       54.542163 
      52       65.180000       54.542163 
      52       65.140000       54.540724 
      52       65.160000       54.540724 
      52       65.110000       54.542163 
      52       65.130000       54.540724 
      52       65.100000       54.540724 
      52       65.150000       54.540724 
      52       65.120000       54.542163 
      52       65.110000       54.542163 
      52       65.210000       54.540724 
      52       65.170000       54.540724 
      52       65.150000       54.540724 
      52       65.130000       54.540724 
      52       65.090000       54.540724 
      52       65.120000       54.540724 
      52       65.170000       54.540724 
      52       65.120000       54.540724 
      52       65.150000       54.540724 
      52       65.160000       54.542163 
      52       65.090000       54.540724 
      52       65.190000       54.540724 
      52       65.120000       54.540724 
      52       65.120000       54.542163 
      52       65.130000       54.542163 
      53       65.120000       54.540724 
      53       65.130000       54.540724 
      53       65.150000       54.542123 
      53       65.110000       54.539395 
      53       65.240000       54.525966 
      53       65.190000       54.525966 
      53       65.110000       54.525966 
      53       65.190000       54.468133 
      53       65.170000       54.422480 
      53       65.120000       54.468133 
      53       65.100000       54.468133 
      53       65.210000       54.468133 
      53       65.130000       54.468133 
      53       65.110000       54.525966 
      53       65.120000       54.525966 
      53       65.150000       54.539395 
      53       65.140000       54.539395 
      53       65.150000       54.539395 
      53       65.110000       54.542123 
      53       65.130000       54.540724 
      53       65.140000       54.540724 
      53       65.150000       54.540724 
      53       65.100000       54.540724 
      53       65.130000       54.540724 
      53       65.150000       54.540724 
      53       65.100000       54.542163 
      53       65.160000       54.540724 
      53       65.120000       54.540724 
      53       65.200000       54.540724 
      54       65.160000       54.542163 
      54       65.160000       54.540724 
      54       65.200000       54.542163 
      54       65.160000       54.542163 
      54       65.180000       54.540724 
      54       65.120000       54.542163 
      54       65.190000       54.540724 
      54       65.150000       54.542163 
      54       65.170000       54.540724 
      54       65.140000       54.540724 
      54       65.130000       54.540724 
      54       65.130000       54.542163 
      54       65.190000       54.540724 
      54       65.130000       54.542163 
      54       65.120000       54.542163 
      54       65.160000       54.540724 
      54       65.090000       54.542163 
      54       65.150000       54.542163 
      54       65.100000       54.540724 
      54       65.160000       54.540724 
      54       65.180000       54.540724 
      54       65.150000       54.540724 
      54       65.160000       54.540724 
      54       65.150000       54.542163 
      54       65.130000       54.540711 
      54       65.190000       54.540711 
      54       65.200000       54.540711 
      54       65.130000       54.540711 
      54       65.080000       54.540711 
      55       65.150000       54.540711 
      55       65.110000       54.540711 
      55       65.180000       54.540711 
      55       65.130000       54.540711 
      55       65.140000       54.540711 
      55       65.150000       54.540711 
      55       65.150000       54.540711 
      55       65.160000       54.540711 
      55       65.140000       54.541706 
      55       65.180000       54.534895 
      55       65.130000       54.512996 
      55       65.160000       54.481576 
      55       65.150000       54.481576 
      55       65.170000       54.481576 
      55       65.170000       54.481576 
      55       65.110000       54.481576 
      55       65.140000       54.481576 
      55       65.160000       54.496426 
      55       65.170000       54.496426 
      55       65.170000       54.521426 
      55       65.120000       54.496426 
      55       65.160000       54.496426 
      55       65.120000       54.481576 
      55       65.130000       54.481576 
      55       65.150000       54.481576 
      55       65.140000       54.481576 
      55       65.160000       54.481576 
      55       65.150000       54.481576 
      55       65.170000       54.481576 
      55       65.110000       54.481576 
      56       65.180000       54.481576 
      56       65.150000       54.481576 
      56       65.160000       54.481576 
      56       65.060000       54.481576 
      56       65.190000       54.481576 
      56       65.130000       54.481576 
      56       65.210000       54.512996 
      56       65.170000       54.534895 
      56       65.100000       54.534895 
      56       65.110000       54.534895 
      56       65.150000       54.534895 
      56       65.160000       54.534895 
      56       65.220000       54.534895 
      56       65.160000       54.541706 
      56       65.200000       54.541706 
      56       65.110000       54.540711 
      56       65.150000       54.542163 
      56       65.200000       54.542163 
      56       65.160000       54.540724 
      56       65.170000       54.542163 
      56       65.200000       54.540724 
      56       65.160000       54.542163 
      56       65.170000       54.540724 
      56       65.180000       54.542163 
      56       65.190000       54.540724 
      56       65.120000       54.542163 
      56       65.170000       54.540724 
      56       65.140000       54.542163 
      56       65.150000       54.542163 
      57       65.110000       54.542163 
      57       65.120000       54.542163 
      57       65.160000       54.540724 
      57       65.160000       54.542163 
      57       65.140000       54.542163 
      57       65.250000       54.542163 
      57       65.170000       54.542163 
      57       65.100000       54.542163 
      57       65.170000       54.542163 
      57       65.160000       54.540724 
      57       65.160000       54.540724 
      57       65.170000       54.542136 
      57       65.170000       54.542136 
      57       65.160000       54.542136 
      57       65.130000       54.539851 
      57       65.130000       54.539851 
      57       65.150000       54.531794 
      57       65.130000       54.531794 
      57       65.210000       54.497273 
      57       65.110000       54.480716 
      57       65.150000       54.480716 
      57       65.150000       54.502198 
      57       65.170000       54.502198 
      57       65.170000       54.486501 
      57       65.150000       54.486501 
      57       65.140000       54.486501 
      57       65.190000       54.486501 
      57       65.130000       54.486501 
      57       65.170000       54.486501 
      57       65.150000       54.486501 
      58       65.140000       54.486501 
      58       65.140000       54.486501 
      58       65.150000       54.486501 
      58       65.130000       54.486501 
      58       65.140000       54.486501 
      58       65.140000       54.461918 
      58       65.140000       54.492317 
      58       65.150000       54.492317 
      58       65.160000       54.492317 
      58       65.190000       54.531364 
      58       65.170000       54.531364 
      58       65.120000       54.539838 
      58       65.160000       54.539838 
      58       65.220000       54.542136 
      58       65.170000       54.542136 
      58       65.100000       54.542136 
      58       65.160000       54.540724 
      58       65.170000       54.540724 
      58       65.190000       54.542163 
      58       65.190000       54.540724 
      58       65.170000       54.542163 
      58       65.160000       54.540724 
      58       65.170000       54.540724 
      58       65.160000       54.540724 
      58       65.180000       54.540724 
      58       65.190000       54.540724 
      58       65.140000       54.540724 
      58       65.180000       54.540724 
      58       65.220000       54.540724 
      58       65.180000       54.540724 
      59       65.200000       54.540724 
      59       65.150000       54.542163 
      59       65.110000       54.540751 
      59       65.150000       54.540751 
      59       65.170000       54.540751 
      59       65.080000       54.543049 
      59       65.090000       54.551523 
      59       65.140000       54.590557 
      59       65.180000       54.620513 
      59       65.100000       54.590557 
      59       65.170000       54.590557 
      59       65.130000       54.590557 
      59       65.200000       54.551523 
      59       65.190000       54.551523 
      59       65.140000       54.543049 
      59       65.190000       54.540751 
      59       65.190000       54.540751 
      59       65.200000       54.540751 
      59       65.150000       54.540751 
      59       65.160000       54.542163 
      59       65.180000       54.540724 
      59       65.170000       54.540724 
      59       65.140000       54.542163 
      59       65.170000       54.540724 
      59       65.200000       54.540724 
      59       65.160000       54.542163 
      59       65.160000       54.542163 
      59       65.210000       54.542163 
      59       65.070000       54.540724 
      60       65.160000       54.540724 
      60       65.170000       54.542163 
      60       65.150000       54.542163 
      60       65.190000       54.542163 
      60       65.160000       54.542163 
      60       65.140000       54.540724 
      60       65.180000       54.542163 
      60       65.180000       54.542163 
      60       65.120000       54.542163 
      60       65.140000       54.540724 
      60       65.160000       54.540724 
      60       65.140000       54.540724 
      60       65.130000       54.540724 
      60       65.180000       54.540724 
      60       65.120000       54.540724 
      60       65.160000       54.542163 
      60       65.210000       54.542163 
      60       65.190000       54.542163 
      60       65.160000       54.542163 
      60       65.190000       54.542163 
      60       65.160000       54.540724 
      60       65.180000       54.540724 
      60       65.150000       54.542163 
      60       65.170000       54.540751 
      60       65.160000       54.543036 
      60       65.190000       54.551093 
      60       65.110000       54.551093 
      60       65.190000       54.551093 
      60       65.180000       54.585588 
      61       65.180000       54.601285 
