Human trial picking the raspberry twin 

 time    ||     output     ||     loadcell

      0.000000       -792.198462       0.080000 
      0.031335       -792.198462       0.210000 
      0.062204       -792.198462       0.030000 
      0.093944       -792.198462       0.180000 
      0.125493       -792.198462       0.210000 
      0.156795       -792.198462       0.140000 
      0.187912       -792.198462       0.080000 
      0.218632       -792.198462       0.000000 
      0.249197       -792.198462       0.040000 
      0.280761       -792.198457       0.110000 
      0.311580       -792.197279       0.100000 
      0.342939       -792.091259       0.070000 
      0.373883       -788.580375       0.060000 
      0.405154       -745.809618       0.050000 
      0.436015       -554.131181       0.040000 
      0.467298       -238.136615       0.120000 
      0.498523       -46.516410       0.030000 
      0.529008       -3.745196       0.030000 
      0.559793       -0.170252       0.110000 
      0.590376       -0.035535       0.190000 
      0.621553       -0.039726       0.030000 
      0.652817       -0.028510       0.020000 
      0.683810       -0.033023       0.070000 
      0.714999       -0.058036       0.040000 
      0.747116       -0.043777       0.090000 
      0.779305       -0.012800       0.110000 
      0.810518       -0.025409       0.200000 
      0.841768       -0.042352       0.030000 
      0.873566       -0.048720       0.170000 
      0.904519       -0.047268       0.160000 
      0.935484       -0.043321       0.050000 
      0.966447       -0.017712       0.030000 
      0.997733       0.019871       0.130000 
      1.029094       0.035151       0.270000 
      1.059608       -0.003857       0.110000 
      1.091007       -0.056720       0.230000 
      1.121894       -0.057136       0.150000 
      1.153059       -0.008799       0.050000 
      1.184131       0.016797       0.040000 
      1.214764       0.009586       0.130000 
      1.245552       0.022599       0.180000 
      1.276148       0.019911       0.070000 
      1.307013       -0.003817       0.170000 
      1.338632       -0.040163       0.030000 
      1.369771       -0.044151       0.080000 
      1.400943       0.029739       0.080000 
      1.431883       0.035081       0.020000 
      1.463459       -0.079575       0.020000 
      1.494559       -0.145035       0.220000 
      1.526152       -0.121298       0.070000 
      1.557840       -0.080062       0.030000 
      1.587793       -0.059019       0.180000 
      1.619702       -0.074260       0.210000 
      1.649594       -0.092588       0.030000 
      1.681543       -0.091729       0.070000 
      1.713457       -0.063462       0.030000 
      1.743371       -0.010612       0.060000 
      1.775292       0.000129       0.140000 
      1.807175       -0.068848       0.020000 
      1.837126       -0.126654       0.010000 
      1.869009       -0.115912       0.140000 
      1.900922       -0.074207       0.200000 
      1.930870       -0.033936       0.150000 
      1.962783       -0.024038       0.050000 
      1.994705       -0.026296       0.110000 
      2.024625       -0.041979       0.030000 
      2.055511       -0.108285       0.100000 
      2.086427       -0.127070       0.160000 
      2.118369       -0.080974       0.020000 
      2.149258       -0.044651       0.060000 
      2.180203       -0.000270       0.010000 
      2.212092       0.024756       0.210000 
      2.243035       -0.028954       0.020000 
      2.272959       -0.102900       0.200000 
      2.303847       -0.115926       0.110000 
      2.334764       -0.098431       0.120000 
      2.365708       -0.080102       0.010000 
      2.395627       -0.083203       0.130000 
      2.427516       -0.119084       0.130000 
      2.459455       -0.135167       0.090000 
      2.491390       -0.108299       0.120000 
      2.522281       -0.034366       0.080000 
      2.553206       0.005072       0.010000 
      2.585122       -0.026283       0.050000 
      2.616039       -0.070659       0.050000 
      2.646955       -0.102887       0.070000 
      2.678869       -0.073803       0.100000 
      2.709761       -0.042839       0.030000 
      2.740705       -0.070716       0.140000 
      2.772591       -0.085817       0.220000 
      2.803543       -0.075659       0.000000 
      2.834426       -0.061637       0.050000 
      2.866369       -0.089541       0.220000 
      2.897292       -0.088519       0.080000 
      2.928203       -0.068045       0.150000 
      2.960091       -0.093488       0.000000 
      2.991026       -0.109198       0.060000 
      3.021953       -0.087260       0.120000 
      3.052870       -0.098001       0.200000 
      3.083761       -0.103813       0.050000 
      3.115701       -0.058563       0.040000 
      3.145594       -0.044708       0.070000 
      3.177510       -0.088102       0.020000 
      3.208426       -0.108326       0.010000 
      3.239371       -0.082304       0.190000 
      3.270294       -0.079659       0.110000 
      3.301206       -0.093944       0.070000 
      3.332134       -0.103427       0.010000 
      3.362043       -0.122655       0.070000 
      3.392961       -0.138808       0.060000 
      3.424875       -0.128483       0.110000 
      3.455799       -0.132996       0.170000 
      3.486710       -0.157149       0.010000 
      3.518625       -0.132939       0.150000 
      3.548546       -0.063062       0.120000 
      3.580434       -0.028954       0.020000 
      3.611648       -0.015095       0.110000 
      3.641371       0.016313       0.030000 
      3.673286       0.009085       0.050000 
      3.703205       -0.047751       0.130000 
      3.735087       -0.107882       0.190000 
      3.767035       -0.117215       0.010000 
      3.796955       -0.108369       0.100000 
      3.828836       -0.118115       0.190000 
      3.860752       -0.119137       0.100000 
      3.890678       -0.101961       0.030000 
      3.922585       -0.099412       0.190000 
      3.953536       -0.085321       0.190000 
      3.984420       -0.039817       0.040000 
      4.015337       0.041962       0.130000 
      4.046255       0.076694       0.130000 
      4.078169       0.042392       0.020000 
      4.109114       -0.034848       0.100000 
      4.140005       -0.066053       0.130000 
      4.169924       -0.077416       0.170000 
      4.201839       -0.082193       0.220000 
      4.232756       -0.043361       0.090000 
      4.262710       0.015910       0.060000 
      4.293621       0.033256       0.010000 
      4.325542       -0.002888       0.140000 
      4.355428       -0.063961       0.070000 
      4.387378       -0.083991       0.130000 
      4.417889       -0.059018       0.000000 
      4.448807       0.015897       0.090000 
      4.478727       0.048497       0.000000 
      4.510642       -0.005656       0.300000 
      4.541620       -0.092615       0.090000 
      4.572087       -0.161206       0.280000 
      4.602860       -0.181320       0.120000 
      4.633520       -0.149136       0.020000 
      4.663668       -0.112813       0.250000 
      4.694114       -0.120453       0.020000 
      4.725873       -0.123098       0.100000 
      4.757420       -0.127181       0.010000 
      4.789096       -0.133382       0.030000 
      4.819882       -0.098457       0.030000 
      4.851347       -0.063505       0.270000 
      4.883286       -0.068834       0.150000 
      4.913155       -0.062576       0.080000 
      4.945071       -0.022682       0.070000 
      4.977011       0.019441       0.230000 
      5.022863       0.035165       0.150000 
      5.054810       -0.002997       0.060000 
      5.085696       -0.046821       0.040000 
      5.116611       -0.019983       0.000000 
      5.148527       0.017196       0.110000 
      5.178473       -0.038795       0.080000 
      5.210362       -0.067918       0.080000 
      5.240280       -0.011940       0.070000 
      5.271311       0.008670       0.150000 
      5.301942       -0.023970       0.110000 
      5.333577       -0.066645       0.050000 
      5.364794       -0.075934       0.020000 
      5.396261       -0.019513       0.050000 
      5.427348       0.052622       0.180000 
      5.458886       0.060292       0.360000 
      5.489918       0.084932       0.140000 
      5.521451       0.127941       0.040000 
      5.552053       0.103810       0.010000 
      5.583028       0.083618       0.130000 
      5.613456       0.089017       0.130000 
      5.644423       0.133836       0.230000 
      5.675273       0.197431       0.070000 
      5.705608       0.173207       0.020000 
      5.736656       0.129326       0.170000 
      5.766994       0.076832       0.150000 
      5.797964       -0.042824       0.060000 
      5.827605       -0.134625       0.110000 
      5.858411       -0.112315       0.100000 
      5.889786       -0.041496       0.080000 
      5.920919       -0.015511       0.040000 
      5.952866       0.024356       0.020000 
      5.982752       0.045852       0.180000 
      6.012674       -0.025839       0.240000 
      6.043589       -0.106013       0.070000 
      6.073511       -0.136995       0.230000 
      6.104429       -0.122171       0.260000 
      6.136342       -0.098443       0.070000 
      6.166262       -0.074247       0.010000 
      6.198178       -0.052734       0.050000 
      6.230092       -0.044677       0.150000 
      6.260013       -0.029370       0.180000 
      6.289932       -0.037966       0.050000 
      6.320850       -0.075961       0.150000 
      6.351294       -0.049093       0.240000 
      6.381304       0.046779       0.020000 
      6.412575       0.059792       0.060000 
      6.443429       0.019982       0.060000 
      6.474422       0.024855       0.160000 
      6.505402       0.037880       0.040000 
      6.536152       0.089445       0.060000 
      6.566767       0.164234       0.120000 
      6.597720       0.125253       0.110000 
      6.629633       0.013741       0.250000 
      6.659520       0.009228       0.150000 
      6.691468       0.106898       0.090000 
      6.721385       0.153506       0.060000 
      6.753271       0.124357       0.050000 
      6.785216       0.076862       0.190000 
      6.815105       0.026640       0.320000 
      6.847019       -0.017201       0.020000 
      6.877519       -0.042394       0.060000 
      6.908471       -0.035583       0.030000 
      6.939355       0.010513       0.180000 
      6.969300       0.087200       0.050000 
      7.001190       0.120301       2.690000 
      7.032106       0.135208       1.570000 
      7.063055       0.161121       1.380000 
      7.094939       0.147735       1.050000 
      7.125888       0.126240       0.850000 
      7.155776       0.171477       0.590000 
      7.186694       0.200612       0.460000 
      7.216611       0.155780       0.210000 
      7.248526       0.123153       1.600000 
      7.278474       0.146324       0.230000 
      7.310360       0.167959       0.120000 
      7.342304       0.158424       1.330000 
      7.372229       0.167489       0.520000 
      7.404138       0.140025       0.740000 
      7.436027       0.087728       2.190000 
      7.465972       0.062562       4.960000 
      7.497888       0.078689       9.080000 
      7.528776       0.111939       14.240000 
      7.559696       0.169675       25.850000 
      7.590638       0.215039       42.340000 
      7.621556       0.230213       62.040000 
      7.653470       0.332040       82.380000 
      7.684361       0.431399       103.180000 
      7.715305       0.392971       116.760000 
      7.747220       0.243268       134.790000 
      7.777140       0.145647       148.430000 
      7.809029       0.191328       148.520000 
      7.838975       0.302081       151.290000 
      7.870862       0.420368       158.760000 
      7.900783       0.522612       165.440000 
      7.932729       0.609572       176.180000 
      7.962616       0.716313       181.690000 
      7.992538       0.784405       179.260000 
      8.022484       0.800186       178.350000 
      8.053402       0.801502       181.620000 
      8.084318       0.801557       184.150000 
      8.114245       0.802121       191.210000 
      8.146153       0.811509       201.540000 
      8.178042       0.884285       205.360000 
      8.207989       1.141523       218.560000 
      8.237914       1.519812       224.550000 
      8.268799       1.724200       221.520000 
      8.299747       1.757981       211.130000 
      8.329663       1.783066       185.250000 
      8.361549       1.825740       81.110000 
      8.391523       1.865326       8.260000 
      8.423384       1.870188       9.050000 
      8.455334       1.889697       1.030000 
      8.485246       2.107914       2.700000 
      8.517133       2.501472       1.650000 
      8.549082       2.743133       5.010000 
      8.579575       2.801543       4.170000 
      8.610935       2.859964       2.070000 
      8.642122       3.101933       4.370000 
      8.673039       3.496307       2.430000 
      8.703960       3.679484       4.320000 
      8.733875       3.425409       3.790000 
      8.764787       2.647745       3.910000 
      8.794713       1.446846       2.010000 
      8.825625       0.505068       6.640000 
      8.857538       0.273186       2.090000 
      8.888430       -0.126759       4.250000 
      8.919379       -0.626639       3.760000 
      8.951289       -0.814202       4.250000 
      8.982208       -1.000114       3.880000 
      9.013097       -1.155127       2.920000 
      9.045043       -1.194910       3.950000 
      9.074957       -1.198350       2.650000 
      9.106847       -1.198456       3.080000 
      9.136793       -1.198457       3.270000 
      9.168708       -1.198457       2.800000 
      9.199624       -1.198457       2.760000 
      9.229547       -1.198457       2.800000 
      9.260461       -1.198457       3.610000 
      9.292382       -1.198457       3.470000 
      9.322302       -1.198457       3.950000 
      9.352223       -1.198457       3.660000 
      9.384103       -1.198457       4.640000 
      9.414625       -1.198457       4.510000 
      9.446549       -1.198457       4.800000 
      9.477466       -1.198457       4.690000 
      9.507386       -1.198457       4.670000 
      9.537950       -1.198457       4.590000 
      9.569354       -1.198457       4.320000 
      9.601196       -1.198457       3.680000 
      9.633166       -1.198457       3.570000 
      9.664045       -1.198457       3.620000 
      9.695010       -1.198457       3.250000 
      9.726005       -1.198457       2.900000 
      9.756504       -1.198457       2.960000 
      9.787719       -1.198457       2.840000 
      9.818966       -1.198457       2.620000 
      9.850341       -1.198457       2.720000 
      9.881384       -1.198457       2.750000 
      9.912054       -1.198457       2.840000 
      9.942851       -1.198457       3.090000 
      9.973552       -1.198457       2.930000 
      10.004488       -1.198457       3.130000 
      10.035760       -1.198457       3.540000 
      10.066538       -1.198457       3.460000 
      10.097197       -1.198457       3.560000 
      10.128299       -1.198457       3.550000 
      10.159856       -1.198457       3.590000 
      10.190775       -1.198457       3.710000 
      10.221031       -1.198457       3.710000 
      10.251836       -1.198457       3.720000 
      10.282744       -1.198457       3.810000 
      10.313448       -1.198457       3.550000 
      10.344222       -1.198457       3.430000 
      10.374956       -1.198457       3.090000 
      10.405432       -1.198457       3.150000 
      10.436559       -1.198457       3.330000 
      10.467125       -1.198457       3.370000 
      10.497653       -1.198457       3.270000 
      10.528259       -1.198457       3.330000 
      10.559986       -1.198457       3.390000 
      10.590661       -1.198457       3.410000 
      10.621691       -1.198457       3.450000 
      10.652707       -1.198457       3.540000 
      10.684063       -1.198457       3.920000 
      10.714549       -1.198457       3.970000 
      10.745684       -1.198457       3.880000 
      10.776186       -1.198457       4.050000 
      10.807009       -1.198457       3.980000 
      10.837369       -1.198457       4.170000 
      10.868378       -1.198457       4.180000 
      10.899158       -1.198457       3.760000 
      10.930321       -1.198457       3.860000 
      10.961715       -1.198457       4.020000 
      10.992368       -1.198457       4.020000 
      11.023504       -1.198457       3.970000 
      11.055743       -1.198457       3.780000 
      11.087556       -1.198457       3.580000 
      11.118456       -1.198457       3.700000 
      11.164747       -1.198457       3.610000 
      11.196663       -1.198457       3.780000 
      11.226861       -1.198457       3.940000 
      11.258032       -1.198457       3.770000 
      11.289047       -1.198457       3.880000 
      11.319674       -1.198457       3.820000 
      11.350732       -1.198457       3.840000 
      11.381615       -1.198457       4.010000 
      11.413050       -1.198457       4.210000 
      11.443863       -1.198457       4.190000 
      11.489957       -1.198457       4.300000 
      11.520635       -1.198457       4.280000 
      11.551438       -1.198457       4.340000 
      11.583178       -1.198457       4.250000 
      11.615083       -1.198457       4.060000 
      11.645002       -1.198457       3.940000 
      11.676891       -1.198457       4.140000 
      11.708838       -1.198457       4.100000 
      11.738758       -1.198457       4.120000 
      11.770673       -1.198457       3.920000 
      11.802554       -1.198457       3.990000 
      11.832476       -1.198457       3.930000 
      11.863910       -1.198457       3.890000 
      11.895803       -1.198457       4.090000 
      11.925696       -1.198457       4.030000 
      11.957611       -1.198457       4.030000 
      11.989524       -1.198457       3.940000 
      12.019444       -1.198457       3.840000 
      12.051361       -1.198457       4.060000 
      12.083275       -1.198457       4.150000 
      12.113226       -1.198457       4.110000 
      12.145108       -1.198457       4.290000 
      12.177022       -1.198457       4.080000 
      12.206944       -1.198457       4.060000 
      12.238857       -1.198457       4.290000 
      12.270805       -1.198457       4.100000 
      12.300724       -1.198457       4.090000 
      12.332634       -1.198457       4.040000 
      12.364522       -1.198457       3.830000 
      12.394475       -1.198457       4.130000 
      12.426356       -1.198457       3.800000 
      12.458298       -1.198457       3.780000 
      12.488192       -1.198457       3.960000 
      12.520107       -1.198457       3.860000 
      12.551059       -1.198457       3.970000 
      12.581967       -1.198457       4.010000 
      12.612894       -1.198457       4.110000 
      12.643802       -1.198457       4.150000 
      12.675723       -1.198457       3.990000 
      12.706634       -1.198457       3.710000 
      12.737526       -1.198457       4.280000 
      12.769467       -1.198457       4.280000 
      12.800389       -1.198457       4.040000 
      12.831275       -1.198457       4.180000 
      12.863221       -1.198457       4.390000 
      12.894142       -1.198457       4.120000 
      12.925056       -1.198457       4.050000 
      12.956964       -1.198457       4.010000 
      12.987891       -1.198457       3.930000 
      13.018771       -1.198457       4.020000 
      13.048692       -1.198457       3.920000 
      13.080608       -1.198457       3.960000 
      13.112523       -1.198457       3.950000 
      13.142468       -1.198457       4.070000 
      13.173393       -1.198457       3.950000 
      13.204276       -1.198457       4.000000 
      13.236224       -1.198457       3.960000 
      13.267136       -1.198457       4.060000 
      13.313983       -1.198457       4.060000 
      13.345897       -1.198457       4.010000 
      13.375848       -1.198457       3.760000 
      13.407763       -1.198457       4.000000 
      13.439677       -1.198444       3.820000 
      13.469594       -1.198014       4.140000 
      13.501510       -1.193058       4.030000 
      13.533399       -1.174247       4.050000 
      13.563316       -1.158120       4.240000 
      13.594178       -1.168848       3.980000 
      13.626093       -1.168418       4.230000 
      13.656013       -1.152721       3.890000 
      13.687955       -1.150050       4.040000 
      13.719882       -1.153164       3.930000 
      13.749795       -1.173817       4.070000 
      13.781678       -1.193045       3.950000 
      13.813591       -1.198001       4.020000 
      13.843513       -1.198001       3.920000 
      13.875466       -1.193058       4.170000 
      13.907342       -1.174260       3.880000 
      13.937292       -1.158563       4.110000 
      13.969177       -1.174247       4.390000 
      14.001092       -1.192615       3.930000 
      14.031038       -1.192615       3.900000 
      14.062925       -1.174247       3.950000 
      14.094841       -1.158563       3.900000 
      14.124760       -1.174260       4.150000 
      14.156702       -1.193058       4.040000 
      14.188622       -1.198014       3.910000 
      14.218509       -1.198444       3.960000 
      14.250449       -1.198457       4.070000 
      14.282365       -1.198457       3.910000 
      14.312258       -1.198457       4.010000 
      14.344206       -1.198457       4.040000 
      14.376121       -1.198457       4.210000 
      14.406041       -1.198457       4.060000 
      14.437922       -1.198457       4.010000 
      14.469838       -1.198444       3.930000 
      14.499778       -1.198014       4.100000 
      14.530772       -1.193045       4.060000 
      14.561608       -1.173817       4.160000 
      14.592553       -1.153164       4.050000 
      14.623352       -1.150050       3.940000 
      14.653884       -1.152721       3.990000 
      14.684946       -1.168418       4.080000 
      14.715175       -1.168848       4.170000 
      14.745878       -1.158120       3.970000 
      14.776877       -1.174233       4.210000 
      14.808185       -1.192615       3.990000 
      14.839390       -1.192615       4.250000 
      14.871342       -1.174247       4.040000 
      14.902227       -1.158563       3.870000 
      14.933143       -1.174260       3.870000 
      14.965085       -1.193058       3.960000 
      14.996008       -1.198014       4.120000 
      15.026891       -1.198444       3.950000 
      15.058841       -1.198457       4.140000 
      15.089725       -1.198431       4.130000 
      15.120674       -1.197571       4.060000 
      15.152584       -1.187659       3.980000 
      15.183506       -1.150063       4.010000 
      15.214390       -1.118669       4.250000 
      15.246333       -1.150063       4.060000 
      15.277035       -1.187659       3.950000 
      15.307706       -1.197571       4.050000 
      15.338654       -1.198431       4.060000 
      15.369078       -1.198457       3.920000 
      15.399848       -1.198457       3.830000 
      15.430831       -1.198457       4.090000 
      15.462574       -1.198444       3.890000 
      15.493298       -1.198014       4.040000 
      15.523952       -1.193058       4.100000 
      15.554796       -1.174260       4.090000 
      15.586991       -1.158563       4.180000 
      15.617129       -1.174260       3.760000 
      15.648374       -1.193058       3.960000 
      15.678154       -1.198014       4.020000 
      15.708708       -1.198444       3.980000 
      15.740223       -1.198457       3.850000 
      15.771283       -1.198431       4.200000 
      15.802189       -1.197571       4.090000 
      15.832961       -1.187646       4.010000 
      15.879648       -1.149620       4.220000 
      15.910361       -1.113256       3.970000 
      15.942280       -1.125423       3.970000 
      15.972200       -1.142366       4.000000 
      16.003118       -1.149177       4.010000 
      16.034035       -1.153137       4.070000 
      16.064952       -1.173803       3.900000 
      16.095868       -1.192588       4.070000 
      16.127786       -1.192158       4.060000 
      16.157704       -1.168404       3.890000 
      16.187656       -1.128940       3.990000 
      16.218569       -1.109282       4.040000 
      16.249459       -1.118155       3.930000 
      16.281371       -1.119567       3.970000 
      16.311293       -1.106971       3.860000 
      16.343064       -1.119997       4.230000 
      16.373026       -1.123111       4.060000 
      16.403635       -1.128054       3.750000 
      16.434933       -1.143750       3.930000 
      16.466385       -1.141882       3.910000 
      16.497288       -1.124080       4.030000 
      16.527561       -1.097059       4.020000 
      16.558888       -1.077028       3.850000 
      16.590305       -1.067950       4.010000 
      16.621248       -1.124523       3.940000 
      16.652173       -1.176378       4.060000 
      16.684092       -1.167088       3.910000 
      16.715005       -1.128927       4.190000 
      16.744919       -1.110168       4.340000 
      16.775836       -1.128953       4.070000 
      16.805763       -1.167961       4.150000 
      16.837644       -1.186759       4.050000 
      16.868244       -1.168404       4.020000 
      16.900192       -1.134339       3.920000 
      16.930117       -1.133896       3.840000 
      16.962028       -1.162562       3.940000 
      16.992912       -1.157150       4.150000 
      17.022858       -1.103413       3.960000 
      17.052752       -1.058980       4.060000 
      17.083702       -1.049647       3.990000 
      17.113619       -1.042836       4.130000 
      17.144532       -1.031279       3.820000 
      17.175456       -1.043296       3.860000 
      17.205376       -1.119110       3.860000 
      17.237258       -1.175921       4.070000 
      17.268203       -1.166618       4.150000 
      17.299132       -1.123071       3.980000 
      17.331006       -1.080102       3.910000 
      17.361924       -1.058577       4.070000 
      17.392842       -1.068875       3.830000 
      17.424756       -1.068861       3.950000 
      17.454675       -1.058107       3.910000 
      17.486624       -1.073804       3.940000 
      17.516544       -1.087659       4.130000 
      17.548427       -1.073817       4.050000 
      17.580342       -1.058536       3.870000 
      17.612288       -1.073817       3.860000 
      17.643199       -1.087646       3.750000 
      17.673126       -1.073360       4.050000 
      17.704041       -1.052707       3.690000 
      17.734960       -1.044651       3.980000 
      17.765871       -1.028524       4.040000 
      17.797758       -1.028510       3.790000 
      17.828703       -1.044194       3.910000 
      17.859631       -1.046838       3.800000 
      17.891536       -1.042837       3.920000 
      17.922452       -1.011373       3.650000 
      17.953377       -0.943321       3.610000 
      17.985291       -0.853580       4.010000 
      18.016202       -0.785072       4.020000 
      18.047126       -0.747792       4.050000 
      18.079035       -0.715081       3.980000 
      18.109957       -0.664419       4.020000 
      18.140868       -0.663989       4.040000 
      18.170794       -0.709615       4.090000 
      18.202709       -0.721298       3.780000 
      18.234590       -0.715442       3.950000 
      18.264513       -0.673290       3.890000 
      18.296427       -0.559033       4.120000 
      18.328367       -0.481503       4.050000 
      18.358288       -0.504796       3.910000 
      18.388214       -0.552638       3.920000 
      18.420128       -0.547418       3.970000 
      18.450041       -0.521699       3.780000 
      18.481930       -0.504384       3.940000 
      18.513871       -0.505656       3.960000 
      18.543795       -0.605682       3.880000 
      18.575711       -0.653080       3.740000 
      18.605858       -0.651891       3.760000 
      18.636803       -0.719957       3.990000 
      18.666722       -0.776846       3.840000 
      18.697639       -0.777846       3.890000 
      18.728564       -0.776407       3.770000 
      18.758452       -0.778219       3.730000 
      18.788404       -0.716396       3.780000 
      18.820284       -0.629437       3.720000 
      18.851201       -0.568503       3.550000 
      18.882150       -0.578788       3.770000 
      18.914069       -0.683672       3.730000 
      18.944952       -0.740482       3.500000 
      18.975870       -0.702083       3.510000 
      19.007784       -0.659355       3.760000 
      19.037705       -0.654118       3.440000 
      19.069625       -0.654838       3.590000 
      19.099537       -0.604352       3.410000 
      19.131452       -0.487661       3.560000 
      19.163369       -0.429604       3.420000 
      19.193289       -0.463867       3.130000 
      19.225203       -0.563128       3.150000 
      19.257119       -0.613974       3.440000 
      19.287036       -0.569816       3.240000 
      19.318953       -0.503388       3.450000 
      19.350900       -0.531721       3.410000 
      19.380786       -0.588076       3.760000 
      19.410753       -0.620452       3.840000 
      19.441708       -0.627500       4.110000 
      19.472661       -0.573790       3.850000 
      19.502579       -0.517782       3.860000 
      19.534461       -0.515497       3.990000 
      19.564668       -0.498914       4.330000 
      19.595353       -0.487273       4.260000 
      19.626846       -0.508742       4.270000 
      19.657657       -0.487646       4.240000 
      19.688613       -0.438449       4.260000 
      19.720193       -0.424414       4.370000 
      19.750213       -0.425007       4.290000 
      19.781502       -0.426695       4.220000 
      19.813289       -0.447379       3.950000 
      19.844451       -0.466633       3.860000 
      19.875396       -0.538392       3.890000 
      19.907216       -0.580005       3.620000 
      19.937504       -0.576491       3.730000 
      19.969532       -0.642367       3.760000 
      20.000006       -0.675407       3.480000 
      20.031408       -0.572044       3.490000 
      20.062410       -0.449152       3.510000 
      20.094061       -0.408881       3.670000 
      20.124972       -0.414183       3.760000 
      20.156238       -0.478344       3.740000 
      20.187113       -0.546338       3.580000 
      20.217922       -0.537881       3.570000 
      20.248127       -0.492645       3.810000 
      20.278840       -0.493488       3.610000 
      20.325387       -0.484586       3.600000 
      20.356075       -0.437534       3.960000 
      20.387311       -0.438410       3.870000 
      20.418713       -0.493558       3.690000 
      20.450325       -0.604684       3.510000 
      20.481151       -0.653011       3.600000 
      20.512523       -0.564350       3.480000 
      20.544147       -0.503413       3.380000 
      20.575331       -0.451752       3.320000 
      20.605071       -0.358257       3.500000 
      20.636086       -0.359423       3.340000 
      20.666762       -0.400269       3.280000 
      20.697311       -0.374190       3.490000 
      20.727859       -0.351435       3.630000 
      20.759158       -0.327084       3.280000 
      20.789824       -0.324536       3.490000 
      20.821216       -0.317686       3.370000 
      20.851791       -0.298041       3.560000 
      20.882416       -0.274717       3.630000 
      20.913213       -0.259449       3.710000 
      20.944134       -0.284602       3.420000 
      20.975240       -0.335624       3.640000 
      21.006463       -0.348690       3.710000 
