

 time    ||    gripping force   ||   raspberry measurement 

      0       0.210000       -795.119149 
      0       0.120000       -795.119149 
      0       0.280000       -795.119149 
      0       0.030000       -795.119149 
      0       0.660000       -795.119149 
      0       0.010000       -795.119149 
      0       0.500000       -795.119149 
      0       0.190000       -795.119149 
      0       0.310000       -795.119149 
      0       0.030000       -795.119144 
      0       0.060000       -795.117963 
      0       0.030000       -795.011662 
      0       0.100000       -791.491458 
      0       0.140000       -748.606863 
      1       0.020000       -556.414486 
      1       0.050000       -239.553847 
      1       0.050000       -47.376737 
      1       0.020000       -4.490314 
      1       0.070000       -0.954027 
      1       0.310000       -0.840502 
      1       0.290000       -0.893609 
      1       0.210000       -0.936986 
      1       0.230000       -0.888635 
      1       0.220000       -0.819632 
      2       0.100000       -0.820071 
      2       0.330000       -0.830799 
      2       3.590000       -0.813789 
      2       14.170000       -0.847841 
      2       55.320000       -0.883192 
      2       53.410000       -0.819131 
      2       58.600000       -0.754667 
      2       72.070000       -0.785466 
      2       71.950000       -0.804842 
      2       70.730000       -0.781895 
      2       70.490000       -0.796803 
      3       70.140000       -0.812763 
      3       69.770000       -0.825539 
      3       69.560000       -0.841849 
      3       69.360000       -0.859039 
      3       69.260000       -0.822011 
      3       68.670000       -0.705134 
      3       68.660000       -0.439092 
      3       68.470000       -0.080205 
      3       68.330000       0.258830 
      4       68.280000       0.515657 
      4       68.140000       0.707156 
      4       67.860000       0.808070 
      4       67.830000       0.828308 
      4       67.800000       0.831520 
      4       67.310000       0.830136 
      4       66.590000       0.831575 
      4       66.170000       0.830136 
      5       65.520000       0.831575 
      5       65.500000       0.830136 
      5       65.470000       0.831575 
      5       65.450000       0.830136 
      5       64.040000       0.831575 
      5       62.030000       0.830136 
      5       62.080000       0.831574 
      5       62.060000       0.830123 
      5       62.010000       0.831118 
      5       61.960000       0.824307 
      5       62.030000       0.802408 
      5       62.030000       0.771014 
      6       61.950000       0.786711 
      6       61.920000       0.821166 
      6       61.870000       0.827947 
      6       61.890000       0.815781 
      6       61.810000       0.762513 
      6       61.640000       0.731079 
      6       61.330000       0.776868 
      6       61.120000       0.802254 
      6       60.500000       0.752228 
      6       60.340000       0.680360 
      6       60.280000       0.688579 
      6       60.170000       0.713939 
      7       60.110000       0.700676 
      7       60.100000       0.661076 
      7       60.080000       0.649115 
      7       60.010000       0.689825 
      7       59.410000       0.761086 
      7       56.210000       0.774033 
      7       56.410000       0.756630 
      7       56.450000       0.721135 
      7       56.400000       0.593440 
      7       56.400000       0.511949 
      7       56.390000       0.587084 
      7       56.350000       0.619820 
      7       56.450000       0.547259 
      8       56.430000       0.509110 
      8       56.440000       0.488054 
      8       56.420000       0.499764 
      8       56.440000       0.561490 
      8       56.440000       0.568230 
      8       56.350000       0.527463 
      8       56.410000       0.461960 
      8       56.380000       0.346816 
      8       56.370000       0.281813 
      8       56.400000       0.291650 
      8       56.350000       0.265571 
      8       56.420000       0.207851 
      8       56.380000       0.219395 
      9       56.410000       0.271426 
      9       56.340000       0.224375 
      9       56.350000       0.164371 
      9       56.370000       0.210524 
      9       56.370000       0.353514 
      9       56.410000       0.489310 
      9       56.330000       0.499129 
      9       56.300000       0.484928 
      9       56.360000       0.534564 
      9       56.250000       0.525662 
      9       56.340000       0.429777 
      9       55.870000       0.398369 
      10       55.330000       0.421636 
      10       55.320000       0.422548 
      10       55.260000       0.390670 
      10       55.350000       0.310882 
      10       55.240000       0.245971 
      10       55.260000       0.223450 
      10       55.250000       0.198047 
      10       55.210000       0.226607 
      10       55.170000       0.328863 
      10       55.220000       0.419766 
      10       55.290000       0.469572 
      10       55.100000       0.399626 
      10       54.660000       0.311851 
      10       54.310000       0.310912 
      11       50.840000       0.335727 
      11       50.970000       0.320833 
      11       51.220000       0.228864 
      11       51.280000       0.168483 
      11       51.340000       0.187627 
      11       51.260000       0.206553 
      11       51.400000       0.210765 
      11       51.360000       0.202313 
      11       51.340000       0.177334 
      11       51.350000       0.129322 
      11       51.390000       0.082394 
      11       51.330000       0.045105 
      11       51.370000       0.058466 
      12       51.320000       0.076874 
      12       51.360000       0.023371 
      12       51.410000       -0.038994 
      12       51.390000       0.000453 
      12       51.400000       0.105131 
      12       51.470000       0.143535 
      12       51.420000       0.084037 
      12       51.460000       0.039660 
      12       51.460000       0.040670 
      12       51.430000       0.017516 
      12       51.380000       -0.014013 
      13       51.430000       -0.022002 
      13       51.370000       -0.007049 
      13       51.400000       -0.006553 
      13       51.420000       0.048960 
      13       51.420000       0.103493 
      13       51.430000       0.097578 
      13       51.390000       0.088656 
      13       51.350000       0.054892 
      13       51.360000       0.055741 
      13       51.360000       0.084361 
      14       51.390000       0.084446 
      14       51.390000       0.046712 
      14       51.410000       -0.056674 
      14       51.400000       -0.158988 
      14       51.420000       -0.192985 
      14       51.330000       -0.174530 
      14       51.370000       -0.077073 
      14       51.330000       0.020051 
      14       51.400000       0.024210 
      14       51.320000       0.025449 
      15       51.420000       0.017492 
      15       51.330000       0.004200 
      15       51.290000       -0.001786 
      15       51.400000       -0.001182 
      15       51.190000       -0.007514 
      15       51.290000       -0.024651 
      15       51.410000       -0.042207 
      16       51.330000       -0.034234 
      16       51.340000       -0.049870 
      16       51.300000       -0.065311 
      16       51.270000       -0.055831 
      16       51.280000       -0.058356 
      16       51.280000       -0.019154 
      16       51.380000       0.021314 
      16       51.320000       -0.024947 
      16       51.290000       -0.086871 
      16       51.290000       -0.117907 
      16       51.230000       -0.134942 
      17       51.320000       -0.115764 
      17       51.260000       -0.085893 
      17       51.330000       -0.021420 
      17       51.320000       0.088648 
      17       51.340000       0.143796 
      17       51.300000       0.075769 
      17       51.300000       -0.005702 
      17       51.250000       -0.037563 
      17       51.300000       0.028013 
      17       51.340000       0.090679 
      17       51.290000       0.044575 
      18       51.260000       0.034347 
      18       51.260000       0.039731 
      18       51.320000       0.014115 
      18       51.270000       0.014360 
      18       51.230000       -0.022196 
      18       51.260000       -0.052508 
      18       51.250000       -0.035209 
      18       51.270000       -0.050810 
      18       51.210000       -0.074678 
      18       51.300000       -0.044675 
      18       51.230000       -0.014984 
      18       51.270000       -0.039584 
      18       51.250000       -0.058345 
      18       51.250000       -0.039946 
      19       51.320000       -0.010330 
      19       51.250000       0.040862 
      19       51.220000       0.034123 
      19       51.250000       -0.033520 
      19       51.210000       -0.081655 
      19       51.160000       -0.090065 
      19       51.200000       -0.091040 
      19       51.260000       -0.083813 
      19       51.240000       -0.065363 
      19       51.220000       -0.042839 
      19       51.240000       -0.040725 
      19       51.270000       -0.040687 
      20       51.240000       -0.047405 
      20       51.250000       -0.007862 
      20       51.240000       0.042307 
      20       51.170000       0.033495 
      20       51.200000       0.007412 
      20       51.180000       -0.031719 
      20       51.240000       -0.048219 
      20       51.210000       -0.026508 
      20       51.150000       -0.042595 
      20       51.180000       -0.075043 
      20       51.170000       -0.066711 
      21       51.210000       -0.003063 
      21       51.200000       0.078177 
      21       51.200000       0.052485 
      21       51.210000       -0.002034 
      21       51.200000       0.028491 
      21       51.210000       0.038028 
      21       51.260000       -0.017371 
      21       51.150000       -0.014536 
      21       51.220000       0.051235 
      21       51.140000       0.084036 
      21       51.120000       0.031699 
      21       51.120000       -0.031535 
      21       51.120000       -0.001138 
      22       51.200000       0.075697 
      22       51.180000       0.114765 
      22       51.180000       0.088854 
      22       51.180000       -0.007524 
      22       51.160000       -0.072518 
      22       51.200000       -0.088388 
      22       51.150000       -0.082464 
      22       51.090000       -0.064054 
      22       51.130000       -0.041104 
      22       51.130000       -0.033702 
      23       51.160000       -0.011056 
      23       51.140000       0.006666 
      23       51.100000       0.012517 
      23       51.140000       0.006487 
      23       51.140000       -0.010750 
      23       51.140000       -0.027607 
      23       51.120000       -0.010393 
      23       51.130000       0.006059 
      23       51.130000       0.002928 
      23       51.100000       -0.030852 
      23       51.140000       -0.046895 
      23       51.070000       -0.024320 
      24       51.140000       -0.030217 
      24       51.100000       -0.021540 
      24       51.070000       0.025296 
      24       51.070000       0.025877 
      24       50.890000       -0.009353 
      24       50.690000       -0.044833 
      24       50.750000       -0.030108 
      24       50.730000       -0.005509 
      24       50.720000       -0.035549 
      24       50.690000       -0.073825 
      24       50.680000       -0.080624 
      25       50.680000       -0.072280 
      25       50.700000       -0.032940 
      25       50.710000       -0.002954 
      25       50.740000       -0.032581 
      25       50.690000       -0.070873 
      25       50.700000       -0.077702 
      25       50.690000       -0.069387 
      25       50.680000       -0.030075 
      25       50.680000       -0.000119 
      25       50.660000       -0.029799 
      26       50.640000       -0.068944 
      26       50.680000       -0.084754 
      26       50.620000       -0.103750 
      26       50.680000       -0.057117 
      26       50.670000       0.044685 
      26       50.660000       0.053886 
      26       50.640000       0.009606 
      26       50.600000       -0.016364 
      26       50.650000       0.000777 
      26       50.600000       0.027330 
      26       50.620000       0.066099 
      26       50.630000       0.080979 
      27       50.650000       0.044195 
      27       50.690000       0.003477 
      27       50.310000       -0.018402 
      27       50.160000       0.003626 
      27       49.110000       0.043840 
      27       49.090000       0.078537 
      27       49.090000       0.052838 
      27       49.060000       -0.018622 
      27       49.080000       -0.052586 
      27       49.070000       -0.004632 
      28       49.110000       0.049586 
      28       49.050000       0.042350 
      28       49.090000       0.030060 
      28       49.060000       0.036746 
      28       49.050000       0.029800 
      28       49.040000       -0.017570 
      28       49.010000       -0.025809 
      29       49.050000       -0.020262 
      29       49.080000       -0.051978 
      29       49.080000       -0.072326 
      29       49.070000       -0.068933 
      29       49.030000       -0.034067 
      29       49.070000       -0.012029 
      29       49.090000       -0.010073 
      29       49.080000       0.035224 
      29       49.020000       0.045093 
      29       49.070000       -0.021027 
      30       49.050000       -0.066026 
      30       49.040000       -0.077441 
      30       49.010000       -0.076119 
      30       49.090000       -0.076809 
      30       49.150000       -0.074617 
      30       49.080000       -0.075295 
      30       49.010000       -0.073117 
      31       49.000000       -0.073784 
      31       49.090000       -0.070784 
      31       49.000000       -0.062100 
      31       49.080000       -0.027303 
      31       49.030000       -0.010651 
      31       49.030000       -0.032225 
      31       49.040000       -0.020856 
      31       49.030000       -0.010427 
      31       49.080000       -0.041841 
      31       49.020000       -0.063102 
      31       49.040000       -0.068776 
      32       49.050000       -0.061744 
      32       49.040000       -0.038184 
      32       49.010000       0.007998 
      32       49.070000       0.048208 
      32       49.030000       0.060222 
      32       49.010000       0.005861 
      32       49.040000       -0.042876 
      32       49.050000       -0.022617 
      32       49.080000       -0.003221 
      32       49.010000       -0.015698 
      33       49.010000       -0.021681 
      33       49.080000       -0.043708 
      33       48.990000       -0.059632 
      33       49.000000       -0.051073 
      33       49.060000       0.001773 
      33       49.000000       0.032822 
      33       49.030000       -0.014127 
      33       49.030000       -0.054275 
      33       49.030000       -0.065355 
      33       49.060000       -0.063304 
      34       49.120000       -0.054708 
      34       49.040000       -0.019585 
      34       49.070000       0.001057 
      34       49.030000       -0.011424 
      34       49.040000       -0.017449 
      34       49.030000       -0.039571 
      34       49.000000       -0.057238 
      34       49.050000       -0.068329 
      34       49.040000       -0.089751 
      34       49.090000       -0.119933 
      35       49.000000       -0.102769 
      35       49.010000       -0.062711 
      35       49.030000       -0.036349 
      35       49.020000       -0.027996 
      35       49.000000       -0.081874 
      35       49.040000       -0.129308 
      35       49.010000       -0.102826 
      35       49.030000       -0.058234 
      35       49.000000       -0.025334 
      35       49.030000       0.016277 
      35       49.010000       0.034204 
      35       49.020000       0.027340 
      36       49.030000       0.033619 
      36       48.990000       0.079078 
      36       49.000000       0.071944 
      36       49.050000       0.008816 
      36       49.020000       -0.021093 
      36       48.980000       -0.013305 
      36       49.060000       -0.016268 
      36       49.050000       0.023350 
      36       48.980000       0.072807 
      36       48.970000       0.059183 
      36       49.000000       0.018289 
      36       49.020000       -0.027668 
      37       49.030000       -0.049496 
      37       49.010000       -0.045971 
      37       49.030000       -0.007293 
      37       49.070000       0.022862 
      37       48.990000       -0.001678 
      37       49.020000       -0.016323 
      37       49.050000       0.015797 
      37       48.960000       0.047132 
      37       49.090000       0.090597 
      37       49.030000       0.118935 
      38       49.020000       0.078290 
      38       49.010000       0.001670 
      38       49.090000       -0.036978 
      38       49.040000       0.001597 
      38       49.000000       0.072912 
      38       49.030000       0.097110 
      38       48.990000       0.061003 
      38       49.020000       0.020103 
      39       49.010000       -0.003205 
      39       49.080000       0.004391 
      39       49.070000       -0.005901 
      39       49.000000       0.006189 
      39       49.040000       0.061944 
      39       49.000000       0.044946 
      39       49.030000       -0.023830 
      39       49.060000       -0.055084 
      39       49.040000       -0.062101 
      39       49.000000       -0.059682 
      39       49.000000       -0.051123 
      39       49.030000       -0.016462 
      40       49.030000       -0.000744 
      40       48.950000       -0.031391 
      40       49.030000       -0.047837 
      40       49.020000       -0.035053 
      40       49.030000       -0.012858 
      40       49.030000       -0.006603 
      40       49.070000       0.005933 
      40       49.040000       -0.014572 
      40       48.980000       -0.048976 
      40       49.100000       -0.055624 
      40       49.030000       -0.047492 
      40       49.040000       -0.007561 
      40       49.060000       0.031585 
      41       49.060000       0.034777 
      41       49.010000       0.018068 
      41       49.060000       0.000098 
      41       49.010000       0.007223 
      41       49.030000       -0.013735 
      41       49.030000       -0.048186 
      41       49.030000       -0.055693 
      41       49.030000       -0.057359 
      41       49.050000       -0.054124 
      41       49.070000       -0.040701 
      41       49.060000       0.012466 
      42       49.050000       0.043422 
      42       49.010000       -0.003633 
      42       48.980000       -0.043886 
      42       49.110000       -0.055070 
      42       49.000000       -0.053121 
      42       48.980000       -0.044627 
      42       49.100000       -0.009605 
      42       49.000000       0.010950 
      42       49.170000       -0.001204 
      43       49.090000       -0.002425 
      43       49.240000       -0.006034 
      43       49.260000       -0.006768 
      43       49.320000       -0.013427 
      43       49.290000       0.030271 
      43       49.280000       0.094200 
      43       49.330000       0.087092 
      43       49.280000       0.051632 
      44       49.310000       0.028447 
      44       49.300000       -0.029930 
      44       49.340000       -0.074879 
      44       49.380000       -0.029772 
      44       49.300000       0.018380 
      44       49.400000       -0.001235 
      44       49.200000       -0.015487 
      44       49.330000       0.015761 
      44       49.230000       0.036433 
      44       49.360000       0.032973 
      44       49.320000       -0.006401 
      44       49.310000       -0.045380 
      44       49.390000       -0.048022 
      45       49.340000       -0.026714 
      45       49.450000       0.004608 
      45       49.370000       -0.010952 
      45       49.440000       -0.044129 
      45       49.370000       -0.041412 
      45       49.440000       -0.000695 
      45       49.290000       0.055719 
      45       49.510000       0.061302 
      45       49.320000       0.039048 
      45       49.440000       -0.004029 
      45       49.310000       -0.029177 
      46       49.450000       0.018543 
      46       49.410000       0.063554 
      46       49.480000       0.027549 
      46       49.340000       0.008555 
      46       49.410000       0.042263 
      46       49.390000       0.079047 
      46       49.420000       0.150191 
      46       49.350000       0.160583 
      46       49.410000       0.087633 
      46       49.390000       0.011292 
      46       49.410000       0.007653 
      46       49.380000       0.062091 
      46       49.390000       0.045052 
      46       49.430000       -0.023725 
      47       49.390000       -0.054968 
      47       49.370000       -0.061587 
      47       49.430000       -0.055131 
      47       49.470000       -0.038259 
      47       49.410000       -0.030724 
      47       49.370000       -0.084575 
      47       49.370000       -0.131145 
      47       49.390000       -0.095270 
      47       49.410000       -0.018866 
      48       49.470000       0.021204 
      48       49.460000       -0.002907 
      48       49.330000       -0.022859 
      48       49.430000       -0.014628 
      48       49.420000       -0.022458 
      48       49.390000       -0.001375 
      48       49.410000       0.033189 
      48       49.390000       0.039569 
      48       49.360000       0.026691 
      48       49.400000       -0.031656 
      48       49.420000       -0.086374 
      49       49.470000       -0.078372 
      49       49.500000       -0.060815 
      49       49.540000       -0.048597 
      49       49.560000       -0.026431 
      49       49.500000       0.000060 
      49       49.530000       -0.032814 
      49       49.610000       -0.067458 
      49       49.590000       -0.003389 
      50       49.790000       0.059613 
      50       49.720000       0.018714 
      50       49.750000       -0.037876 
      50       49.660000       -0.045860 
      50       49.720000       -0.029066 
      50       49.700000       -0.006944 
      50       49.760000       -0.005229 
      50       49.760000       -0.006810 
      50       49.770000       -0.028173 
      50       49.760000       -0.040184 
      50       49.760000       -0.023022 
      50       49.740000       0.007890 
      51       49.740000       -0.006865 
      51       49.700000       -0.030257 
      51       49.840000       0.009954 
      51       49.770000       0.085758 
      51       49.740000       0.125207 
      51       49.780000       0.104524 
      51       49.780000       0.096762 
      51       49.810000       0.095409 
      51       49.790000       0.032294 
      51       49.720000       0.020104 
      51       49.730000       0.082298 
      52       49.790000       0.129081 
      52       49.800000       0.131672 
      52       49.800000       0.108675 
      52       49.780000       0.065844 
      52       49.860000       0.032842 
      52       49.780000       -0.011475 
      52       49.770000       -0.041456 
      52       49.850000       -0.011411 
      52       49.800000       0.026934 
      52       49.770000       0.030573 
      52       49.800000       0.018839 
      52       49.740000       0.020322 
      52       49.790000       0.052637 
      52       49.880000       0.054182 
      53       49.850000       0.046280 
      53       49.750000       0.058961 
      53       49.840000       0.080268 
      53       49.730000       0.086417 
      53       49.840000       0.106998 
      53       49.780000       0.113288 
      53       49.720000       0.075508 
      53       49.740000       0.013799 
      53       49.750000       -0.012365 
      53       49.810000       -0.021259 
      53       49.790000       -0.022732 
      53       49.840000       -0.034975 
      53       49.830000       -0.018660 
      53       49.660000       0.001973 
      54       49.860000       0.008093 
      54       49.810000       0.022306 
      54       49.840000       0.002869 
      54       49.760000       -0.017853 
      54       49.900000       -0.044439 
      54       49.830000       -0.061180 
      54       49.830000       -0.057086 
      54       49.880000       -0.017446 
      54       49.830000       0.022185 
      54       49.800000       0.029566 
      54       49.750000       0.023010 
      54       49.960000       -0.001119 
      54       49.830000       0.025066 
      55       49.890000       0.101079 
      55       49.810000       0.091666 
      55       49.850000       0.038428 
      55       49.870000       0.007828 
      55       49.940000       -0.001065 
      55       49.830000       0.048584 
      55       49.870000       0.081809 
      55       49.850000       0.049472 
      55       49.870000       0.003768 
      55       49.920000       -0.042469 
      55       49.830000       -0.064162 
      56       49.890000       -0.060463 
      56       49.920000       -0.020763 
      56       49.850000       0.020190 
      56       49.880000       0.042683 
      56       49.880000       0.095016 
      56       49.840000       0.115334 
      56       49.950000       0.029489 
      56       49.840000       -0.052015 
      56       49.880000       -0.070122 
      56       49.910000       -0.072134 
      56       49.830000       -0.065122 
      57       49.880000       -0.046847 
      57       49.830000       -0.024069 
      57       49.830000       -0.016837 
      57       49.910000       0.005614 
      57       49.840000       0.022345 
      57       49.850000       0.019064 
      57       49.880000       -0.014877 
      57       49.830000       -0.031093 
      57       49.850000       -0.009102 
      57       49.820000       -0.020084 
      57       49.930000       -0.030955 
      57       49.910000       -0.008926 
      57       49.840000       -0.023939 
      57       49.930000       -0.043156 
      58       49.820000       0.005142 
      58       49.940000       0.049888 
      58       49.880000       0.009511 
      58       49.900000       -0.023896 
      58       49.820000       0.002118 
      58       49.850000       0.018444 
      58       49.910000       0.006353 
      58       49.850000       -0.011087 
      58       49.850000       -0.003838 
      58       49.860000       -0.024685 
      58       49.850000       -0.059027 
      59       49.900000       -0.066426 
      59       49.830000       -0.068024 
      59       49.860000       -0.065932 
      59       49.870000       -0.066258 
      59       49.850000       -0.058827 
      59       49.890000       -0.035708 
      59       49.900000       0.005542 
      59       49.910000       0.027167 
      59       49.880000       0.023826 
      59       49.920000       -0.015456 
      59       49.860000       -0.054358 
      60       49.880000       -0.057323 
      60       49.830000       -0.040415 
      60       49.860000       -0.023073 
      60       49.960000       -0.039780 
      60       49.860000       -0.055717 
      60       49.870000       -0.051678 
      60       49.820000       -0.012942 
      60       49.980000       0.016856 
      60       49.860000       -0.012131 
      60       49.880000       -0.041253 
      60       49.920000       -0.016503 
      60       49.860000       -0.001609 
      61       49.910000       -0.031423 
