

 time    ||    gripping force   ||   raspberry measurement 

      0       0.030000       -802.100000 
      0       0.120000       -802.100000 
      0       0.060000       -802.100000 
      0       0.060000       -802.100000 
      0       0.140000       -802.100000 
      0       0.010000       -802.100000 
      0       0.140000       -802.100000 
      0       0.600000       -802.100000 
      0       0.160000       -802.100000 
      0       0.560000       -802.100000 
      0       0.180000       -802.100000 
      0       0.540000       -802.100000 
      0       0.220000       -802.100000 
      0       0.030000       -802.100000 
      0       0.070000       -802.100000 
      0       0.030000       -802.100000 
      0       0.130000       -802.100000 
      1       0.060000       -794.079000 
      1       0.130000       -786.138210 
      1       0.000000       -778.276828 
      1       0.220000       -778.276828 
      1       0.220000       -778.276828 
      1       0.430000       -778.276828 
      1       0.100000       -778.276828 
      1       0.550000       -778.276828 
      1       0.320000       -778.276828 
      1       0.980000       -778.276828 
      1       4.640000       -770.494060 
      1       18.940000       -762.789119 
      1       43.860000       -755.161223 
      1       58.210000       -747.608430 
      1       83.140000       -740.026088 
      1       110.460000       -736.471758 
      1       117.690000       -693.171433 
      1       117.460000       -499.115881 
      2       115.970000       -499.115881 
      2       115.530000       -179.183400 
      2       114.530000       14.856454 
      2       113.810000       58.153679 
      2       113.290000       58.153679 
      2       112.850000       61.706153 
      2       112.410000       61.706153 
      2       111.010000       61.814911 
      2       106.550000       61.814786 
      2       96.830000       61.820232 
      2       84.610000       61.867936 
      2       62.200000       62.096106 
      2       45.350000       62.521575 
      2       36.110000       62.980517 
      2       32.620000       62.980517 
      2       32.230000       62.980517 
      3       32.800000       62.980517 
      3       33.450000       62.980517 
      3       36.150000       62.980517 
      3       41.400000       63.405157 
      3       48.220000       63.687910 
      3       55.710000       63.795758 
      3       58.070000       63.813216 
      3       57.970000       63.816025 
      3       56.440000       63.813297 
      3       53.900000       63.798472 
      3       46.910000       63.722212 
      3       43.270000       63.576488 
      3       38.780000       63.374664 
      3       37.130000       63.117354 
      3       36.960000       63.117354 
      4       37.000000       63.117354 
      4       37.100000       63.117354 
      4       37.080000       63.117354 
      4       37.210000       62.847862 
      4       37.460000       62.523345 
      4       37.680000       62.166564 
      4       38.170000       61.998034 
      4       38.830000       61.998034 
      4       39.390000       62.110917 
      4       39.920000       62.110917 
      4       40.360000       62.383740 
      4       40.590000       62.571519 
      4       41.070000       62.607346 
      4       41.410000       62.588991 
      4       41.700000       62.471989 
      5       41.860000       62.294554 
      5       41.860000       62.123736 
      5       41.810000       61.986996 
      5       41.500000       61.928759 
      5       41.470000       61.916052 
      5       40.880000       61.921547 
      5       40.630000       61.939322 
      5       40.160000       61.961830 
      5       39.920000       61.961830 
      5       39.790000       61.968045 
      5       39.630000       61.968045 
      5       39.580000       61.981085 
      5       39.580000       61.981085 
      5       39.420000       61.981085 
      5       39.510000       61.965804 
      5       39.510000       61.965804 
      6       39.690000       61.965804 
      6       39.760000       61.954216 
      6       39.910000       61.976102 
      6       39.930000       61.959572 
      6       40.130000       61.925480 
      6       40.150000       61.922379 
      6       40.310000       61.938892 
      6       40.210000       61.956001 
      6       40.250000       61.956001 
      6       40.210000       61.938866 
      6       40.280000       61.921506 
      6       40.250000       61.915112 
      6       40.250000       61.916120 
      6       40.240000       61.914669 
      6       40.240000       61.916107 
      7       40.190000       61.914695 
      7       40.210000       61.914695 
      7       40.210000       61.914695 
      7       40.250000       61.916993 
      7       40.180000       61.925467 
      7       40.150000       61.964501 
      7       39.960000       61.994484 
      7       39.910000       61.965387 
      7       39.790000       61.965387 
      7       39.800000       61.936265 
      7       39.840000       61.936265 
      7       39.820000       61.965388 
      7       39.810000       61.994510 
      7       39.840000       61.965375 
      7       39.770000       61.965375 
      8       39.810000       61.965375 
      8       39.800000       61.965375 
      8       39.850000       61.965375 
      8       39.830000       61.935862 
      8       39.850000       61.935862 
      8       39.880000       61.961318 
      8       39.840000       61.986484 
      8       39.780000       61.986484 
      8       39.800000       61.997198 
      8       39.870000       61.997198 
      8       39.920000       62.020952 
      8       40.060000       62.020952 
      8       40.120000       61.984199 
      8       40.250000       61.930893 
      8       40.220000       61.930893 
      9       40.190000       61.930893 
      9       40.260000       61.922836 
      9       40.240000       61.939349 
      9       40.180000       61.961401 
      9       40.200000       61.963063 
      9       40.160000       61.963063 
      9       40.190000       61.961400 
      9       40.160000       61.939309 
      9       40.230000       61.939309 
      9       40.170000       61.921519 
      9       40.240000       61.915112 
      9       40.220000       61.915112 
      9       40.180000       61.916121 
      9       40.200000       61.914709 
      9       40.180000       61.914709 
      10       40.190000       61.914709 
      10       39.910000       61.914709 
      10       39.770000       61.917423 
      10       39.780000       61.930410 
      10       39.840000       61.930410 
      10       39.800000       61.930410 
      10       39.770000       61.982883 
      10       39.830000       62.005668 
      10       39.830000       62.005668 
      10       39.830000       61.936278 
      10       39.780000       61.925510 
      10       39.830000       61.925510 
      10       39.830000       62.010168 
      10       39.840000       62.010168 
      10       39.840000       62.010168 
      10       39.820000       62.007036 
      11       39.810000       61.906226 
      11       39.760000       61.906226 
      11       39.800000       61.848446 
      11       39.840000       61.848446 
      11       39.950000       61.891841 
      11       40.060000       61.891841 
      11       40.220000       61.956015 
      11       40.300000       61.956015 
      11       40.280000       61.986374 
      11       40.210000       61.986374 
      11       40.200000       62.001268 
      11       40.280000       61.963532 
      11       40.260000       61.927792 
      11       40.270000       61.925923 
      12       40.220000       61.959559 
      12       40.210000       61.975230 
      12       40.230000       61.943861 
      12       40.190000       61.943861 
      12       40.240000       61.943861 
      12       40.190000       61.943861 
      12       40.210000       61.922809 
      12       39.770000       61.922809 
      12       39.730000       61.925493 
      12       39.470000       61.959572 
      12       39.560000       61.959572 
      12       39.740000       61.976116 
      12       39.820000       61.954633 
      12       39.940000       61.970343 
      12       39.740000       61.970343 
      12       39.730000       61.995357 
      13       39.730000       61.969914 
      13       39.750000       61.949690 
      13       39.670000       61.949690 
      13       39.840000       61.957747 
      13       39.840000       61.948817 
      13       40.040000       61.959532 
      13       40.060000       61.951475 
      13       40.180000       61.903954 
      13       40.170000       61.897739 
      13       40.150000       61.909726 
      13       40.140000       61.909726 
      13       40.120000       61.915678 
      13       40.050000       61.914682 
      13       40.170000       61.916980 
      13       40.140000       61.925050 
      14       40.200000       61.925050 
      14       40.150000       61.925050 
      14       40.110000       61.925050 
      14       40.120000       61.959975 
      14       40.080000       61.980628 
      14       40.110000       61.980628 
      14       40.150000       61.968032 
      14       40.110000       61.961844 
      14       40.140000       61.939765 
      14       40.110000       61.926919 
      14       40.130000       61.926919 
      14       40.120000       61.939309 
      14       40.110000       61.939309 
      14       40.170000       61.956015 
      14       40.110000       61.956015 
      15       40.170000       61.938866 
      15       40.150000       61.921506 
      15       40.140000       61.921506 
      15       39.770000       61.915112 
      15       39.780000       61.915112 
      15       39.470000       61.915112 
      15       39.560000       61.915112 
      15       39.650000       61.916120 
      15       39.790000       61.916120 
      15       40.010000       61.916120 
      15       40.130000       61.914669 
      15       40.030000       61.916107 
      15       40.070000       61.914695 
      15       40.120000       61.914695 
      15       40.040000       61.914695 
      16       40.100000       61.914695 
      16       40.050000       61.914695 
      16       40.120000       61.914695 
      16       40.140000       61.916980 
      16       40.120000       61.916980 
      16       40.050000       61.925037 
      16       40.090000       61.959559 
      16       40.050000       61.976115 
      16       40.090000       61.976115 
      16       40.020000       61.954633 
      16       40.090000       61.970330 
      16       40.060000       61.994913 
      16       40.080000       61.994913 
      16       40.020000       61.994913 
      16       40.050000       61.964515 
      17       40.070000       61.925467 
      17       40.080000       61.917007 
      17       40.030000       61.917007 
      17       40.030000       61.917007 
      17       40.000000       61.915138 
      17       40.050000       61.921506 
      17       40.040000       61.938866 
      17       40.000000       61.938866 
      17       40.030000       61.956001 
      17       40.010000       61.938866 
      17       40.100000       61.921533 
      17       40.030000       61.916011 
      17       40.030000       61.916011 
      17       39.830000       61.927349 
      17       39.690000       61.968045 
      18       39.640000       62.015566 
      18       39.690000       61.989128 
      18       39.700000       61.989128 
      18       39.700000       61.989128 
      18       39.630000       61.954660 
      18       39.740000       61.958204 
      18       39.660000       61.949704 
      18       39.690000       61.949704 
      18       39.660000       61.969914 
      18       39.930000       61.995343 
      18       40.050000       61.969914 
      18       40.160000       61.949664 
      18       40.260000       61.956887 
      18       40.330000       61.938892 
      18       40.290000       61.921506 
      19       40.330000       61.915111 
      19       40.300000       61.916094 
      19       40.330000       61.913796 
      19       40.280000       61.905739 
      19       40.300000       61.871244 
      19       40.020000       61.871244 
      19       39.870000       61.855573 
      19       39.730000       61.855573 
      19       39.780000       61.855573 
      19       39.760000       61.855573 
      19       39.770000       61.887814 
      19       39.780000       61.919234 
      19       39.750000       61.959962 
      19       39.790000       61.986014 
      19       39.770000       61.992255 
      20       39.820000       61.992255 
      20       39.700000       62.002611 
      20       39.950000       62.002611 
      20       39.940000       62.002611 
      20       40.070000       62.002611 
      20       40.030000       61.974318 
      20       40.140000       61.975340 
      20       40.100000       61.996256 
      20       40.000000       61.996256 
      20       40.060000       61.996256 
      20       40.080000       61.996256 
      20       40.050000       61.976199 
      20       40.070000       61.976199 
      20       40.030000       61.984230 
      20       40.060000       62.040233 
      21       40.100000       62.024523 
      21       40.010000       61.965001 
      21       40.030000       61.966247 
      21       40.060000       61.975712 
      21       40.050000       61.975712 
      21       40.090000       61.975712 
      21       40.020000       61.943849 
      21       40.060000       61.921936 
      21       40.030000       61.921936 
      21       40.060000       61.921936 
      21       40.080000       61.915152 
      21       40.040000       61.915152 
      21       40.080000       61.915152 
      21       40.060000       61.917007 
      21       40.030000       61.925467 
      22       40.030000       61.964474 
      22       40.020000       61.993584 
      22       40.030000       61.993584 
      22       40.080000       61.954133 
      22       40.070000       61.882042 
      22       40.080000       61.882042 
      22       40.070000       61.856459 
      22       40.070000       61.856459 
      22       40.040000       61.887854 
      22       40.080000       61.887854 
      22       39.970000       61.887854 
      22       40.080000       61.887854 
      22       40.010000       61.919638 
      22       40.060000       61.964045 
      22       40.040000       61.994444 
      23       40.040000       61.964528 
      23       40.040000       61.926353 
      23       39.990000       61.926353 
      23       40.040000       61.927792 
      23       39.990000       61.963116 
      23       40.070000       61.996782 
      23       40.030000       61.996782 
      23       39.970000       61.973861 
      23       40.000000       61.975299 
      23       40.030000       61.995344 
      23       40.070000       61.995344 
      23       40.030000       61.995344 
      23       40.000000       61.995344 
      23       40.030000       61.964555 
      23       40.020000       61.926380 
      24       40.060000       61.928678 
      24       40.010000       61.928678 
      24       40.110000       61.973914 
      24       39.980000       62.045177 
      24       40.080000       62.053689 
      24       40.030000       62.025010 
      24       40.020000       62.021909 
      24       40.050000       62.033037 
      24       40.010000       62.025975 
      24       40.030000       61.969818 
      24       40.050000       61.938617 
      24       40.010000       61.969805 
      24       40.000000       61.969805 
      24       40.030000       62.025518 
      24       40.060000       62.027154 
      24       40.010000       61.990997 
      25       40.010000       61.990997 
      25       40.010000       61.990997 
      25       39.990000       61.945178 
      25       40.040000       61.945178 
      25       40.060000       61.922849 
      25       39.980000       61.925507 
      25       40.030000       61.960002 
      25       40.020000       61.960002 
      25       40.000000       61.960002 
      25       40.000000       61.960002 
      25       40.100000       61.981085 
      25       40.000000       61.973888 
      25       40.010000       61.973888 
      25       39.800000       61.991883 
      26       39.710000       62.009269 
      26       39.570000       62.015677 
      26       39.660000       62.015677 
      26       39.640000       62.015112 
      26       39.620000       62.021935 
      26       39.580000       62.021935 
      26       39.580000       62.043808 
      26       39.590000       62.074369 
      26       39.660000       62.074369 
      26       39.880000       62.049593 
      26       40.110000       61.986554 
      26       40.090000       61.986554 
      26       40.260000       61.974761 
      26       40.340000       61.996809 
      26       40.350000       61.963090 
      26       40.290000       61.963090 
      27       40.330000       61.926919 
      27       40.250000       61.916011 
      27       40.300000       61.921963 
      27       40.290000       61.943835 
      27       40.300000       61.975229 
      27       40.300000       61.959532 
      27       40.240000       61.925037 
      27       39.890000       61.916980 
      27       39.650000       61.914735 
      27       39.550000       61.917437 
      27       39.540000       61.930866 
      27       39.560000       61.988699 
      27       39.590000       62.034405 
      27       39.680000       61.990471 
      28       39.810000       61.952462 
      28       39.870000       62.014225 
      28       40.040000       62.074286 
      28       40.100000       62.012923 
      28       40.190000       61.937164 
      28       40.350000       61.929094 
      28       40.330000       61.929094 
      28       40.380000       61.967642 
      28       40.300000       62.009725 
      28       40.300000       61.959532 
      28       40.220000       61.890542 
      28       39.860000       61.893227 
      28       39.900000       61.893227 
      28       39.760000       61.893227 
      28       39.780000       61.909349 
      28       39.760000       61.916981 
      29       39.680000       61.930449 
      29       39.710000       61.930449 
      29       39.730000       61.984629 
      29       39.920000       62.026378 
      29       40.100000       62.022268 
      29       40.180000       62.036733 
      29       40.210000       62.028510 
      29       40.350000       61.996853 
      29       40.280000       61.974344 
      29       40.400000       61.981985 
      29       40.330000       61.970814 
      29       40.340000       61.974358 
      29       40.000000       61.974358 
      29       39.810000       62.008453 
      29       39.660000       62.022308 
      30       39.710000       62.055974 
      30       39.760000       62.054536 
      30       39.740000       62.023720 
      30       39.750000       62.023720 
      30       39.710000       62.023720 
      30       39.750000       62.023720 
      30       39.760000       62.006142 
      30       39.900000       61.965415 
      30       40.070000       61.925534 
      30       40.100000       61.918336 
      30       40.310000       61.931336 
      30       40.230000       61.994098 
      30       40.180000       61.994098 
      30       40.200000       62.058548 
      31       40.280000       62.058548 
      31       40.180000       62.028592 
      31       40.170000       61.955063 
      31       40.220000       61.922849 
      31       40.190000       61.915609 
      31       39.910000       61.921976 
      31       40.450000       61.944708 
      31       39.980000       61.944708 
      31       39.660000       61.985624 
      31       39.760000       62.003843 
      31       39.730000       61.996395 
      31       39.660000       61.993102 
      31       39.840000       61.993102 
      31       39.640000       62.001751 
      31       39.830000       62.001751 
      32       39.970000       61.963519 
      32       40.040000       61.926919 
      32       40.130000       61.915555 
      32       40.050000       61.916134 
      32       40.070000       61.914695 
      32       40.030000       61.916980 
      32       40.070000       61.925037 
      32       40.040000       61.959559 
      32       40.070000       61.976102 
      32       39.980000       61.954203 
      32       40.020000       61.965361 
      32       39.980000       61.975685 
      32       40.000000       61.975685 
      32       40.110000       61.943848 
      32       39.780000       61.943848 
      32       40.070000       61.921936 
      33       40.070000       61.915125 
      33       40.140000       61.916121 
      33       39.990000       61.914696 
      33       40.070000       61.917034 
      33       40.110000       61.917034 
      33       39.960000       61.917034 
      33       40.040000       61.926823 
      33       40.050000       61.981612 
      33       40.040000       62.078760 
      33       40.050000       62.144263 
      33       40.010000       62.137065 
      33       40.080000       62.110654 
      33       40.010000       62.065804 
      33       40.070000       62.024634 
      33       39.950000       62.006652 
      34       40.040000       61.972157 
      34       40.050000       61.966345 
      34       40.020000       62.035362 
      34       40.060000       62.089527 
      34       39.990000       62.075259 
      34       40.010000       62.078360 
      34       40.070000       62.078360 
      34       40.070000       62.110180 
      34       40.030000       62.054589 
      34       40.060000       61.971287 
      34       40.030000       61.971673 
      34       40.060000       61.994954 
      34       39.980000       61.964529 
      34       40.020000       61.925924 
      34       40.050000       61.922862 
      35       40.000000       61.945178 
      35       39.990000       61.990997 
      35       40.000000       62.027181 
      35       40.250000       62.026378 
      35       39.830000       61.979730 
      35       40.120000       61.976682 
      35       39.740000       61.976682 
      35       39.730000       61.976682 
      35       39.510000       62.007498 
      35       39.640000       62.029576 
      35       39.620000       62.083729 
      35       39.610000       62.115996 
      35       39.860000       62.078374 
      35       39.840000       62.069914 
      35       40.090000       62.066634 
      36       39.970000       62.010832 
      36       40.090000       62.005740 
      36       39.970000       62.005740 
      36       39.990000       62.060515 
      36       39.960000       62.060515 
      36       40.000000       62.106141 
      36       39.930000       62.194499 
      36       40.010000       62.201557 
      36       39.980000       62.201557 
      36       39.980000       62.094594 
      36       39.970000       61.995459 
      36       39.970000       61.995459 
      36       39.930000       61.996437 
      36       40.030000       62.089099 
      36       39.960000       62.089099 
      37       40.120000       62.109321 
      37       39.970000       62.033967 
      37       40.130000       62.014366 
      37       40.120000       62.058576 
      37       40.090000       62.095452 
      37       40.120000       62.062163 
      37       40.010000       62.016107 
      37       40.010000       61.967161 
      37       40.010000       61.936359 
      37       40.090000       61.966718 
      37       39.990000       62.010708 
      37       40.060000       62.010708 
      37       40.010000       62.037979 
      37       40.040000       62.055948 
      37       40.030000       62.037993 
      38       39.960000       62.037993 
      38       40.020000       62.011191 
      38       39.980000       61.973446 
      38       40.030000       61.976726 
      38       39.990000       62.078747 
      38       40.050000       62.078747 
      38       39.970000       62.078747 
      38       40.060000       62.148745 
      38       40.000000       62.148745 
      38       40.000000       62.086373 
      38       40.030000       62.008497 
      38       40.040000       61.975244 
      38       40.080000       61.981609 
      38       40.030000       61.966731 
      38       40.080000       61.965888 
      39       40.000000       62.034865 
      39       39.960000       62.082799 
      39       40.050000       62.034905 
      39       40.030000       61.967204 
      39       40.040000       61.967204 
      39       40.020000       61.967204 
      39       40.030000       61.982498 
      39       40.040000       62.049217 
      39       40.030000       62.075243 
      39       40.020000       62.054607 
      39       40.010000       62.070357 
      39       40.000000       62.095800 
      39       40.010000       62.075326 
      39       40.010000       62.074317 
      39       40.020000       62.102610 
      40       40.010000       62.102610 
      40       40.030000       62.102610 
      40       40.030000       62.102610 
      40       40.020000       62.102610 
      40       40.070000       62.092229 
      40       39.980000       62.085155 
      40       40.050000       62.050077 
      40       39.990000       61.982552 
      40       40.010000       61.982552 
      40       40.020000       61.968104 
      40       40.080000       61.968104 
      40       40.010000       62.046160 
      40       40.100000       62.046160 
      40       40.030000       62.046160 
      40       39.970000       62.137049 
      40       40.060000       62.144720 
      41       40.050000       62.084686 
      41       39.960000       62.077529 
      41       40.040000       62.112024 
      41       39.980000       62.112024 
      41       39.930000       62.142975 
      41       40.040000       62.142975 
      41       40.050000       62.175203 
      41       39.980000       62.175203 
      41       40.030000       62.159545 
      41       40.060000       62.125466 
      41       40.020000       62.121896 
      41       40.040000       62.121896 
      41       40.020000       62.132150 
      41       40.110000       62.115177 
      41       40.020000       62.021424 
      42       40.000000       61.958828 
      42       40.040000       61.958828 
      42       40.000000       62.021411 
      42       40.100000       62.114734 
      42       40.010000       62.126711 
      42       39.990000       62.096342 
      42       40.070000       62.096342 
      42       39.910000       62.068462 
      42       40.020000       62.051099 
      42       39.990000       61.991841 
      42       40.080000       61.991841 
      42       39.910000       61.953389 
      42       40.070000       62.025024 
      42       40.010000       62.122760 
      42       39.990000       62.122760 
      43       40.070000       62.095357 
      43       40.120000       62.017510 
      43       40.060000       62.079716 
      43       39.970000       62.079716 
      43       40.030000       62.185013 
      43       40.100000       62.130820 
      43       39.960000       62.035795 
      43       39.990000       61.993669 
      43       40.020000       61.969442 
      43       40.040000       61.967714 
      43       40.010000       61.969415 
      43       39.980000       61.969415 
      43       40.040000       61.992797 
      43       40.040000       61.992797 
      43       40.050000       62.025494 
      44       39.990000       62.089598 
      44       40.110000       62.150978 
      44       39.990000       62.150978 
      44       40.040000       62.166662 
      44       39.980000       62.166662 
      44       40.050000       62.173872 
      44       40.020000       62.173872 
      44       39.990000       62.119554 
      44       40.120000       62.011692 
      44       40.040000       61.962732 
      44       40.030000       61.962732 
      44       40.030000       61.962732 
      44       40.020000       61.993280 
      44       39.960000       61.993280 
      44       39.980000       62.038879 
      45       40.010000       62.084698 
      45       39.990000       62.097531 
      45       40.000000       62.060944 
      45       40.020000       61.998998 
      45       40.110000       61.969056 
      45       40.090000       61.956459 
      45       40.030000       61.956459 
      45       39.980000       62.000840 
      45       40.050000       62.074786 
      45       40.010000       62.097141 
      45       40.050000       62.067189 
      45       39.990000       62.033537 
      45       39.980000       62.051516 
      45       40.040000       62.031306 
      45       39.980000       61.996398 
      46       40.040000       61.996398 
      46       39.960000       62.051989 
      46       40.010000       62.138378 
      46       40.020000       62.155075 
      46       40.000000       62.127211 
      46       40.040000       62.126794 
      46       39.920000       62.084199 
      46       39.980000       62.025050 
      46       40.050000       61.992770 
      46       39.940000       61.992770 
      46       40.040000       61.992770 
      46       39.970000       61.968986 
      46       40.020000       61.968986 
      46       40.010000       61.968986 
      46       39.890000       61.962771 
      47       39.990000       61.962771 
      47       40.090000       61.962771 
      47       39.920000       61.951061 
      47       39.960000       61.982498 
      47       39.730000       62.065348 
      47       39.600000       62.146960 
      47       39.660000       62.146960 
      47       39.590000       62.163921 
      47       39.720000       62.099496 
      47       39.630000       62.099496 
      47       39.860000       62.050564 
      47       39.720000       62.038573 
      47       39.920000       62.038573 
      47       39.880000       62.024108 
      47       40.110000       62.048432 
      48       39.990000       62.087273 
      48       40.030000       62.120119 
      48       40.110000       62.085046 
      48       40.040000       62.085046 
      48       40.010000       62.041287 
      48       40.020000       62.067134 
      48       40.060000       62.067134 
      48       40.010000       62.067134 
      48       39.980000       62.110265 
      48       40.060000       62.132151 
      48       39.960000       62.126835 
      48       39.890000       62.080603 
      48       40.240000       62.080603 
      48       39.870000       62.080603 
      48       40.070000       62.086568 
      48       40.190000       62.144207 
      49       40.050000       62.150146 
      49       40.000000       62.103054 
      49       40.050000       62.103054 
      49       40.000000       62.087814 
      49       40.020000       62.087814 
      49       40.050000       62.087814 
      49       40.000000       62.087814 
      49       40.060000       62.071727 
      49       40.000000       62.071727 
      49       40.020000       62.071727 
      49       39.980000       62.080200 
      49       39.970000       62.137620 
      49       39.970000       62.181417 
      49       40.030000       62.181417 
      49       40.000000       62.200382 
      50       40.010000       62.157663 
      50       39.980000       62.157663 
      50       39.950000       62.097725 
      50       39.970000       62.097725 
      50       40.000000       62.055534 
      50       40.010000       62.060069 
      50       40.050000       62.053275 
      50       39.990000       62.026007 
      50       40.040000       62.026007 
      50       39.930000       62.100343 
      50       40.010000       62.198013 
      50       40.010000       62.165772 
      50       40.010000       62.052379 
      50       40.060000       61.972644 
      50       39.980000       61.991008 
      51       39.980000       62.022793 
      51       39.980000       62.014322 
      51       39.920000       62.014322 
      51       39.970000       62.070747 
      51       39.980000       62.139777 
      51       40.020000       62.132136 
      51       39.910000       62.096786 
      51       40.010000       62.096786 
      51       39.970000       62.068502 
      51       40.060000       62.051985 
      51       39.940000       62.002627 
      51       39.990000       62.001394 
      51       40.010000       62.101199 
      51       39.980000       62.168970 
      51       39.960000       62.167575 
      52       39.960000       62.167575 
      52       40.010000       62.167632 
      52       40.000000       62.168461 
      52       39.920000       62.179755 
      52       39.950000       62.179755 
      52       39.980000       62.149177 
      52       40.000000       62.076643 
      52       40.000000       62.036775 
      52       40.010000       62.061788 
      52       40.000000       62.091924 
      52       39.960000       62.122739 
      52       39.980000       62.177541 
      52       39.980000       62.188146 
      52       40.010000       62.188146 
      52       40.010000       62.201325 
      53       40.020000       62.227154 
      53       39.970000       62.215150 
      53       39.990000       62.215150 
      53       40.030000       62.125453 
      53       39.960000       62.065915 
      53       40.020000       62.077042 
      53       39.950000       62.060459 
      53       40.030000       62.035406 
      53       39.980000       62.060405 
      53       39.990000       62.075269 
      53       39.990000       62.044292 
      53       39.960000       62.027791 
      53       40.030000       62.045151 
      53       39.970000       62.085168 
      54       39.970000       62.085168 
      54       39.970000       62.097611 
      54       39.990000       62.097611 
      54       39.980000       62.063173 
      54       40.010000       62.026410 
      54       39.990000       62.094554 
      54       40.020000       62.169330 
      54       40.010000       62.113352 
      54       39.980000       62.047076 
      54       40.000000       62.067133 
      54       39.960000       62.104423 
      54       39.960000       62.102125 
      54       40.000000       62.057774 
      54       40.020000       61.997284 
      54       39.950000       62.036292 
      54       40.010000       62.134392 
      55       40.020000       62.134392 
      55       39.940000       62.134392 
      55       40.010000       62.142489 
      55       40.030000       62.082472 
      55       40.010000       62.073059 
      55       39.940000       62.165360 
      55       39.980000       62.256775 
      55       40.000000       62.235652 
      55       39.940000       62.115624 
      55       40.000000       61.986955 
      55       40.010000       61.935474 
      55       40.040000       61.956487 
      55       40.010000       61.956487 
      55       39.990000       62.035349 
      55       40.000000       62.098983 
      56       40.030000       62.107899 
      56       40.010000       62.090957 
      56       40.010000       62.063102 
      56       40.050000       62.033121 
      56       39.950000       61.985156 
      56       39.960000       61.995454 
      56       40.040000       62.021879 
      56       40.010000       61.998138 
      56       39.950000       61.998156 
      56       39.950000       62.020094 
      56       40.010000       62.059586 
      56       39.990000       62.081958 
      56       39.970000       62.084659 
      56       39.990000       62.139377 
      56       39.990000       62.177789 
      57       40.000000       62.177789 
      57       39.990000       62.177789 
      57       40.010000       62.109378 
      57       39.990000       62.010669 
      57       40.010000       61.980284 
      57       39.920000       61.980284 
      57       39.960000       61.980284 
      57       39.930000       61.999038 
      57       40.000000       62.051032 
      57       40.020000       62.059062 
      57       40.000000       62.059062 
      57       40.020000       62.059062 
      57       39.990000       62.042975 
      57       40.030000       62.028152 
      57       40.000000       62.028152 
      58       39.980000       61.985639 
      58       39.980000       61.985639 
      58       40.010000       61.985639 
      58       40.010000       62.007139 
      58       39.970000       62.081501 
      58       40.050000       62.131277 
      58       40.010000       62.131277 
      58       39.990000       62.145150 
      58       40.020000       62.095440 
      58       40.000000       62.061362 
      58       40.050000       62.061362 
      58       39.990000       62.091910 
      58       40.000000       62.122681 
      58       39.990000       62.112067 
      58       39.950000       62.076545 
      59       40.040000       62.076545 
      59       39.990000       62.073028 
      59       39.960000       62.020511 
      59       40.040000       61.989252 
      59       40.030000       61.989252 
      59       39.990000       62.017340 
      59       40.060000       62.017340 
      59       40.030000       61.989652 
      59       40.000000       61.960933 
      59       40.000000       61.992770 
      59       40.000000       61.992770 
      59       39.930000       62.033077 
      59       39.980000       62.033077 
      59       39.940000       62.056431 
      59       40.010000       62.049637 
      60       40.020000       62.069457 
      60       39.970000       62.069457 
      60       40.030000       62.089528 
      60       39.950000       62.041204 
      60       40.050000       61.996371 
      60       39.950000       62.041164 
      60       40.000000       62.041164 
      60       40.040000       62.041164 
      60       40.010000       62.088198 
      60       40.000000       62.053273 
      60       39.970000       61.977489 
      60       39.950000       61.942147 
      60       39.970000       61.984683 
      60       40.000000       62.016480 
      60       40.000000       61.984256 
      60       40.010000       61.984256 
      61       40.010000       61.984256 
