Human trial picking the raspberry twin 

 time    ||     output     ||     loadcell

      0.000000       -802.001587       0.150000 
      0.030917       -802.001587       0.050000 
      0.061834       -802.001587       0.020000 
      0.092759       -802.001587       0.020000 
      0.124688       -802.001587       0.190000 
      0.154642       -802.001587       0.010000 
      0.185791       -802.001587       0.290000 
      0.216560       -802.001587       0.260000 
      0.248507       -802.001587       0.070000 
      0.278437       -802.001582       0.150000 
      0.310342       -802.000390       0.190000 
      0.340771       -801.893058       0.260000 
      0.372681       -798.338716       0.170000 
      0.404596       -755.037961       0.010000 
      0.434550       -560.977440       0.320000 
      0.466431       -241.025731       0.030000 
      0.498635       -46.965210       0.010000 
      0.529439       -3.664455       0.020000 
      0.561121       -0.110112       0.050000 
      0.593035       -0.002780       0.110000 
      0.622956       -0.001588       0.130000 
      0.654402       -0.001583       0.060000 
      0.685353       -0.001583       0.060000 
      0.716499       -0.001583       0.170000 
      0.747252       -0.001583       0.040000 
      0.779197       -0.001583       0.110000 
      0.809302       -0.001583       0.210000 
      0.839845       -0.001583       0.060000 
      0.870295       -0.001583       0.040000 
      0.901869       -0.001583       0.130000 
      0.933460       -0.001583       0.000000 
      0.964331       -0.001583       0.010000 
      0.995911       -0.001583       0.010000 
      1.027870       -0.001583       0.270000 
      1.059815       -0.001583       0.110000 
      1.089734       -0.001583       0.150000 
      1.121643       -0.001583       0.130000 
      1.153564       -0.001583       0.140000 
      1.183478       -0.001583       0.050000 
      1.215367       -0.001583       0.200000 
      1.247105       -0.001583       0.050000 
      1.277028       -0.001583       0.160000 
      1.308910       -0.001583       0.020000 
      1.339865       -0.001583       0.160000 
      1.386735       -0.001583       0.200000 
      1.416621       -0.001583       0.090000 
      1.446542       -0.001583       0.090000 
      1.476462       -0.001583       0.020000 
      1.522565       -0.001583       0.090000 
      1.554563       -0.001583       0.110000 
      1.585559       -0.001583       0.030000 
      1.616108       -0.001583       0.070000 
      1.647891       -0.001583       0.010000 
      1.678862       -0.001583       0.340000 
      1.709752       -0.001583       0.010000 
      1.741706       -0.001583       0.180000 
      1.771447       -0.001583       0.010000 
      1.801367       -0.001583       0.030000 
      1.833314       -0.001583       0.090000 
      1.864223       -0.001583       0.010000 
      1.895150       -0.001583       0.190000 
      1.926033       -0.001583       0.190000 
      1.955983       -0.001583       0.040000 
      1.986874       -0.001583       0.010000 
      2.018787       -0.001583       0.090000 
      2.049711       -0.001583       0.200000 
      2.080651       -0.001583       0.100000 
      2.111564       -0.001583       0.330000 
      2.142667       -0.001583       0.150000 
      2.172588       -0.001583       0.100000 
      2.202509       -0.001583       0.060000 
      2.234572       -0.001583       0.160000 
      2.265568       -0.001583       0.160000 
      2.296230       -0.001583       0.100000 
      2.326600       -0.001583       0.020000 
      2.357567       -0.001583       0.020000 
      2.388222       -0.001583       0.040000 
      2.418917       -0.001583       0.210000 
      2.450255       -0.001583       0.110000 
      2.482191       -0.001583       0.050000 
      2.512947       -0.001583       0.040000 
      2.543675       -0.001583       0.080000 
      2.575740       -0.001583       0.140000 
      2.606983       -0.001583       0.200000 
      2.637972       -0.001583       0.040000 
      2.668719       -0.001583       0.110000 
      2.699919       -0.001583       0.020000 
      2.730714       -0.001583       0.030000 
      2.761768       -0.001583       0.010000 
      2.793340       -0.001583       0.010000 
      2.824959       -0.001583       0.250000 
      2.856909       -0.001583       0.020000 
      2.887949       -0.001583       0.170000 
      2.918671       -0.001583       0.150000 
      2.949414       -0.001583       0.080000 
      2.980984       -0.001583       0.200000 
      3.012052       -0.001583       0.190000 
      3.043344       -0.001583       0.030000 
      3.073888       -0.001583       0.020000 
      3.120255       -0.001583       0.100000 
      3.151947       -0.001583       0.010000 
      3.182384       -0.001583       0.040000 
      3.213523       -0.001583       0.120000 
      3.244318       -0.001583       0.090000 
      3.275783       -0.001583       0.210000 
      3.306600       -0.001583       0.010000 
      3.337525       -0.001583       0.030000 
      3.368400       -0.001583       0.070000 
      3.399750       -0.001583       0.150000 
      3.431249       -0.001583       0.040000 
      3.463608       -0.001583       0.010000 
      3.494528       -0.001583       0.140000 
      3.524838       -0.001583       0.230000 
      3.555520       -0.001583       0.110000 
      3.585981       -0.001583       0.160000 
      3.617386       -0.001583       0.030000 
      3.649052       -0.001583       0.110000 
      3.679657       -0.001583       0.050000 
      3.711139       -0.001583       0.190000 
      3.742747       -0.001583       0.020000 
      3.774084       -0.001583       0.160000 
      3.803938       -0.001583       0.080000 
      3.834777       -0.001583       0.070000 
      3.865804       -0.001583       0.010000 
      3.896610       -0.001583       0.150000 
      3.927635       -0.001583       0.070000 
      3.957811       -0.001583       0.040000 
      3.989371       -0.001583       0.040000 
      4.020649       -0.001583       0.110000 
      4.052710       -0.001583       0.020000 
      4.083982       -0.001583       0.100000 
      4.115456       -0.001583       0.050000 
      4.146485       -0.001583       0.180000 
      4.177802       -0.001583       0.090000 
      4.209329       -0.001583       0.030000 
      4.240712       -0.001583       0.330000 
      4.271806       -0.001583       0.240000 
      4.303178       -0.001583       0.210000 
      4.334196       -0.001583       0.300000 
      4.365014       -0.001583       0.140000 
      4.395320       -0.001583       0.020000 
      4.426269       -0.001583       0.020000 
      4.457608       -0.001583       0.050000 
      4.488914       -0.001583       0.190000 
      4.519897       -0.001583       0.020000 
      4.551342       -0.001583       0.140000 
      4.582932       -0.001583       0.030000 
      4.613133       -0.001583       0.190000 
      4.643178       -0.001583       0.160000 
      4.673733       -0.001583       0.030000 
      4.705693       -0.001583       0.030000 
      4.737140       -0.001583       0.040000 
      4.767589       -0.001583       0.010000 
      4.798807       -0.001583       0.190000 
      4.829756       -0.001583       0.200000 
      4.860861       -0.001583       0.080000 
      4.892805       -0.001583       0.080000 
      4.922791       -0.001583       0.170000 
      4.953913       -0.001583       0.270000 
      4.985117       -0.001583       0.010000 
      5.015734       -0.001596       0.090000 
      5.046653       -0.002026       0.060000 
      5.077069       -0.006982       0.170000 
      5.108492       -0.025780       0.010000 
      5.139920       -0.041477       0.160000 
      5.170777       -0.025780       0.200000 
      5.201436       -0.006982       0.090000 
      5.232814       -0.002026       0.150000 
      5.263614       -0.001596       0.050000 
      5.310802       -0.001583       0.020000 
      5.341967       -0.001583       0.060000 
      5.373456       -0.001583       0.040000 
      5.404785       -0.001583       0.230000 
      5.436062       -0.001583       0.090000 
      5.466851       -0.001583       0.010000 
      5.497769       -0.001583       0.030000 
      5.529685       -0.001583       0.280000 
      5.560955       -0.001583       0.030000 
      5.592302       -0.001583       0.070000 
      5.639797       -0.001583       0.030000 
      5.670931       -0.001583       0.030000 
      5.702913       -0.001583       0.030000 
      5.733959       -0.001583       0.030000 
      5.765079       -0.001583       0.020000 
      5.796934       -0.001583       0.110000 
      5.827632       -0.001583       0.110000 
      5.858831       -0.001583       0.030000 
      5.890826       -0.001583       0.180000 
      5.922117       -0.001583       0.030000 
      5.953271       -0.001583       0.040000 
      5.984163       -0.001583       0.050000 
      6.014959       -0.001583       0.180000 
      6.046125       -0.001583       0.010000 
      6.077242       -0.001583       0.250000 
      6.108271       -0.001583       0.020000 
      6.138664       -0.001583       0.340000 
      6.170066       -0.001583       0.160000 
      6.200683       -0.001583       0.140000 
      6.230988       -0.001583       0.120000 
      6.261457       -0.001583       0.110000 
      6.291824       -0.001583       0.030000 
      6.321550       -0.001583       0.070000 
      6.351902       -0.001583       0.180000 
      6.383339       -0.001583       0.120000 
      6.414218       -0.001583       0.120000 
      6.446155       -0.001583       0.040000 
      6.477710       -0.001583       0.110000 
      6.509259       -0.001583       0.030000 
      6.541167       -0.001583       0.040000 
      6.571741       -0.001583       0.030000 
      6.602594       -0.001583       0.040000 
      6.633950       -0.001583       0.110000 
      6.665193       -0.001596       0.250000 
      6.696742       -0.002026       0.100000 
      6.728656       -0.006982       0.030000 
      6.759706       -0.025780       0.080000 
      6.791130       -0.041477       0.190000 
      6.822497       -0.025780       0.110000 
      6.853512       -0.006982       0.120000 
      6.885204       -0.002026       0.090000 
      6.915979       -0.001596       0.250000 
      6.946409       -0.001583       0.130000 
      6.977774       -0.001583       0.080000 
      7.009592       -0.001596       0.080000 
      7.040659       -0.002026       0.160000 
      7.071864       -0.006982       0.070000 
      7.102953       -0.025780       0.130000 
      7.134004       -0.041477       0.160000 
      7.165014       -0.025780       0.110000 
      7.195742       -0.006982       0.120000 
      7.227035       -0.002026       0.140000 
      7.258699       -0.001597       0.050000 
      7.289907       -0.001597       0.010000 
      7.321430       -0.002026       0.280000 
      7.351590       -0.006995       0.010000 
      7.382535       -0.026223       0.000000 
      7.413716       -0.046876       0.030000 
      7.444689       -0.049977       0.110000 
      7.476281       -0.046876       0.190000 
      7.506916       -0.026223       0.210000 
      7.537869       -0.006995       0.180000 
      7.568776       -0.002026       0.050000 
      7.600242       -0.001596       0.110000 
      7.631639       -0.001583       0.060000 
      7.663095       -0.001583       0.060000 
      7.693144       -0.001583       0.020000 
      7.724129       -0.001583       0.150000 
      7.755405       -0.001583       0.190000 
      7.786244       -0.001583       0.080000 
      7.817473       -0.001596       0.140000 
      7.848921       -0.002026       0.060000 
      7.880807       -0.006982       0.220000 
      7.911316       -0.025780       0.170000 
      7.942468       -0.041477       0.090000 
      7.973162       -0.025780       0.030000 
      8.004446       -0.006982       0.090000 
      8.035111       -0.002026       0.020000 
      8.066600       -0.001596       0.030000 
      8.097680       -0.001583       0.120000 
      8.129731       -0.001583       0.080000 
      8.160302       -0.001583       0.020000 
      8.190976       -0.001583       0.030000 
      8.222131       -0.001583       0.080000 
      8.253237       -0.001583       0.030000 
      8.284507       -0.001596       0.250000 
      8.315548       -0.002026       0.050000 
      8.346476       -0.006982       0.020000 
      8.378185       -0.025780       0.210000 
      8.408735       -0.041477       0.050000 
      8.439602       -0.025780       0.120000 
      8.470291       -0.006995       0.220000 
      8.501365       -0.002470       0.120000 
      8.532382       -0.007022       0.150000 
      8.563265       -0.026667       0.060000 
      8.594030       -0.052289       0.140000 
      8.625616       -0.074631       0.070000 
      8.656651       -0.092613       0.050000 
      8.687297       -0.080017       0.160000 
      8.717737       -0.076486       0.210000 
      8.748542       -0.066561       0.240000 
      8.779701       -0.031206       0.080000 
      8.811052       -0.007426       0.160000 
      8.842059       -0.002066       0.020000 
      8.872608       -0.002483       0.030000 
      8.903220       -0.012381       0.010000 
      8.934134       -0.049977       0.190000 
      8.964891       -0.081372       0.070000 
      8.995745       -0.049991       0.090000 
      9.025845       -0.012824       0.230000 
      9.057137       -0.007868       0.020000 
      9.087765       -0.025807       0.130000 
      9.119143       -0.041491       0.040000 
      9.149816       -0.026223       0.010000 
      9.181251       -0.012395       0.020000 
      9.212348       -0.026666       0.150000 
      9.242733       -0.046890       0.090000 
      9.274360       -0.049977       0.070000 
      9.305632       -0.046876       0.110000 
      9.336288       -0.026223       0.090000 
      9.366741       -0.006995       0.120000 
      9.397692       -0.002026       0.220000 
      9.429577       -0.001596       0.070000 
      9.459363       -0.001583       0.050000 
      9.491093       -0.001596       0.100000 
      9.521014       -0.002026       0.100000 
      9.552930       -0.006995       0.030000 
      9.584372       -0.026223       0.000000 
      9.616287       -0.046876       0.100000 
      9.647132       -0.049977       0.260000 
      9.678018       -0.046876       0.020000 
      9.709936       -0.026223       0.120000 
      9.740850       -0.007009       0.020000 
      9.771768       -0.002470       0.020000 
      9.801689       -0.006996       0.000000 
      9.833603       -0.025794       0.230000 
      9.865521       -0.041921       0.180000 
      9.895437       -0.031193       0.110000 
      9.927352       -0.031622       0.010000 
      9.958269       -0.047320       0.130000 
      9.989189       -0.050004       0.100000 
      10.020105       -0.047346       0.120000 
      10.050026       -0.032509       0.110000 
      10.081513       -0.041991       0.240000 
      10.111475       -0.090315       0.220000 
      10.142382       -0.105582       0.150000 
      10.173265       -0.055403       0.020000 
      10.204185       -0.013711       0.000000 
      10.235068       -0.013281       0.230000 
      10.266542       -0.050004       0.010000 
      10.297962       -0.081372       0.130000 
      10.329151       -0.049977       0.310000 
      10.359601       -0.012381       0.040000 
      10.391272       -0.002469       0.040000 
      10.422352       -0.001610       0.030000 
      10.452285       -0.001583       0.010000 
      10.483628       -0.001583       0.270000 
      10.515427       -0.001583       0.080000 
      10.545311       -0.001583       0.020000 
      10.576440       -0.001583       0.090000 
      10.607221       -0.001583       0.070000 
      10.638485       -0.001583       0.260000 
      10.669326       -0.001583       0.190000 
      10.699228       -0.001596       0.030000 
      10.731144       -0.002026       0.190000 
      10.761063       -0.006982       0.020000 
      10.790985       -0.025793       0.070000 
      10.821902       -0.041921       0.100000 
      10.852819       -0.031193       0.100000 
      10.883734       -0.031622       0.090000 
      10.913682       -0.047320       0.060000 
      10.944574       -0.049991       0.050000 
      10.975862       -0.046876       0.220000 
      11.007779       -0.026223       0.200000 
      11.037700       -0.007009       0.090000 
      11.067619       -0.002483       0.080000 
      11.099560       -0.007465       0.080000 
      11.129452       -0.032066       0.020000 
      11.160876       -0.076499       0.090000 
      11.192791       -0.114968       0.010000 
      11.223708       -0.122223       0.210000 
      11.254626       -0.110069       0.060000 
      11.286541       -0.122679       0.040000 
      11.317457       -0.120811       0.210000 
      11.347378       -0.106123       0.020000 
      11.377298       -0.097057       0.130000 
      11.408215       -0.082798       0.130000 
      11.439134       -0.085873       0.130000 
      11.469052       -0.116837       0.220000 
      11.499972       -0.114982       0.110000 
      11.531884       -0.082355       0.070000 
      11.561806       -0.062548       0.140000 
      11.593721       -0.082342       0.100000 
      11.625662       -0.114525       0.010000 
      11.655587       -0.110981       0.290000 
      11.685508       -0.055820       0.260000 
      11.717424       -0.012851       0.020000 
      11.747311       -0.002926       0.220000 
      11.779258       -0.007009       0.040000 
      11.810305       -0.025807       0.100000 
      11.842281       -0.042390       0.070000 
      11.873291       -0.037465       0.010000 
      11.904663       -0.066174       0.100000 
      11.935573       -0.130209       0.030000 
      11.966656       -0.129779       0.080000 
      11.998113       -0.060789       0.090000 
      12.029604       -0.013724       0.040000 
      12.060787       -0.008365       0.070000 
      12.092732       -0.032106       0.170000 
      12.122861       -0.076930       0.240000 
      12.154576       -0.119924       0.050000 
      12.185254       -0.141007       0.300000 
      12.216280       -0.125310       0.060000 
      12.246742       -0.101126       0.100000 
      12.277761       -0.071973       0.030000 
      12.309145       -0.031649       0.050000 
      12.339613       -0.007452       0.020000 
      12.370901       -0.002483       0.050000 
      12.402617       -0.006996       0.160000 
      12.433976       -0.025807       0.030000 
      12.465973       -0.042391       0.060000 
      12.495893       -0.037491       0.040000 
      12.527768       -0.067061       0.050000 
      12.559193       -0.141007       0.080000 
      12.591102       -0.178187       0.130000 
      12.622166       -0.141007       0.120000 
      12.653348       -0.067061       0.060000 
      12.683445       -0.037505       0.170000 
      12.714604       -0.042834       0.080000 
      12.745814       -0.031206       0.150000 
      12.775723       -0.031180       0.180000 
      12.807709       -0.041934       0.050000 
      12.839628       -0.026237       0.210000 
      12.869542       -0.012382       0.160000 
      12.901428       -0.026250       0.040000 
      12.933370       -0.042377       0.240000 
      12.964783       -0.036579       0.030000 
      12.995703       -0.055390       0.030000 
      13.025622       -0.082271       0.150000 
      13.056546       -0.055846       0.200000 
      13.087988       -0.042421       0.100000 
      13.119838       -0.071960       0.070000 
      13.151440       -0.089925       0.140000 
      13.182341       -0.071974       0.000000 
      13.213281       -0.042891       0.050000 
      13.243950       -0.062132       0.010000 
      13.275480       -0.117280       0.080000 
      13.306495       -0.144122       0.110000 
      13.337357       -0.145990       0.110000 
      13.367927       -0.121254       0.140000 
      13.398908       -0.088184       0.020000 
      13.429543       -0.085886       0.230000 
      13.460893       -0.111894       0.050000 
      13.491971       -0.096184       0.030000 
      13.523271       -0.066631       0.050000 
      13.553470       -0.077359       0.010000 
      13.584743       -0.090368       0.030000 
      13.616475       -0.071974       0.030000 
      13.647323       -0.042434       0.080000 
      13.678765       -0.056289       0.070000 
      13.709828       -0.087671       0.080000 
      13.740915       -0.079600       0.670000 
      13.772323       -0.076929       1.380000 
      13.803056       -0.072417       1.370000 
      13.834195       -0.061272       0.970000 
      13.865353       -0.077829       0.630000 
      13.897024       -0.102013       0.160000 
      13.927767       -0.130306       1.910000 
      13.958825       -0.160692       4.790000 
      13.990165       -0.146433       6.340000 
      14.022168       -0.110070       8.980000 
      14.052892       -0.098496       11.650000 
      14.083909       -0.075987       14.800000 
      14.115230       -0.063544       18.320000 
      14.146635       -0.080460       22.350000 
      14.177236       -0.110994       26.490000 
      14.208102       -0.090315       29.590000 
      14.239020       -0.036592       35.600000 
      14.269002       -0.007869       42.180000 
      14.299767       -0.002053       50.110000 
      14.330830       -0.001610       55.350000 
      14.361296       -0.002040       63.960000 
      14.392757       -0.007425       73.680000 
      14.423979       -0.031193       81.950000 
      14.455282       -0.066117       93.490000 
      14.485947       -0.071073       101.100000 
      14.516710       -0.055376       113.430000 
      14.547793       -0.047320       128.220000 
      14.578949       -0.026237       146.760000 
      14.608869       -0.006996       160.840000 
      14.639929       -0.002026       185.240000 
      14.671781       -0.001596       211.710000 
      14.703017       -0.001583       236.330000 
      14.734059       -0.001582       252.370000 
      14.765057       -0.001528       267.140000 
      14.794593       0.000285       274.250000 
      14.824961       0.023251       281.410000 
      14.856620       0.137553       290.740000 
      14.888513       0.385488       301.680000 
      14.918433       0.669595       317.540000 
      14.950382       0.864682       331.480000 
      14.982466       0.940096       341.460000 
      15.013973       0.982332       347.860000 
      15.044894       1.070388       52.630000 
      15.075784       1.316107       31.250000 
      15.107699       1.708341       25.920000 
      15.138617       2.076408       22.990000 
      15.169532       2.449068       16.310000 
      15.200982       2.796463       12.390000 
      15.230878       2.993004       11.990000 
      15.261827       3.175221       8.940000 
      15.292744       3.500243       19.560000 
      15.323629       3.845036       8.540000 
      15.354545       4.122195       5.140000 
      15.386493       4.455631       5.400000 
      15.417378       4.776420       8.480000 
      15.448297       4.729894       3.460000 
      15.478250       3.826342       2.240000 
      15.510164       2.350801       3.290000 
      15.542078       1.488379       4.770000 
      15.571965       1.099889       7.740000 
      15.601886       0.513947       5.260000 
      15.631839       -0.352292       3.200000 
      15.663299       -1.065285       3.180000 
      15.694214       -1.500434       4.880000 
      15.725542       -1.791343       5.150000 
      15.756768       -1.946667       4.780000 
      15.787583       -1.993859       6.600000 
      15.818627       -2.001072       4.980000 
      15.850005       -2.001569       3.210000 
      15.880585       -2.001583       4.390000 
      15.911635       -2.001583       6.410000 
      15.942667       -2.001583       6.550000 
      15.974292       -2.001583       6.180000 
      16.005719       -2.001583       5.390000 
      16.036465       -2.001583       5.170000 
      16.067574       -2.001583       6.160000 
      16.098776       -2.001583       6.650000 
      16.129799       -2.001583       6.050000 
      16.161286       -2.001583       5.570000 
      16.192185       -2.001583       6.220000 
      16.222768       -2.001583       6.490000 
      16.254025       -2.001583       5.660000 
      16.284208       -2.001583       5.190000 
      16.315995       -2.001583       5.380000 
      16.346561       -2.001570       5.850000 
      16.377505       -2.001140       6.190000 
      16.409611       -1.996184       5.420000 
      16.440907       -1.977386       4.650000 
      16.473049       -1.961689       4.500000 
      16.504160       -1.977386       5.010000 
      16.535626       -1.996184       5.410000 
      16.566978       -2.001140       5.610000 
      16.598002       -2.001570       4.890000 
      16.628920       -2.001583       4.720000 
      16.659526       -2.001583       4.660000 
      16.690851       -2.001583       5.280000 
      16.721767       -2.001583       5.630000 
      16.751647       -2.001583       5.550000 
      16.783495       -2.001583       5.430000 
      16.814127       -2.001583       5.210000 
      16.844240       -2.001583       5.450000 
      16.875475       -2.001583       5.700000 
      16.906531       -2.001583       5.710000 
      16.938072       -2.001583       5.580000 
      16.969964       -2.001583       5.610000 
      17.016329       -2.001583       5.770000 
      17.046835       -2.001570       5.780000 
      17.078259       -2.001140       5.740000 
      17.109570       -1.996184       5.200000 
      17.140057       -1.977386       5.280000 
      17.170856       -1.961689       5.310000 
      17.202068       -1.977386       5.640000 
      17.233576       -1.996184       5.340000 
      17.263434       -2.001140       5.350000 
      17.294891       -2.001570       5.190000 
      17.326369       -2.001583       5.440000 
      17.357066       -2.001583       5.510000 
      17.389222       -2.001570       5.110000 
      17.420627       -2.001140       5.120000 
      17.452074       -1.996184       5.240000 
      17.498877       -1.977386       5.270000 
      17.530783       -1.961689       5.210000 
      17.561867       -1.977386       5.400000 
      17.592938       -1.996184       5.400000 
      17.624855       -2.001140       5.430000 
      17.655798       -2.001570       5.660000 
      17.686688       -2.001583       5.920000 
      17.718603       -2.001583       5.640000 
      17.748523       -2.001583       5.260000 
      17.779787       -2.001583       5.150000 
      17.810670       -2.001583       5.410000 
      17.841599       -2.001583       5.740000 
      17.873537       -2.001583       5.270000 
      17.903421       -2.001583       5.320000 
      17.935336       -2.001583       5.310000 
      17.967250       -2.001583       5.160000 
      17.998403       -2.001583       5.300000 
      18.029486       -2.001583       5.170000 
      18.061423       -2.001583       5.260000 
      18.091348       -2.001583       5.190000 
      18.123269       -2.001583       5.170000 
      18.155178       -2.001583       5.580000 
      18.185098       -2.001583       5.530000 
      18.217012       -2.001583       5.740000 
      18.248290       -2.001583       5.490000 
      18.278394       -2.001569       5.480000 
      18.310280       -2.001126       5.250000 
      18.340259       -1.995727       5.510000 
      18.370778       -1.971544       5.620000 
      18.402209       -1.932079       5.680000 
      18.433149       -1.912851       5.600000 
      18.463047       -1.926694       5.580000 
      18.494012       -1.947346       5.550000 
      18.525251       -1.955820       5.300000 
      18.554928       -1.976486       5.460000 
      18.586141       -1.990758       5.410000 
      18.616880       -1.976499       5.470000 
      18.647791       -1.956263       5.370000 
      18.679640       -1.952745       5.490000 
      18.711485       -1.950877       5.390000 
      18.742402       -1.952303       5.190000 
      18.773319       -1.950877       5.320000 
      18.805233       -1.952745       5.250000 
      18.836152       -1.956263       4.950000 
      18.867507       -1.976499       5.150000 
      18.898601       -1.990771       5.010000 
      18.929752       -1.976943       5.070000 
      18.961036       -1.961675       5.360000 
      18.991996       -1.977372       5.170000 
      19.022803       -1.995727       5.310000 
      19.053541       -1.995284       5.520000 
      19.085457       -1.971530       5.420000 
      19.115379       -1.932092       5.310000 
      19.147293       -1.913294       5.390000 
      19.195202       -1.932079       5.380000 
      19.227035       -1.971087       5.540000 
      19.257538       -1.989858       5.500000 
      19.288401       -1.970630       5.490000 
      19.319565       -1.926223       5.630000 
      19.350986       -1.883242       5.590000 
      19.381130       -1.862159       5.590000 
      19.412451       -1.877856       5.580000 
      19.442871       -1.902013       5.480000 
      19.474724       -1.930280       5.490000 
      19.505642       -1.959832       5.370000 
      19.537557       -1.936521       5.320000 
      19.568474       -1.872500       5.560000 
      19.600388       -1.867974       5.210000 
      19.630346       -1.917724       5.180000 
      19.661263       -1.943719       5.070000 
      19.691371       -1.941464       5.190000 
      19.723225       -1.907412       5.020000 
      19.754142       -1.891311       5.240000 
      19.784065       -1.918153       5.030000 
      19.815490       -1.925350       5.250000 
      19.846408       -1.925350       5.210000 
      19.877325       -1.918153       5.110000 
      19.908748       -1.891298       5.030000 
      19.939700       -1.906969       5.380000 
      19.970612       -1.936092       5.480000 
      20.002499       -1.920408       5.390000 
      20.033442       -1.888627       5.590000 
      20.063335       -1.892145       5.650000 
      20.094253       -1.946017       5.650000 
      20.126167       -1.974131       5.530000 
      20.158084       -1.928092       5.550000 
      20.189002       -1.881847       5.460000 
      20.218805       -1.928091       5.620000 
      20.249578       -1.974118       5.440000 
      20.281506       -1.945574       5.440000 
      20.311934       -1.886746       5.590000 
      20.342851       -1.864443       5.490000 
      20.374027       -1.880943       5.480000 
      20.405380       -1.916837       5.340000 
      20.436907       -1.919938       5.450000 
      20.468861       -1.901596       5.310000 
      20.498780       -1.883671       5.090000 
      20.530695       -1.891728       4.920000 
      20.561611       -1.946420       5.170000 
      20.592529       -1.978616       5.090000 
      20.623482       -1.940577       5.190000 
      20.653366       -1.861649       4.980000 
      20.683692       -1.812865       5.160000 
      20.714642       -1.797554       5.370000 
      20.745804       -1.783269       5.000000 
      20.776457       -1.791755       5.180000 
      20.807082       -1.847763       5.190000 
      20.837698       -1.895297       5.180000 
      20.868599       -1.919924       5.400000 
      20.898947       -1.922626       5.380000 
      20.930554       -1.909196       5.550000 
      20.961699       -1.911868       5.470000 
      20.992618       -1.871987       5.410000 
      21.024533       -1.821378       5.570000 
