

 time    ||    gripping force   ||   raspberry measurement 

      0       89.590000       -794.938889 
      0       89.700000       -794.938889 
      0       72.870000       -794.938889 
      0       39.990000       -794.938889 
      0       35.950000       -794.938889 
      0       30.410000       -794.938889 
      0       27.110000       -794.938889 
      0       24.080000       -794.938889 
      0       18.650000       -794.938889 
      0       17.090000       -794.938884 
      0       16.010000       -794.937702 
      0       15.430000       -794.831294 
      0       14.860000       -791.307573 
      1       14.250000       -748.380792 
      1       13.950000       -556.009625 
      1       13.290000       -238.926832 
      1       12.690000       -46.854151 
      1       12.230000       -4.337376 
      1       11.600000       -1.050299 
      1       11.200000       -1.025636 
      1       10.740000       -1.102899 
      1       10.790000       -1.144212 
      1       10.610000       -1.133516 
      1       10.550000       -1.173423 
      1       10.280000       -1.232959 
      1       11.910000       -1.208000 
      1       26.780000       -1.160009 
      2       42.390000       -1.184693 
      2       66.230000       -1.282420 
      2       70.120000       -1.431173 
      2       71.850000       -1.476909 
      2       71.500000       -1.406563 
      2       71.310000       -1.382451 
      2       71.070000       -1.407916 
      2       70.950000       -1.430398 
      2       70.800000       -1.428116 
      2       70.690000       -1.462597 
      2       70.560000       -1.488123 
      3       70.520000       -1.428916 
      3       70.400000       -1.328960 
      3       70.790000       -1.187225 
      3       70.770000       -1.037568 
      3       70.820000       -0.874697 
      3       70.750000       -0.679816 
      3       70.650000       -0.530844 
      3       70.650000       -0.448019 
      3       70.690000       -0.398505 
      4       71.370000       -0.397289 
      4       71.500000       -0.409205 
      4       71.590000       -0.410227 
      4       71.540000       -0.324961 
      4       71.740000       -0.286146 
      4       77.280000       -0.381036 
      4       77.820000       -0.468464 
      4       77.800000       -0.502590 
      4       77.700000       -0.563027 
      4       77.580000       -0.618592 
      5       77.550000       -0.608816 
      5       77.540000       -0.562528 
      5       77.460000       -0.441653 
      5       77.450000       -0.328615 
      5       77.420000       -0.344851 
      5       77.430000       -0.380911 
      5       77.370000       -0.408041 
      5       77.260000       -0.390686 
      5       77.300000       -0.315239 
      5       77.400000       -0.228021 
      5       77.270000       -0.197355 
      5       77.310000       -0.181825 
      6       77.320000       -0.167289 
      6       77.260000       -0.151775 
      6       77.290000       -0.185173 
      6       77.720000       -0.190726 
      6       77.710000       -0.139423 
      6       77.790000       -0.072911 
      6       77.750000       -0.042096 
      6       77.800000       -0.023658 
      7       77.770000       -0.038898 
      7       77.670000       -0.054582 
      7       77.700000       -0.041985 
      7       77.670000       -0.040740 
      7       77.620000       -0.037513 
      7       77.790000       -0.042083 
      7       77.740000       -0.058599 
      7       77.800000       -0.131699 
      7       78.030000       -0.172409 
      7       79.850000       -0.092678 
      8       80.640000       -0.020574 
      8       80.720000       -0.034842 
      8       80.620000       -0.049666 
      8       80.700000       -0.028157 
      8       80.600000       -0.044700 
      8       80.550000       -0.078792 
      8       80.590000       -0.081880 
      8       80.490000       -0.064924 
      8       80.450000       -0.042469 
      8       80.440000       -0.037140 
      8       80.460000       -0.034859 
      8       80.300000       -0.097204 
      8       80.410000       -0.172383 
      8       80.480000       -0.126300 
      8       80.290000       -0.033986 
      9       80.260000       0.002338 
      9       80.350000       0.000539 
      9       80.440000       -0.038025 
      9       80.230000       -0.068410 
      9       80.320000       -0.043827 
      9       80.310000       -0.028130 
      9       80.300000       -0.049612 
      10       80.290000       -0.033056 
      10       80.230000       0.001466 
      10       80.320000       0.009510 
      10       80.250000       0.011365 
      10       80.290000       0.004997 
      10       80.220000       -0.012363 
      10       80.230000       -0.029498 
      10       80.250000       -0.012363 
      10       80.240000       0.004997 
      10       80.300000       0.011351 
      10       80.230000       0.009053 
      11       80.230000       -0.004363 
      11       80.190000       -0.062195 
      11       80.180000       -0.107848 
      11       80.270000       -0.062195 
      11       80.220000       -0.004363 
      11       80.200000       0.009067 
      11       80.280000       0.011794 
      11       80.270000       0.010395 
      12       80.180000       0.011808 
      12       80.180000       0.009510 
      12       80.230000       0.001036 
      12       80.160000       -0.037998 
      12       80.250000       -0.067954 
      12       80.040000       -0.037998 
      12       80.200000       0.001036 
      12       80.190000       0.009415 
      12       80.240000       0.011596 
      12       80.250000       0.010082 
      12       80.110000       0.011379 
      12       80.200000       0.009003 
      13       80.090000       0.000937 
      13       80.190000       -0.033223 
      13       80.120000       -0.048444 
      13       80.180000       -0.017318 
      13       80.260000       -0.000823 
      13       80.090000       -0.018440 
      13       80.000000       -0.063217 
      13       80.060000       -0.098806 
      13       80.000000       -0.101517 
      13       80.060000       -0.068436 
      14       80.100000       -0.066093 
      14       80.140000       -0.076874 
      14       79.900000       -0.072597 
      14       80.260000       -0.037694 
      14       80.240000       -0.016472 
      14       79.980000       -0.024323 
      14       80.220000       -0.017353 
      14       80.070000       -0.051907 
      14       80.070000       -0.131967 
      15       80.080000       -0.147186 
      15       80.150000       -0.060437 
      15       80.140000       0.004387 
      15       80.210000       0.021337 
      15       80.090000       0.021002 
      15       80.080000       0.022256 
      15       80.140000       0.020596 
      15       80.130000       0.021389 
      15       80.050000       0.014818 
      16       80.090000       -0.003380 
      16       80.180000       -0.030562 
      16       80.050000       -0.055844 
      16       80.100000       -0.092697 
      16       80.110000       -0.088535 
      16       80.030000       -0.052280 
      16       80.160000       -0.016170 
      16       80.110000       -0.030284 
      16       80.130000       -0.054280 
      16       80.070000       -0.023655 
      17       80.120000       0.014800 
      17       80.060000       0.017696 
      17       80.090000       -0.004148 
      17       80.090000       -0.044561 
      17       80.080000       -0.061301 
      17       80.030000       -0.043502 
      17       80.120000       -0.002587 
      17       80.100000       0.019944 
      17       80.090000       0.026075 
      17       80.090000       0.019510 
      18       80.090000       -0.002352 
      18       80.070000       -0.033408 
      18       80.140000       -0.017534 
      18       80.070000       0.016765 
      18       80.140000       0.023723 
      18       80.180000       0.015934 
      18       80.110000       -0.022856 
      18       79.930000       -0.052709 
      18       80.220000       -0.027432 
      18       80.020000       -0.007150 
      18       80.360000       -0.015081 
      18       79.880000       -0.006928 
      19       80.150000       -0.026866 
      19       80.100000       -0.051347 
      19       80.260000       -0.020752 
      19       79.830000       0.018113 
      19       80.220000       0.026320 
      19       79.890000       0.028332 
      19       80.170000       0.026651 
      19       79.980000       0.027809 
      19       80.150000       0.026080 
      19       80.050000       0.026379 
      19       80.090000       0.014466 
      19       80.020000       -0.025968 
      19       79.900000       -0.072329 
      20       80.200000       -0.040539 
      20       79.960000       0.012201 
      20       80.040000       0.020056 
      20       79.920000       0.003932 
      20       80.110000       -0.013045 
      20       80.100000       0.003625 
      20       80.090000       0.015868 
      20       79.990000       0.003430 
      21       80.030000       -0.013144 
      21       80.100000       0.003939 
      21       80.040000       0.020248 
      21       80.090000       0.016975 
      21       79.980000       -0.016945 
      21       80.210000       -0.033141 
      21       80.000000       -0.011143 
      21       79.970000       -0.022516 
      21       80.070000       -0.037831 
      21       80.000000       -0.029038 
      21       80.180000       -0.036737 
      21       79.960000       -0.016362 
      21       80.070000       0.008578 
      21       80.080000       -0.020739 
      22       80.020000       -0.049376 
      22       80.060000       -0.020051 
      22       79.970000       0.008955 
      22       80.050000       -0.020804 
      22       80.060000       -0.058814 
      22       80.070000       -0.061709 
      22       80.070000       -0.044756 
      23       80.050000       -0.027358 
      23       80.040000       -0.043623 
      23       80.020000       -0.055466 
      23       80.030000       -0.042606 
      23       80.100000       -0.024790 
      23       80.000000       -0.031680 
      23       80.000000       -0.010492 
      23       80.060000       0.023777 
      24       80.000000       0.026622 
      24       80.040000       0.010008 
      24       80.050000       -0.007030 
      24       80.000000       0.010005 
      24       80.090000       0.027091 
      24       80.020000       0.033150 
      24       80.020000       0.031820 
      24       79.990000       0.032939 
      24       80.080000       0.031186 
      25       80.110000       0.032298 
      25       80.030000       0.030537 
      25       80.070000       0.031218 
      25       80.050000       0.024163 
      25       80.050000       0.002241 
      25       80.010000       -0.028862 
      25       80.060000       -0.013033 
      25       79.980000       0.021221 
      25       80.080000       0.028134 
      25       80.020000       0.020276 
      25       80.020000       -0.019383 
      25       80.120000       -0.058245 
      26       80.070000       -0.060733 
      26       80.150000       -0.038472 
      26       79.990000       0.001941 
      26       80.060000       0.014201 
      26       80.030000       -0.021724 
      26       80.010000       -0.077102 
      26       79.980000       -0.078402 
      26       80.050000       -0.047140 
      27       80.020000       -0.024386 
      27       80.010000       -0.030855 
      27       79.930000       -0.009648 
      27       80.010000       0.025037 
      27       80.030000       0.032776 
      27       80.030000       0.034711 
      27       80.010000       0.032952 
      27       80.020000       0.033609 
      28       80.020000       0.026530 
      28       80.020000       0.004571 
      28       80.010000       -0.026994 
      28       79.980000       -0.016528 
      28       80.040000       -0.006155 
      28       80.030000       -0.037174 
      28       80.000000       -0.053150 
      28       80.020000       -0.035406 
      29       80.060000       0.005429 
      29       80.060000       0.027892 
      29       80.000000       0.034382 
      29       80.000000       0.033053 
      29       79.980000       0.034134 
      29       80.060000       0.031530 
      29       80.040000       0.023226 
      29       79.980000       -0.011582 
      29       80.030000       -0.031913 
      29       80.030000       -0.019124 
      29       79.990000       -0.012793 
      29       80.000000       0.009618 
      30       80.000000       0.027147 
      30       80.000000       0.033219 
      30       80.100000       0.031875 
      30       80.010000       0.032568 
      30       80.050000       0.025912 
      30       80.060000       0.008467 
      30       80.040000       -0.008582 
      30       80.030000       0.008468 
      31       79.990000       0.025569 
      31       80.020000       0.031644 
      31       80.000000       0.030329 
      31       80.010000       0.031463 
      31       80.000000       0.029724 
      31       79.990000       0.030851 
      31       80.010000       0.029119 
      31       80.020000       0.030251 
      31       79.970000       0.028525 
      31       79.990000       0.029663 
      31       80.020000       0.027930 
      32       80.050000       0.028649 
      32       80.010000       0.022032 
      32       80.040000       0.004626 
      32       80.010000       -0.012385 
      32       80.010000       0.004677 
      32       80.040000       0.020978 
      32       80.020000       0.017699 
      32       80.020000       -0.016203 
      32       80.030000       -0.031582 
      32       80.030000       -0.000624 
      33       80.030000       0.015743 
      33       80.000000       -0.000775 
      33       80.030000       -0.031409 
      33       80.000000       -0.015542 
      33       80.030000       0.018764 
      33       79.960000       0.026553 
      33       79.960000       0.028549 
      33       80.010000       0.026852 
      33       80.010000       0.027570 
      34       79.980000       0.020551 
      34       79.980000       -0.001334 
      34       80.050000       -0.032428 
      34       80.010000       -0.017401 
      34       80.000000       0.007522 
      34       79.970000       -0.017355 
      34       80.010000       -0.033586 
      34       80.060000       -0.021769 
      34       80.030000       -0.074311 
      34       80.000000       -0.128986 
      34       79.950000       -0.066534 
      34       79.930000       0.009570 
      35       80.020000       0.022330 
      35       80.080000       0.001291 
      35       80.030000       -0.039150 
      35       80.010000       -0.055944 
      35       79.970000       -0.038199 
      35       79.990000       0.002638 
      35       80.050000       0.024291 
      35       79.970000       0.021417 
      36       79.960000       -0.012508 
      36       80.040000       -0.027910 
      36       79.980000       0.003449 
      37       79.980000       0.025095 
      37       79.950000       0.031587 
      37       79.970000       0.030285 
      37       80.040000       0.031420 
      37       80.010000       0.029682 
      37       80.000000       0.030809 
      37       79.960000       0.029077 
      37       80.020000       0.030210 
      38       80.000000       0.028484 
      38       79.990000       0.029623 
      38       80.040000       0.027903 
      38       80.030000       0.029048 
      38       80.040000       0.027333 
      38       79.960000       0.028484 
      38       79.980000       0.026762 
      38       80.040000       0.027493 
      38       79.960000       0.020887 
      39       80.000000       0.003493 
      39       80.050000       -0.013507 
      39       80.040000       0.003593 
      39       80.010000       0.020730 
      39       80.050000       0.026427 
      39       79.990000       0.020258 
      39       80.010000       0.002882 
      40       80.020000       -0.014124 
      40       79.990000       0.002556 
      40       79.960000       0.014810 
      40       80.000000       0.002383 
      40       80.030000       -0.014180 
      40       80.030000       0.002939 
      40       80.020000       0.020096 
      40       80.010000       0.026225 
      40       80.040000       0.024965 
      40       79.960000       0.026152 
      41       80.040000       0.024467 
      41       80.020000       0.025646 
      41       79.950000       0.023952 
      41       80.010000       0.024711 
      41       80.010000       0.018134 
      41       80.030000       0.000766 
      41       79.990000       -0.016205 
      41       80.020000       0.000921 
      41       80.000000       0.018097 
      41       80.030000       0.024221 
      42       80.050000       0.022129 
      42       80.040000       0.013532 
      42       80.020000       -0.025247 
      42       80.020000       -0.054651 
      42       80.040000       -0.024448 
      42       80.020000       0.014440 
      42       79.980000       0.022684 
      42       80.020000       0.024706 
      42       80.030000       0.022210 
      42       80.000000       0.013600 
      42       79.980000       -0.025180 
      43       80.010000       -0.054611 
      43       80.040000       -0.025260 
      43       79.980000       0.003824 
      43       80.030000       -0.025045 
      43       80.040000       -0.053600 
      43       80.000000       -0.023382 
      43       80.040000       0.015496 
      43       80.030000       0.023730 
      43       79.980000       0.025768 
      43       79.950000       0.024112 
      43       80.060000       0.025296 
      43       80.000000       0.023619 
      44       79.990000       0.024806 
      44       80.020000       0.023134 
      44       79.990000       0.024301 
      44       80.010000       0.021796 
      44       80.010000       0.013601 
      44       79.960000       -0.020685 
      44       79.940000       -0.036031 
      44       79.990000       -0.005029 
      44       80.080000       0.011382 
      45       80.010000       -0.005106 
      45       79.970000       -0.036135 
      45       80.020000       -0.025540 
      45       80.000000       -0.014238 
      45       80.010000       -0.035802 
      45       79.970000       -0.019917 
      45       80.040000       0.004646 
      45       80.030000       -0.024657 
      45       79.970000       -0.053655 
      45       80.000000       -0.028342 
      46       80.010000       -0.008024 
      46       80.040000       -0.015095 
      46       79.960000       0.002871 
      46       80.020000       0.020054 
      46       79.990000       0.026184 
      46       79.960000       0.024924 
      46       80.000000       0.026085 
      46       80.000000       0.023550 
      46       80.010000       0.014925 
      46       79.990000       -0.023868 
      46       80.020000       -0.053286 
      47       80.000000       -0.023096 
      47       79.980000       0.015778 
      47       80.010000       0.023996 
      47       80.010000       0.025593 
      47       80.010000       0.018620 
      47       80.020000       -0.003246 
      47       80.020000       -0.034333 
      47       80.000000       -0.019726 
      47       79.980000       -0.000098 
      48       80.030000       -0.047951 
      48       79.930000       -0.091856 
      48       80.010000       -0.046553 
      48       80.000000       0.001767 
      48       80.030000       -0.017682 
      48       80.000000       -0.031769 
      48       79.970000       -0.000332 
      48       80.040000       0.021339 
      48       79.980000       0.027430 
      48       80.030000       0.020851 
      49       79.980000       -0.001024 
      49       79.990000       -0.032094 
      49       80.000000       -0.016233 
      49       79.990000       0.018080 
      49       80.010000       0.025875 
      49       79.960000       0.027878 
      49       80.060000       0.026188 
      49       79.940000       0.026912 
      50       80.010000       0.019874 
      50       79.910000       -0.002843 
      50       79.990000       -0.043295 
      50       80.020000       -0.060048 
      50       80.010000       -0.042262 
      50       80.030000       -0.001358 
      50       79.970000       0.021173 
      50       80.010000       0.027730 
      50       79.980000       0.026468 
      50       79.970000       0.027640 
      50       80.010000       0.025940 
      51       80.000000       0.027105 
      51       79.990000       0.025410 
      51       79.990000       0.026579 
      51       80.010000       0.024876 
      51       80.000000       0.025613 
      51       80.030000       0.018614 
      51       79.980000       -0.003252 
      51       80.000000       -0.034300 
      51       79.960000       -0.018417 
      51       79.960000       0.015918 
      52       79.950000       0.023735 
      52       80.060000       0.025759 
      52       79.970000       0.024104 
      52       80.080000       0.025261 
      52       80.030000       0.022746 
      52       79.940000       0.014542 
      52       80.010000       -0.019779 
      52       80.020000       -0.035960 
      52       79.990000       -0.013947 
      53       80.050000       -0.025731 
      53       79.960000       -0.046359 
      53       80.010000       -0.061409 
      53       80.020000       -0.107402 
      53       80.050000       -0.099585 
      53       80.020000       -0.031275 
      53       80.030000       0.017482 
      53       80.030000       0.025696 
      54       79.980000       0.017927 
      54       80.030000       -0.020883 
      54       80.020000       -0.050769 
      54       80.040000       -0.025963 
      54       80.040000       -0.011440 
      54       80.040000       -0.047312 
      54       80.060000       -0.086278 
      54       80.090000       -0.097859 
      54       80.080000       -0.042297 
      54       80.060000       0.015793 
      54       79.960000       0.024036 
      55       80.010000       0.007448 
      55       80.040000       -0.014897 
      55       80.010000       -0.021725 
      55       80.000000       -0.043378 
      55       80.030000       -0.055250 
      55       80.060000       -0.037924 
      55       80.000000       -0.006452 
      55       80.010000       -0.016595 
      56       80.050000       -0.026625 
      56       80.060000       0.005161 
      56       80.040000       0.026802 
      56       80.050000       0.033277 
      56       80.010000       0.031959 
      56       80.020000       0.033050 
      56       80.000000       0.030458 
      56       80.020000       0.022164 
      56       79.850000       -0.012633 
      56       80.170000       -0.032954 
      57       79.960000       -0.020154 
      57       80.080000       -0.013813 
      57       80.070000       0.008609 
      57       80.000000       0.026147 
      57       80.030000       0.032229 
      57       80.040000       0.030909 
      57       80.030000       0.032037 
      57       80.030000       0.030292 
      57       80.040000       0.031413 
      57       80.050000       0.029675 
      58       80.030000       0.030802 
      58       80.040000       0.029057 
      58       80.050000       0.029752 
      58       80.040000       0.022711 
      58       80.070000       0.000791 
      58       79.980000       -0.030722 
      58       80.060000       -0.019782 
      58       80.080000       -0.004070 
      58       79.990000       -0.012444 
      59       80.090000       -0.004330 
      59       79.970000       -0.024295 
      59       80.080000       -0.048802 
      59       80.030000       -0.018245 
      59       80.030000       0.020169 
      59       80.010000       0.023450 
      59       80.000000       0.006880 
      59       79.960000       -0.010127 
      59       80.140000       0.006913 
      59       79.970000       0.023192 
      60       80.070000       0.019890 
      60       80.000000       -0.014033 
      60       80.080000       -0.029420 
      60       79.980000       0.001955 
      60       80.060000       0.023615 
      60       80.060000       0.030122 
      60       80.040000       0.028835 
      60       80.060000       0.029984 
      60       80.010000       0.028247 
      61       80.040000       0.028963 
