

 time    ||    gripping force   ||   raspberry measurement 

      0       30.510000       -794.043590 
      0       28.290000       -794.043590 
      0       24.500000       -794.043590 
      0       21.590000       -794.043590 
      0       19.770000       -794.043590 
      1       15.000000       -786.103154 
      1       14.630000       -778.242122 
      1       14.160000       -770.459701 
      1       13.450000       -762.755104 
      1       13.100000       -755.127548 
      1       12.430000       -747.575104 
      1       12.070000       -739.994154 
      2       11.340000       -736.475253 
      2       11.330000       -693.605996 
      2       11.430000       -501.476298 
      2       11.490000       -184.697760 
      3       16.890000       7.437724 
      3       19.430000       50.271639 
      4       21.040000       53.751506 
      4       21.090000       53.854653 
      4       21.110000       53.876872 
      4       21.070000       53.908245 
      4       21.510000       53.892547 
      4       22.180000       53.858052 
      5       22.600000       53.849996 
      5       22.630000       53.847711 
      5       23.410000       53.849123 
      5       23.900000       53.847711 
      5       25.510000       53.850009 
      5       26.090000       53.858509 
      6       27.800000       53.898403 
      6       28.330000       53.938298 
      6       28.770000       53.946797 
      6       28.880000       53.949096 
      7       28.960000       53.947684 
      7       28.950000       53.949122 
      7       28.910000       53.947684 
      7       28.870000       53.949122 
      7       28.900000       53.947684 
      8       28.830000       53.949122 
      8       28.820000       53.947684 
      8       28.840000       53.949096 
      8       28.810000       53.946798 
      9       29.170000       53.938324 
      9       29.210000       53.899290 
      9       29.440000       53.869307 
      9       29.380000       53.898404 
      9       29.410000       53.927526 
      9       29.390000       53.898430 
      9       29.420000       53.870180 
      10       29.400000       53.909658 
      10       29.460000       53.981749 
      10       29.350000       54.007358 
      10       29.430000       53.976824 
      10       29.400000       53.954951 
      11       29.420000       53.948141 
      11       29.380000       53.949136 
      11       29.320000       53.947684 
      11       29.380000       53.949122 
      11       29.350000       53.947684 
      11       29.330000       53.949122 
      12       29.360000       53.947684 
      12       29.350000       53.949096 
      12       29.390000       53.946798 
      12       29.340000       53.938324 
      12       29.330000       53.899290 
      13       29.360000       53.869307 
      13       29.330000       53.898404 
      13       29.300000       53.927526 
      13       29.300000       53.898404 
      13       29.350000       53.869307 
      13       29.280000       53.899290 
      13       29.330000       53.938324 
      13       29.310000       53.946784 
      13       29.330000       53.948666 
      13       29.320000       53.942728 
      13       29.300000       53.930324 
      13       29.340000       53.931987 
      14       29.340000       53.964833 
      14       29.340000       53.966925 
      14       29.380000       53.959477 
      15       30.030000       53.972311 
      15       30.660000       53.989003 
      15       30.970000       53.970995 
      15       31.180000       53.943697 
      15       31.310000       53.898860 
      15       31.280000       53.858979 
      16       31.270000       53.855865 
      16       31.200000       53.877764 
      16       31.200000       53.919070 
      16       31.160000       53.941815 
      16       31.240000       53.948209 
      16       31.210000       53.941842 
      16       31.220000       53.919956 
      16       31.230000       53.888562 
      17       31.180000       53.904259 
      17       31.230000       53.938754 
      18       31.140000       53.946811 
      18       31.170000       53.949096 
      18       31.190000       53.947684 
      18       31.200000       53.949136 
      18       31.160000       53.948141 
      18       31.160000       53.954952 
      18       31.110000       53.976850 
      19       31.190000       54.008231 
      19       31.130000       53.992091 
      19       31.100000       53.952223 
      19       31.170000       53.920829 
      20       31.160000       53.888589 
      20       31.180000       53.904259 
      20       31.160000       53.938754 
      20       31.180000       53.946811 
      20       31.130000       53.949096 
      20       31.120000       53.947683 
      21       31.100000       53.949096 
      21       31.130000       53.946811 
      21       31.130000       53.938754 
      21       31.110000       53.904259 
      21       31.110000       53.888562 
      21       31.060000       53.919956 
      21       31.080000       53.941855 
      21       31.090000       53.948666 
      21       31.080000       53.947671 
      21       31.050000       53.949122 
      21       31.100000       53.947684 
      22       31.130000       53.949122 
      22       31.120000       53.947684 
      22       31.150000       53.949136 
      22       31.120000       53.948141 
      22       31.130000       53.954951 
      23       31.100000       53.976824 
      23       31.090000       54.007385 
      23       31.130000       53.982636 
      23       31.130000       53.920456 
      23       31.110000       53.918601 
      24       31.100000       53.979105 
      24       31.110000       53.986719 
      24       31.100000       53.957596 
      24       31.100000       53.949982 
      25       31.130000       53.947711 
      25       31.090000       53.949123 
      26       31.060000       53.947684 
      26       31.040000       53.949122 
      26       31.120000       53.947684 
      26       31.070000       53.949122 
      26       31.090000       53.947684 
      26       31.080000       53.949122 
      26       31.040000       53.947684 
      26       31.110000       53.949122 
      27       31.000000       53.947684 
      27       31.030000       53.949122 
      27       31.160000       53.947684 
      27       31.080000       53.949122 
      27       31.080000       53.947684 
      27       31.030000       53.949122 
      27       31.100000       53.947684 
      27       31.050000       53.949122 
      27       31.090000       53.947684 
      28       31.030000       53.949122 
      28       31.130000       53.947684 
      28       31.070000       53.949122 
      28       31.060000       53.947684 
      28       31.080000       53.949122 
      28       31.050000       53.947684 
      28       31.050000       53.949122 
      29       31.070000       53.947684 
      29       31.060000       53.949122 
      29       31.100000       53.947684 
      29       31.010000       53.949122 
      29       31.080000       53.947684 
      29       31.060000       53.949122 
      30       31.010000       53.947684 
      30       31.100000       53.949096 
      30       31.050000       53.946798 
      30       31.070000       53.938324 
      30       31.070000       53.899290 
      31       31.030000       53.869307 
      31       31.040000       53.898404 
      31       31.090000       53.927539 
      31       31.020000       53.898833 
      31       31.100000       53.874250 
      32       31.060000       53.917658 
      32       31.060000       53.949052 
      32       31.110000       53.911873 
      32       31.080000       53.909631 
      32       31.080000       53.939197 
      33       31.060000       53.946824 
      33       31.090000       53.949096 
      33       31.070000       53.947670 
      34       31.020000       53.948666 
      34       31.050000       53.941828 
      34       31.010000       53.919070 
      34       31.040000       53.877764 
      35       31.010000       53.855865 
      35       30.990000       53.858966 
      35       31.070000       53.898417 
      35       31.010000       53.938271 
      36       31.040000       53.945911 
      36       31.030000       53.938271 
      37       31.040000       53.898403 
      37       31.070000       53.858536 
      37       31.080000       53.850896 
      37       31.100000       53.858536 
      37       31.040000       53.898403 
      38       31.060000       53.938271 
      38       31.040000       53.945911 
      38       31.070000       53.938298 
      39       31.050000       53.899290 
      39       31.050000       53.869348 
      39       31.040000       53.899746 
      39       31.010000       53.944153 
      39       31.020000       53.975964 
      39       31.010000       54.008218 
      39       31.020000       53.992547 
      39       31.020000       53.958052 
      40       31.040000       53.949996 
      40       31.070000       53.947711 
      40       31.060000       53.949123 
      40       31.020000       53.947684 
      40       31.040000       53.949122 
      40       31.020000       53.947684 
      40       31.040000       53.949122 
      40       31.030000       53.947684 
      40       31.000000       53.949096 
      41       31.060000       53.946798 
      41       31.030000       53.938324 
      41       31.030000       53.899290 
      41       31.060000       53.869334 
      41       30.990000       53.899290 
      41       31.080000       53.938324 
      41       31.060000       53.946798 
      41       31.050000       53.949096 
      41       31.010000       53.947684 
      41       31.030000       53.949122 
      41       31.030000       53.947684 
      41       31.030000       53.949122 
      42       31.000000       53.947684 
      42       31.010000       53.949122 
      42       31.060000       53.947684 
      42       31.030000       53.949136 
      43       30.970000       53.948114 
      43       30.950000       53.954078 
      43       31.020000       53.966482 
      43       31.050000       53.964820 
      43       30.980000       53.931987 
      43       30.880000       53.930324 
      43       30.810000       53.942715 
      44       30.770000       53.948236 
      44       30.730000       53.941815 
      44       30.780000       53.919070 
      44       30.680000       53.877777 
      44       30.620000       53.856308 
      44       30.580000       53.864365 
      44       30.570000       53.922614 
      44       30.500000       53.978192 
      44       30.520000       53.970994 
      45       30.450000       53.954495 
      45       30.440000       53.948154 
      45       30.490000       53.950009 
      45       30.540000       53.958052 
      45       30.490000       53.992534 
      45       30.500000       54.007788 
      46       30.440000       53.971022 
      46       30.430000       53.925812 
      46       30.430000       53.889891 
      46       30.500000       53.914641 
      46       30.490000       53.982179 
      46       30.480000       54.007345 
      47       30.450000       53.975937 
      47       30.510000       53.944153 
      47       30.470000       53.899746 
      47       30.460000       53.869348 
      47       30.440000       53.899290 
      47       30.450000       53.938338 
      47       30.460000       53.947241 
      47       30.480000       53.954508 
      48       30.510000       53.972324 
      48       30.440000       53.994416 
      48       30.510000       53.996078 
      48       30.480000       53.994416 
      48       30.530000       53.972324 
      48       30.470000       53.954535 
      49       30.480000       53.948127 
      49       30.450000       53.949136 
      49       30.480000       53.947684 
      49       30.500000       53.949096 
      49       30.470000       53.946798 
      49       30.480000       53.938324 
      49       30.450000       53.899290 
      50       30.440000       53.869334 
      50       30.510000       53.899290 
      50       30.510000       53.938338 
      50       30.490000       53.947241 
      50       30.510000       53.954508 
      50       30.520000       53.972337 
      51       30.510000       53.994846 
      51       30.380000       54.001047 
      51       30.450000       54.013644 
      51       30.450000       53.992991 
      51       30.490000       53.958066 
      51       30.450000       53.949996 
      52       30.490000       53.947711 
      52       30.460000       53.949123 
      52       30.450000       53.947684 
      52       30.480000       53.949122 
      52       30.420000       53.947684 
      52       30.480000       53.949122 
      52       30.460000       53.947684 
      52       30.420000       53.949122 
      52       30.450000       53.947684 
      52       30.430000       53.949136 
      52       30.470000       53.948127 
      52       30.490000       53.954522 
      53       30.500000       53.971881 
      53       30.480000       53.989017 
      53       30.500000       53.971881 
      53       30.470000       53.954522 
      54       30.520000       53.948127 
      54       30.500000       53.949136 
      54       30.470000       53.947684 
      54       30.480000       53.949096 
      54       30.420000       53.946798 
      54       30.480000       53.938324 
      55       30.450000       53.899290 
      55       30.480000       53.869334 
      56       30.450000       53.899290 
      56       30.510000       53.938324 
      56       30.450000       53.946798 
      56       30.440000       53.949096 
      56       30.480000       53.947684 
      56       30.530000       53.949122 
      57       30.460000       53.947684 
      57       30.480000       53.949122 
      57       30.430000       53.947684 
      57       30.520000       53.949122 
      57       30.520000       53.947684 
      58       30.460000       53.949122 
      58       30.490000       53.947684 
      58       30.470000       53.949096 
      60       30.420000       53.946797 
      60       30.410000       53.938298 
