

 time    ||    gripping force   ||   raspberry measurement 

      0       0.110000       -802.407843 
      0       0.080000       -802.407843 
      0       0.040000       -802.407843 
      0       0.100000       -802.407843 
      0       0.100000       -802.407843 
      0       0.120000       -802.407843 
      0       0.060000       -802.407843 
      0       0.120000       -802.407843 
      0       0.110000       -802.407843 
      0       0.100000       -802.407843 
      0       0.080000       -802.407843 
      0       0.130000       -802.407843 
      0       0.120000       -802.407843 
      0       0.040000       -802.407843 
      0       0.240000       -802.407843 
      0       0.020000       -802.407843 
      0       0.170000       -802.407843 
      0       0.270000       -802.407838 
      0       0.430000       -802.407838 
      0       0.710000       -802.407838 
      0       0.500000       -802.407838 
      0       0.510000       -802.406646 
      1       0.010000       -794.276308 
      1       0.350000       -790.721535 
      1       0.040000       -790.721535 
      1       0.060000       -747.415811 
      1       0.290000       -747.415811 
      1       0.150000       -553.336062 
      1       0.010000       -233.363687 
      1       0.260000       -39.299635 
      1       0.120000       4.002988 
      1       0.080000       7.555906 
      1       0.120000       7.664676 
      1       0.140000       7.664430 
      1       0.160000       7.664430 
      1       0.290000       7.664430 
      1       0.360000       7.664430 
      2       0.480000       7.665887 
      2       0.490000       7.664891 
      2       0.460000       7.671702 
      2       0.310000       7.671702 
      2       0.520000       7.693601 
      2       0.650000       7.724996 
      2       0.470000       7.724996 
      2       9.440000       7.709298 
      2       18.840000       7.674803 
      2       43.440000       7.666746 
      2       56.790000       7.666746 
      2       63.320000       7.664462 
      2       81.740000       7.665874 
      2       89.570000       7.665874 
      2       104.690000       7.664435 
      2       113.830000       7.664435 
      2       113.330000       7.664435 
      3       112.190000       7.664435 
      3       107.640000       7.664435 
      3       92.790000       7.665887 
      3       72.240000       7.664892 
      3       51.660000       7.671729 
      3       34.320000       7.694474 
      3       24.240000       7.735378 
      3       18.470000       7.753208 
      3       17.970000       7.742174 
      3       18.570000       7.737663 
      3       18.760000       7.821178 
      3       18.850000       8.012634 
      3       18.930000       8.012634 
      3       18.980000       8.012634 
      3       19.030000       8.287881 
      3       19.030000       8.287881 
      4       19.040000       8.578376 
      4       19.410000       8.578376 
      4       19.560000       8.909621 
      4       19.820000       9.265927 
      4       19.870000       9.357729 
      4       20.100000       9.098820 
      4       20.200000       8.750971 
      4       20.080000       8.498182 
      4       20.060000       8.282040 
      4       20.030000       8.062856 
      4       20.050000       7.918396 
      4       20.090000       7.873584 
      4       20.210000       7.865429 
      4       20.370000       7.872630 
      4       20.800000       7.905339 
      5       21.060000       7.985947 
      5       21.300000       8.058648 
      5       21.610000       8.094859 
      5       21.650000       8.094859 
      5       21.660000       8.094859 
      5       21.690000       8.068114 
      5       21.650000       7.975651 
      5       21.660000       7.975651 
      5       21.930000       8.003667 
      5       22.390000       8.125741 
      5       22.650000       8.144249 
      5       22.710000       8.017426 
      5       22.650000       7.958234 
      5       22.510000       7.958234 
      5       22.270000       7.965419 
      6       22.140000       7.985155 
      6       21.520000       8.056861 
      6       21.260000       8.030312 
      6       20.930000       8.030312 
      6       20.760000       8.030312 
      6       20.560000       7.990628 
      6       20.320000       7.990628 
      6       20.200000       8.080092 
      6       20.070000       8.142850 
      6       19.950000       8.067188 
      6       19.900000       7.981505 
      6       19.770000       7.948875 
      6       19.810000       7.948875 
      6       19.750000       7.948875 
      6       19.790000       7.949235 
      7       19.760000       7.986970 
      7       19.810000       8.007457 
      7       19.740000       8.011597 
      7       19.790000       7.999430 
      7       19.730000       7.999430 
      7       19.860000       8.014737 
      7       19.840000       8.014737 
      7       19.820000       8.026299 
      7       19.710000       8.003539 
      7       19.800000       8.003539 
      7       19.840000       8.009715 
      7       19.750000       8.009715 
      7       19.800000       8.000825 
      7       19.820000       7.948778 
      7       19.760000       7.929124 
      8       19.790000       7.948335 
      8       19.840000       7.995426 
      8       19.790000       7.985505 
      8       19.830000       7.963202 
      8       19.830000       7.963202 
      8       19.800000       7.963202 
      8       19.820000       7.963202 
      8       19.840000       7.996716 
      8       19.690000       7.985558 
      8       19.840000       7.963632 
      8       19.840000       8.001645 
      8       19.870000       8.003482 
      8       19.840000       7.968948 
      8       19.810000       7.968948 
      8       19.740000       7.942093 
      8       19.810000       7.919168 
      9       19.780000       7.917440 
      9       19.760000       7.917826 
      9       19.800000       7.925492 
      9       19.860000       7.892274 
      9       19.860000       7.875370 
      9       19.770000       7.956822 
      9       19.790000       7.956822 
      9       19.820000       7.956822 
      9       19.850000       7.956822 
      9       19.810000       8.025022 
      9       19.790000       8.046911 
      9       19.720000       8.080161 
      9       19.790000       8.066149 
      9       19.790000       7.987440 
      9       19.750000       7.896788 
      10       19.840000       7.896788 
      10       19.790000       7.913480 
      10       19.860000       7.998957 
      10       19.750000       8.042921 
      10       19.710000       8.042921 
      10       19.770000       8.014255 
      10       19.840000       7.976146 
      10       19.750000       7.978431 
      10       19.770000       8.023198 
      10       19.800000       8.088214 
      10       19.820000       8.088214 
      10       19.830000       8.063008 
      10       19.810000       8.063008 
      10       19.780000       8.063008 
      10       19.820000       8.063008 
      11       19.790000       7.960518 
      11       19.790000       7.906199 
      11       19.800000       7.908011 
      11       19.740000       7.899055 
      11       19.920000       7.915182 
      11       19.810000       7.932208 
      11       19.830000       7.935379 
      11       20.050000       7.935379 
      11       20.010000       7.935379 
      11       20.130000       8.001768 
      11       20.120000       8.099333 
      11       20.220000       8.157774 
      11       20.290000       8.157774 
      11       20.290000       8.157774 
      11       20.220000       8.171038 
      12       20.390000       8.126850 
      12       20.620000       8.126850 
      12       20.660000       8.033484 
      12       20.660000       8.004094 
      12       20.640000       8.009244 
      12       20.670000       8.016633 
      12       20.690000       8.019545 
      12       20.650000       8.019545 
      12       20.670000       8.046189 
      12       20.620000       8.077820 
      12       20.610000       8.077820 
      12       20.410000       8.081100 
      12       20.310000       8.047838 
      12       20.330000       8.036237 
      12       20.200000       8.009795 
      13       20.090000       7.970748 
      13       20.060000       7.958331 
      13       20.050000       7.992660 
      13       20.000000       7.992660 
      13       19.870000       7.992660 
      13       19.860000       8.048444 
      13       19.810000       8.046869 
      13       19.770000       8.046869 
      13       19.820000       8.078030 
      13       19.830000       8.125784 
      13       19.750000       8.125784 
      13       19.800000       8.134850 
      13       19.820000       8.134850 
      13       19.820000       8.050110 
      13       19.810000       7.988756 
      14       19.810000       7.994528 
      14       19.760000       7.954177 
      14       19.820000       7.960089 
      14       19.820000       8.010102 
      14       19.880000       7.984295 
      14       19.820000       7.984295 
      14       19.870000       7.984295 
      14       19.880000       7.984295 
      14       19.850000       7.984295 
      14       19.820000       7.936226 
      14       19.800000       7.959203 
      14       19.820000       8.037510 
      14       19.870000       8.115166 
      14       19.820000       8.107000 
      14       19.800000       8.107000 
      15       19.800000       8.107000 
      15       19.790000       8.107000 
      15       19.860000       8.077518 
      15       19.830000       8.080632 
      15       20.000000       8.080632 
      15       20.040000       8.128123 
      15       19.980000       8.140706 
      15       20.030000       8.140706 
      15       20.010000       8.078360 
      15       20.020000       8.058720 
      15       20.010000       8.058720 
      15       19.970000       8.088645 
      15       20.040000       8.118750 
      15       19.970000       8.080119 
      15       20.080000       8.015681 
      15       20.080000       8.021870 
      16       20.080000       8.055075 
      16       20.170000       8.057706 
      16       20.160000       8.035754 
      16       20.210000       7.993158 
      16       20.180000       7.955505 
      16       20.110000       7.891441 
      16       20.180000       7.836279 
      16       20.130000       7.853831 
      16       20.140000       7.913756 
      16       20.140000       7.980684 
      16       20.100000       8.007403 
      16       20.140000       8.016122 
      16       20.150000       8.013716 
      16       20.080000       8.017049 
      16       20.150000       8.019571 
      17       20.080000       8.046592 
      17       20.140000       8.081876 
      17       20.130000       8.088671 
      17       20.160000       8.088671 
      17       20.110000       8.010198 
      17       20.120000       7.922410 
      17       20.140000       7.932709 
      17       20.140000       7.999024 
      17       20.110000       8.025909 
      17       20.120000       8.025909 
      17       20.040000       8.015615 
      17       20.130000       8.073930 
      17       20.140000       8.149995 
      17       20.140000       8.118767 
      17       20.120000       8.082820 
      18       20.050000       8.082820 
      18       20.040000       8.092741 
      18       19.920000       8.092741 
      18       19.980000       8.037966 
      18       19.980000       7.987510 
      18       19.900000       7.987510 
      18       19.830000       7.990848 
      18       19.960000       7.990848 
      18       19.920000       8.016566 
      18       19.940000       8.016566 
      18       19.930000       8.035710 
      18       19.910000       8.035280 
      18       19.930000       8.035280 
      18       19.970000       7.945167 
      18       19.980000       7.945167 
      19       19.960000       7.869555 
      19       19.970000       7.874788 
      19       19.990000       7.862788 
      19       19.950000       7.923282 
      19       19.920000       8.070192 
      19       19.960000       8.085929 
      19       19.940000       8.009342 
      19       19.940000       8.009342 
      19       19.890000       7.978834 
      19       19.950000       7.994111 
      19       19.960000       7.994111 
      19       19.970000       8.025453 
      19       19.960000       8.014711 
      19       19.990000       7.999430 
      19       19.950000       7.999430 
      20       19.930000       8.011610 
      20       19.990000       8.011610 
      20       19.930000       8.007940 
      20       19.990000       7.993698 
      20       19.950000       7.989562 
      20       19.870000       8.059118 
      20       19.930000       8.097530 
      20       19.950000       8.014308 
      20       19.950000       7.923283 
      20       19.960000       7.938980 
      20       19.980000       8.033079 
      20       19.950000       8.101573 
      20       19.940000       8.047850 
      20       19.970000       7.929980 
      20       19.950000       7.861446 
      21       19.990000       7.871732 
      21       19.920000       7.984296 
      21       19.940000       8.074662 
      21       19.920000       8.074662 
      21       19.920000       8.060021 
      21       19.930000       8.087319 
      21       19.950000       8.164792 
      21       19.890000       8.097171 
      21       19.920000       8.097171 
      21       19.970000       7.969488 
      21       19.920000       7.920568 
      21       19.960000       7.906239 
      21       19.870000       7.906239 
      21       19.950000       7.949291 
      21       19.950000       8.008798 
      22       19.960000       8.008798 
      22       20.000000       8.008798 
      22       19.880000       7.979689 
      22       19.980000       7.920610 
      22       19.920000       7.940681 
      22       20.010000       7.940681 
      22       20.050000       7.971242 
      22       19.950000       7.948295 
      22       19.970000       7.951992 
      22       20.000000       7.977860 
      22       19.980000       7.976615 
      22       19.980000       7.934909 
      22       20.000000       7.951036 
      22       19.960000       8.000785 
      22       19.980000       8.006140 
      23       19.940000       7.981961 
      23       19.970000       7.981961 
      23       19.990000       7.981961 
      23       20.000000       7.929510 
      23       19.970000       7.921024 
      23       19.980000       7.931778 
      23       20.010000       7.924595 
      23       19.990000       7.953375 
      23       19.940000       8.019571 
      23       19.990000       8.110294 
      23       20.040000       8.171964 
      23       19.910000       8.186459 
      23       20.050000       8.176990 
      23       20.050000       8.195372 
      23       20.010000       8.155035 
      23       20.040000       8.082873 
      24       20.060000       8.058207 
      24       20.060000       8.012923 
      24       20.040000       7.967204 
      24       20.030000       7.932252 
      24       20.030000       7.932252 
      24       20.100000       7.932252 
      24       20.040000       7.948362 
      24       20.040000       7.993225 
      24       20.010000       7.993225 
      24       20.020000       7.979207 
      24       20.060000       8.015737 
      24       20.010000       8.101946 
      24       20.070000       8.090955 
      24       20.090000       7.996746 
      24       20.030000       7.996746 
      25       20.020000       7.988312 
      25       20.080000       7.976533 
      25       20.030000       7.976533 
      25       20.040000       7.944432 
      25       20.070000       7.944432 
      25       20.040000       7.985975 
      25       19.990000       8.020549 
      25       20.070000       8.020549 
      25       20.030000       8.005286 
      25       20.060000       8.036280 
      25       20.050000       8.117271 
      25       19.990000       8.133977 
      25       20.090000       8.048254 
      25       20.020000       7.987900 
      25       20.050000       7.984159 
      26       20.080000       7.976642 
      26       20.020000       7.929484 
      26       20.010000       7.925536 
      26       20.060000       7.945567 
      26       20.040000       7.919694 
      26       20.080000       7.919694 
      26       20.060000       7.899431 
      26       20.040000       7.906654 
      26       20.080000       7.888659 
      26       20.020000       7.871273 
      26       20.080000       7.864878 
      26       20.050000       7.865860 
      26       20.080000       7.863562 
      26       20.020000       7.855492 
      26       20.050000       7.855492 
      27       20.020000       7.820580 
      27       20.080000       7.800344 
      27       20.050000       7.817480 
      27       20.010000       7.837966 
      27       20.160000       7.862773 
      27       20.040000       7.862773 
      27       20.050000       7.873405 
      27       19.990000       7.917492 
      27       20.020000       7.965308 
      27       20.020000       8.024650 
      27       20.020000       8.098930 
      27       20.050000       8.130824 
      27       20.020000       8.133539 
      27       20.040000       8.179191 
      27       20.010000       8.188630 
      28       20.070000       8.111526 
      28       20.010000       8.018313 
      28       20.080000       8.018313 
      28       20.060000       7.935876 
      28       20.060000       7.922837 
      28       20.010000       7.922837 
      28       20.080000       7.948419 
      28       20.090000       8.002128 
      28       20.040000       8.002128 
      28       20.020000       8.091345 
      28       20.100000       8.091345 
      28       20.030000       8.100257 
      28       19.980000       8.059978 
      28       20.060000       7.996785 
      28       20.060000       7.996785 
      28       20.030000       7.954593 
      29       20.040000       7.962290 
      29       20.030000       7.950036 
      29       20.040000       7.897779 
      29       20.010000       7.792759 
      29       20.010000       7.796095 
      29       20.030000       7.796095 
      29       20.080000       7.964865 
      29       20.020000       8.140647 
      29       20.020000       8.155783 
      29       20.030000       8.060021 
      29       20.030000       8.060021 
      29       20.110000       8.006185 
      29       20.030000       8.008024 
      29       19.980000       7.999471 
      29       20.020000       8.019667 
      30       19.910000       8.044666 
      30       19.940000       8.014241 
      30       19.940000       7.973890 
      30       19.860000       7.950106 
      30       19.900000       7.886001 
      30       19.830000       7.815695 
      30       19.890000       7.816524 
      30       19.890000       7.816524 
      30       19.900000       7.832195 
      30       19.830000       7.833594 
      30       19.890000       7.879729 
      30       19.930000       7.897185 
      30       19.890000       7.875317 
      30       19.910000       7.950163 
      30       19.890000       8.049995 
      31       19.880000       8.042547 
      31       19.900000       8.023601 
      31       19.900000       8.023601 
      31       19.880000       8.028180 
      31       19.900000       8.028180 
      31       19.860000       7.997212 
      31       19.910000       7.993712 
      31       19.900000       8.000760 
      31       19.930000       8.000760 
      31       19.880000       8.048873 
      31       19.910000       8.109631 
      31       19.920000       8.089184 
      31       19.880000       8.053667 
      31       19.900000       8.057816 
      31       19.850000       8.057816 
      31       19.890000       8.057816 
      32       19.880000       8.038409 
      32       19.900000       8.038409 
      32       19.850000       8.038409 
      32       19.920000       8.027834 
      32       19.850000       8.043755 
      32       19.910000       8.080698 
      32       19.970000       8.077861 
      32       19.960000       8.047975 
      32       20.030000       8.041597 
      32       20.050000       8.119224 
      32       19.990000       8.197100 
      32       20.040000       8.197100 
      32       19.970000       8.197100 
      32       20.050000       8.149206 
      32       19.990000       8.149206 
      33       20.050000       8.051550 
      33       19.960000       8.057791 
      33       20.050000       8.125935 
      33       20.050000       8.157707 
      33       20.010000       8.164961 
      33       20.020000       8.159478 
      33       20.000000       8.147478 
      33       20.030000       8.152821 
      33       20.010000       8.190000 
      33       20.080000       8.155478 
      33       20.050000       8.093685 
      33       20.040000       8.107541 
      33       19.970000       8.105269 
      33       20.020000       8.105269 
      34       20.040000       8.085212 
      34       20.010000       8.116430 
      34       20.040000       8.159587 
      34       20.040000       8.176920 
      34       20.000000       8.176920 
      34       19.950000       8.176920 
      34       20.040000       8.156434 
      34       20.040000       8.097172 
      34       19.990000       8.064089 
      34       20.040000       8.029994 
      34       19.980000       8.029994 
      34       20.050000       8.045691 
      34       20.020000       8.082901 
      34       19.980000       8.102571 
      34       20.010000       8.162289 
      34       20.010000       8.202018 
      35       20.020000       8.210320 
      35       20.000000       8.190391 
      35       19.970000       8.187899 
      35       19.970000       8.241995 
      35       19.960000       8.299398 
      35       20.010000       8.233496 
      35       20.060000       8.233496 
      35       20.030000       8.233496 
      35       20.030000       8.145734 
      35       20.010000       8.144296 
      35       19.990000       8.169028 
      35       20.010000       8.203900 
      35       19.980000       8.206211 
      35       20.040000       8.178817 
      35       19.990000       8.178817 
      36       20.010000       8.199071 
      36       20.000000       8.242426 
      36       20.040000       8.293224 
      36       20.040000       8.264808 
      36       20.020000       8.178072 
      36       19.960000       8.195444 
      36       19.980000       8.306127 
      36       20.050000       8.320951 
      36       20.030000       8.268894 
      36       20.030000       8.222811 
      36       20.020000       8.191799 
      36       20.020000       8.173931 
      36       20.010000       8.173931 
      36       19.960000       8.107984 
      36       19.940000       8.096370 
      36       19.970000       8.102169 
      37       19.990000       8.078871 
      37       19.970000       8.104927 
      37       19.990000       8.172974 
      37       19.970000       8.270289 
      37       19.980000       8.302933 
      37       20.010000       8.291384 
      37       20.010000       8.266622 
      37       20.000000       8.180202 
      37       19.990000       8.134036 
      37       20.010000       8.137080 
      37       20.030000       8.069472 
      37       19.970000       8.016595 
      37       19.990000       8.044363 
      37       19.950000       8.100384 
      37       20.020000       8.195013 
      38       20.030000       8.292603 
      38       20.030000       8.292603 
      38       19.980000       8.323585 
      38       19.930000       8.323585 
      38       20.010000       8.291345 
      38       19.970000       8.291345 
      38       20.000000       8.244679 
      38       20.010000       8.142979 
      38       20.040000       8.142979 
      38       19.930000       8.142979 
      38       20.010000       8.054262 
      38       20.000000       8.077999 
      38       19.990000       8.076613 
      38       20.010000       8.057433 
      38       20.020000       8.161821 
      39       20.000000       8.161821 
      39       19.970000       8.161821 
      39       19.970000       8.327139 
      39       19.990000       8.381901 
      39       19.980000       8.322673 
      39       19.990000       8.276617 
      39       19.980000       8.253636 
      39       19.960000       8.253636 
      39       19.990000       8.253636 
      39       19.970000       8.205795 
      39       19.970000       8.124568 
      39       19.980000       8.124568 
      39       20.010000       8.078498 
      39       19.980000       8.077020 
      39       19.960000       8.124676 
      40       19.960000       8.188118 
      40       19.980000       8.181074 
      40       20.020000       8.136693 
      40       20.000000       8.148321 
      40       20.040000       8.121440 
      40       19.940000       8.117466 
      40       19.980000       8.182347 
      40       19.990000       8.158203 
      40       19.950000       8.115694 
      40       19.980000       8.144255 
      40       20.000000       8.197724 
      40       19.970000       8.262591 
      40       19.980000       8.246468 
      40       19.970000       8.171286 
      40       20.010000       8.173431 
      41       19.990000       8.143879 
      41       20.020000       8.143879 
      41       20.040000       8.143879 
      41       19.950000       8.136764 
      41       19.990000       8.251407 
      41       20.010000       8.252250 
      41       20.030000       8.149360 
      41       19.950000       8.128558 
      41       20.010000       8.160971 
      41       20.010000       8.182884 
      41       20.040000       8.189146 
      41       20.000000       8.199500 
      41       19.980000       8.302986 
      41       20.000000       8.363933 
      41       19.960000       8.271592 
      42       19.960000       8.193299 
      42       19.980000       8.185475 
      42       19.920000       8.187037 
      42       19.970000       8.173379 
      42       19.990000       8.173379 
      42       20.010000       8.192396 
      42       19.970000       8.208787 
      42       20.100000       8.222462 
      42       20.120000       8.249598 
      42       20.110000       8.316149 
      42       20.180000       8.372394 
      42       20.140000       8.385573 
      42       20.110000       8.365749 
      42       20.150000       8.341565 
      42       20.170000       8.250606 
      43       20.090000       8.250606 
      43       20.160000       8.250606 
      43       20.130000       8.189212 
      43       20.150000       8.199901 
      43       20.170000       8.199901 
      43       20.130000       8.199901 
      43       20.110000       8.177541 
      43       20.160000       8.190957 
      43       20.140000       8.190957 
      43       20.160000       8.190957 
      43       20.150000       8.207500 
      43       20.160000       8.206614 
      43       20.170000       8.206614 
      43       20.130000       8.245219 
      43       20.160000       8.213672 
      44       20.120000       8.122962 
      44       20.100000       8.115573 
      44       20.100000       8.198194 
      44       20.160000       8.231614 
      44       20.090000       8.244363 
      44       20.180000       8.244363 
      44       20.130000       8.242368 
      44       20.130000       8.182457 
      44       20.040000       8.100428 
      44       20.050000       8.121910 
      44       19.980000       8.171659 
      44       19.970000       8.171659 
      44       19.860000       8.187843 
      44       19.890000       8.195387 
      44       19.890000       8.230908 
      44       19.890000       8.303429 
      45       19.960000       8.337924 
      45       19.880000       8.289144 
      45       19.870000       8.224110 
      45       19.930000       8.224110 
      45       19.920000       8.189185 
      45       19.880000       8.189185 
      45       19.930000       8.159549 
      45       19.980000       8.159549 
      45       19.930000       8.189171 
      45       19.950000       8.203413 
      45       19.950000       8.115624 
      45       19.960000       8.033182 
      45       19.960000       8.033182 
      45       19.930000       8.075730 
      45       19.910000       8.155045 
      46       19.980000       8.139298 
      46       19.930000       8.139298 
      46       19.980000       8.118797 
      46       19.930000       8.158092 
      46       19.960000       8.112023 
      46       19.860000       7.990143 
      46       19.880000       8.014340 
      46       19.990000       8.115567 
      46       19.950000       8.156846 
      46       20.010000       8.165337 
      46       19.940000       8.165337 
      46       19.930000       8.163534 
      46       19.950000       8.155021 
      46       19.920000       8.114268 
      46       19.900000       8.114268 
      46       19.970000       8.064462 
      47       19.920000       8.018406 
      47       19.960000       8.018406 
      47       19.970000       7.986003 
      47       20.000000       8.033731 
      47       19.970000       8.128054 
      47       19.970000       8.208039 
      47       19.970000       8.208039 
      47       20.000000       8.255411 
      47       19.910000       8.339349 
      47       19.930000       8.333868 
      47       20.010000       8.245264 
      47       19.950000       8.245264 
      47       19.920000       8.237637 
      47       19.920000       8.237637 
      47       19.920000       8.294444 
      48       19.940000       8.304895 
      48       19.980000       8.304895 
      48       19.910000       8.272465 
      48       19.980000       8.262759 
      48       19.950000       8.238396 
      48       19.880000       8.222449 
      48       19.970000       8.219572 
      48       19.960000       8.241246 
      48       19.940000       8.258996 
      48       20.000000       8.264557 
      48       19.960000       8.254053 
      48       19.910000       8.222381 
      48       19.930000       8.222381 
      48       19.990000       8.222381 
      48       19.940000       8.201645 
      49       19.910000       8.210667 
      49       19.980000       8.129480 
      49       19.970000       8.027849 
      49       20.050000       8.039410 
      49       19.950000       8.133563 
      49       19.970000       8.207926 
      49       19.990000       8.185075 
      49       20.000000       8.145734 
      49       20.000000       8.145734 
      49       20.000000       8.192743 
      49       20.010000       8.261334 
      49       19.970000       8.321425 
      49       19.970000       8.383647 
      49       20.040000       8.349139 
      49       19.940000       8.262732 
      49       19.970000       8.226755 
      50       19.970000       8.161414 
      50       19.960000       8.090086 
      50       19.950000       8.099555 
      50       20.000000       8.137993 
      50       19.930000       8.181571 
      50       19.960000       8.194005 
      50       20.000000       8.219237 
      50       20.030000       8.245109 
      50       20.120000       8.220083 
      50       20.110000       8.220083 
      50       20.060000       8.203526 
      50       20.070000       8.215500 
      50       20.060000       8.165457 
      50       20.090000       8.108858 
      50       20.100000       8.115292 
      51       20.150000       8.123599 
      51       20.090000       8.178097 
      51       20.110000       8.251285 
      51       20.060000       8.295494 
      51       20.050000       8.262057 
      51       20.100000       8.226517 
      51       20.110000       8.204247 
      51       20.110000       8.173585 
      51       20.090000       8.156835 
      51       20.100000       8.193172 
      51       20.110000       8.168961 
      51       20.090000       8.152834 
      51       20.050000       8.168974 
      51       20.020000       8.127668 
      51       20.130000       8.132791 
      52       20.060000       8.173764 
      52       20.060000       8.186513 
      52       20.010000       8.177031 
      52       20.050000       8.196729 
      52       20.110000       8.172146 
      52       20.090000       8.167203 
      52       20.080000       8.238935 
      52       20.050000       8.237953 
      52       20.150000       8.240834 
      52       20.090000       8.299776 
      52       20.090000       8.299776 
      52       20.110000       8.299776 
      52       20.110000       8.324122 
      52       20.060000       8.324122 
      52       20.060000       8.324122 
      53       20.060000       8.292715 
      53       20.110000       8.261790 
      53       20.130000       8.227268 
      53       20.090000       8.233539 
      53       20.060000       8.233539 
      53       20.090000       8.233539 
      53       20.090000       8.233539 
      53       20.070000       8.282788 
      53       20.070000       8.227180 
      53       20.090000       8.062358 
      53       20.120000       8.062358 
      53       20.050000       8.062358 
      53       20.040000       7.965908 
      53       20.060000       7.965908 
      53       20.070000       8.037744 
      54       20.060000       8.177374 
      54       20.060000       8.220565 
      54       20.030000       8.191749 
      54       19.970000       8.238078 
      54       19.920000       8.267048 
      54       19.850000       8.240777 
      54       19.870000       8.205260 
      54       19.850000       8.215220 
      54       19.830000       8.227212 
      54       19.920000       8.214781 
      54       19.900000       8.263509 
      54       19.970000       8.304824 
      54       19.840000       8.237523 
      54       19.870000       8.169975 
      54       19.830000       8.184646 
      55       19.880000       8.264970 
      55       19.880000       8.269307 
      55       19.910000       8.269307 
      55       19.880000       8.219724 
      55       19.910000       8.240198 
      55       19.900000       8.265386 
      55       19.910000       8.265386 
      55       19.890000       8.218255 
      55       19.890000       8.182514 
      55       19.910000       8.189961 
      55       19.860000       8.210750 
      55       19.830000       8.207430 
      55       19.900000       8.186983 
      55       19.910000       8.149637 
      56       19.900000       8.149637 
      56       19.930000       8.152891 
      56       19.920000       8.187786 
      56       19.930000       8.214654 
      56       19.900000       8.171689 
      56       19.920000       8.171689 
      56       19.910000       8.171689 
      56       19.890000       8.143382 
      56       19.930000       8.197241 
      56       19.890000       8.197241 
      56       19.880000       8.190829 
      56       19.920000       8.122395 
      56       19.920000       8.065365 
      56       19.920000       8.085168 
      56       19.890000       8.091344 
      56       19.890000       8.039905 
      57       19.920000       8.056905 
      57       19.850000       8.126782 
      57       19.980000       8.168088 
      57       20.020000       8.208802 
      57       20.030000       8.224538 
      57       20.080000       8.188202 
      57       20.130000       8.147519 
      57       20.100000       8.125440 
      57       20.080000       8.147062 
      57       20.120000       8.182360 
      57       20.090000       8.194956 
      57       20.110000       8.145194 
      57       20.100000       8.145194 
      57       20.090000       8.145194 
      58       20.030000       8.110711 
      58       20.080000       8.137124 
      58       20.090000       8.137124 
      58       20.060000       8.157733 
      58       20.100000       8.154619 
      58       20.040000       8.154619 
      58       20.090000       8.116027 
      58       20.070000       8.086058 
      58       20.110000       8.115154 
      58       20.080000       8.144250 
      58       20.110000       8.114294 
      58       20.090000       8.076093 
      58       20.120000       8.076685 
      58       20.110000       8.076685 
      58       20.050000       8.102541 
      59       20.010000       8.102541 
      59       20.100000       8.104010 
      59       20.120000       8.073892 
      59       20.080000       8.146632 
      59       20.050000       8.228913 
      59       20.050000       8.218807 
      59       20.040000       8.205246 
      59       20.060000       8.236666 
      59       20.060000       8.257277 
      59       20.120000       8.249233 
      59       20.090000       8.192246 
      59       20.080000       8.150677 
      59       20.120000       8.204369 
      59       20.090000       8.230768 
      59       20.020000       8.162773 
      60       20.110000       8.146523 
      60       20.040000       8.146523 
      60       20.050000       8.159133 
      60       20.080000       8.161361 
      60       20.090000       8.221868 
      60       20.020000       8.223100 
      60       20.070000       8.178013 
      60       20.050000       8.151396 
      60       20.070000       8.096879 
      60       20.070000       8.066292 
      60       20.100000       8.122878 
      60       20.110000       8.196605 
      60       20.040000       8.224621 
      60       20.050000       8.180478 
      60       20.080000       8.114808 
      60       20.040000       8.045169 
      61       20.050000       8.076283 
