

 time    ||    gripping force   ||   raspberry measurement 

      0       49.910000       -794.740385 
      0       44.570000       -794.740385 
      0       38.700000       -794.740385 
      0       38.600000       -794.740385 
      0       36.630000       -794.740385 
      0       29.940000       -794.740385 
      0       25.060000       -794.740385 
      1       10.860000       -786.792981 
      2       10.750000       -778.925051 
      2       10.940000       -771.135796 
      2       11.050000       -763.423268 
      2       33.910000       -755.683731 
      2       35.330000       -752.161352 
      3       36.370000       -709.251131 
      3       37.870000       -516.955269 
      3       38.670000       -199.983128 
      3       39.180000       -7.868684 
      3       39.540000       34.875189 
      3       39.950000       38.299877 
      3       40.750000       38.316557 
      3       41.330000       38.260334 
      3       42.350000       38.209632 
      3       42.520000       38.168852 
      3       42.620000       38.160353 
      3       44.060000       38.158980 
      3       44.940000       38.172467 
      3       45.120000       38.233914 
      4       45.100000       38.368351 
      4       45.140000       38.465156 
      4       45.210000       38.510064 
      4       45.150000       38.612248 
      4       45.090000       38.643586 
      4       45.100000       38.568464 
      4       45.240000       38.586271 
      4       45.510000       38.688050 
      4       45.520000       38.722073 
      4       45.400000       38.640154 
      4       45.430000       38.502963 
      4       45.390000       38.520129 
      4       45.390000       38.722091 
      5       47.400000       38.892448 
      5       47.830000       38.848944 
      5       48.510000       38.691267 
      5       48.420000       38.628142 
      5       48.360000       38.705603 
      5       48.280000       38.793974 
      5       48.250000       38.835561 
      5       48.210000       38.880494 
      5       48.150000       38.906797 
      5       48.200000       38.933025 
      5       48.490000       38.936833 
      6       48.680000       38.892219 
      6       48.660000       38.867027 
      6       48.720000       38.940570 
      6       48.650000       38.962496 
      6       48.650000       38.928044 
      6       48.620000       38.947342 
      6       48.920000       39.007333 
      6       49.090000       39.074639 
      6       49.190000       39.104581 
      6       49.230000       39.111817 
      6       49.240000       39.044047 
      7       49.160000       38.938412 
      7       49.110000       38.910076 
      7       49.180000       38.896190 
      7       49.160000       38.858137 
      7       49.140000       38.890795 
      7       49.160000       38.949083 
      7       49.130000       38.981324 
      7       49.100000       39.004705 
      7       49.610000       39.006877 
      7       50.090000       39.011460 
      8       50.230000       39.023061 
      8       50.140000       39.078223 
      8       50.160000       39.113148 
      8       50.160000       39.086709 
      8       50.140000       39.064797 
      8       50.150000       39.052627 
      8       50.100000       39.030285 
      8       50.120000       38.998878 
      8       50.120000       39.014574 
      8       50.020000       39.049043 
      8       50.090000       39.056200 
      9       50.100000       39.047297 
      9       50.090000       38.993851 
      9       50.030000       38.912431 
      9       50.100000       38.913233 
      9       49.990000       39.005104 
      9       50.090000       39.015376 
      9       50.120000       38.967052 
      9       50.040000       38.932045 
      9       50.030000       38.905646 
      9       50.060000       38.955010 
      9       50.000000       39.062898 
      9       50.020000       39.117660 
      9       50.020000       39.115849 
      10       50.020000       39.124402 
      10       49.960000       39.104206 
      10       50.040000       39.079180 
      10       49.960000       39.108719 
      10       50.000000       39.138271 
      10       49.980000       39.113688 
      10       49.950000       39.098850 
      10       49.920000       39.130232 
      10       49.980000       39.150854 
      10       49.960000       39.143187 
      10       49.960000       39.089464 
      11       49.940000       39.047715 
      11       49.930000       39.051369 
      11       50.000000       39.031115 
      11       49.900000       39.011487 
      11       49.940000       38.999724 
      11       49.860000       39.042868 
      11       49.920000       39.102779 
      12       49.960000       39.077753 
      12       49.900000       39.027118 
      12       49.880000       39.019916 
      12       49.920000       38.980023 
      12       49.960000       38.938869 
      12       49.900000       38.979996 
      12       49.880000       39.019057 
      12       49.870000       39.017219 
      12       49.900000       39.040613 
      12       49.890000       39.077254 
      12       49.880000       39.104718 
      13       49.880000       39.111363 
      13       49.870000       39.124416 
      13       49.960000       39.109136 
      13       49.880000       39.097575 
      13       49.840000       39.120347 
      13       49.910000       39.114561 
      13       49.870000       39.127104 
      13       49.880000       39.182652 
      13       49.810000       39.156640 
      14       49.850000       39.055426 
      14       49.910000       39.016378 
      14       49.870000       39.078719 
      14       49.900000       39.127017 
      14       49.800000       39.088578 
      14       49.850000       39.053074 
      14       49.850000       39.075565 
      14       49.850000       39.071009 
      14       49.870000       39.035685 
      14       49.850000       39.005163 
      14       49.870000       39.044640 
      15       49.880000       39.118977 
      15       49.840000       39.149928 
      15       49.920000       39.142301 
      15       49.870000       39.079539 
      15       49.880000       39.009716 
      15       49.880000       39.015918 
      16       49.860000       39.054926 
      16       49.860000       39.086293 
      16       49.850000       39.118534 
      16       49.830000       39.102876 
      16       49.860000       39.068798 
      16       49.900000       39.065254 
      16       49.880000       39.076394 
      16       49.850000       39.070166 
      16       49.910000       39.023075 
      16       49.860000       39.020001 
      17       49.860000       39.050400 
      17       49.870000       39.067965 
      17       49.860000       39.108692 
      17       49.850000       39.148586 
      17       49.860000       39.156227 
      17       49.820000       39.148613 
      18       49.930000       39.109578 
      18       49.850000       39.078710 
      18       49.890000       39.097048 
      18       49.880000       39.079079 
      18       49.800000       38.985479 
      18       49.960000       38.969782 
      18       49.870000       39.060281 
      18       49.820000       39.092092 
      18       49.860000       39.078280 
      19       49.830000       39.109525 
      19       49.800000       39.147310 
      19       49.880000       39.140916 
      19       49.840000       39.086780 
      19       49.830000       39.036987 
      19       49.830000       39.070650 
      19       49.860000       39.069211 
      19       49.830000       39.038426 
      19       49.780000       39.085368 
      20       49.880000       39.143187 
      20       49.840000       39.154897 
      20       49.850000       39.137802 
      20       49.800000       39.061211 
      20       49.810000       38.999861 
      20       49.820000       39.061211 
      20       49.820000       39.137842 
      20       49.900000       39.156227 
      20       49.870000       39.159385 
      20       49.850000       39.157999 
      21       49.830000       39.159438 
      21       49.840000       39.157973 
      21       49.800000       39.158538 
      21       49.820000       39.146772 
      21       49.830000       39.106074 
      21       49.870000       39.058957 
      21       49.850000       39.089491 
      21       49.810000       39.132832 
      21       49.830000       39.106960 
      21       49.860000       39.063412 
      21       49.830000       39.037014 
      22       49.820000       39.028930 
      22       49.820000       39.083635 
      22       49.830000       39.132389 
      22       49.780000       39.107403 
      22       49.840000       39.069241 
      22       49.820000       39.066153 
      22       49.780000       39.087193 
      22       49.840000       39.118561 
      22       49.780000       39.102863 
      23       49.860000       39.068368 
      23       49.800000       39.060325 
      23       49.830000       39.058483 
      23       49.790000       39.065254 
      23       49.780000       39.086710 
      23       49.820000       39.112745 
      23       49.820000       39.074153 
      23       49.850000       39.015075 
      23       49.880000       39.044628 
      23       49.830000       39.108675 
      24       49.780000       39.107819 
      24       49.870000       39.097508 
      24       49.870000       39.119460 
      24       49.880000       39.103749 
      24       49.810000       39.078293 
      24       49.870000       39.098337 
      24       49.830000       39.094390 
      24       49.850000       39.047299 
      24       49.780000       39.041957 
      24       49.840000       39.063882 
      24       49.850000       39.108289 
      25       49.800000       39.148573 
      25       49.820000       39.156227 
      25       49.870000       39.148613 
      25       49.830000       39.109578 
      25       49.830000       39.078763 
      25       49.860000       39.098794 
      25       49.880000       39.099803 
      25       49.850000       39.071925 
      26       49.820000       39.086793 
      26       49.890000       39.106421 
      26       49.830000       39.123556 
      26       49.810000       39.104180 
      26       49.850000       39.079206 
      26       49.830000       39.109579 
      26       49.890000       39.148196 
      26       49.800000       39.151700 
      26       49.870000       39.134731 
      27       49.840000       39.111390 
      27       49.850000       39.095263 
      27       49.890000       39.044628 
      27       49.820000       39.028514 
      27       49.830000       39.071483 
      27       49.860000       39.086763 
      27       49.890000       39.108263 
      28       49.940000       39.124846 
      28       49.880000       39.117232 
      28       49.810000       39.135214 
      28       49.850000       39.152600 
      28       49.800000       39.158968 
      28       49.840000       39.157100 
      28       49.840000       39.148640 
      28       49.890000       39.109605 
      28       49.830000       39.079623 
      28       49.840000       39.108732 
      28       49.820000       39.138271 
      28       49.830000       39.113661 
      29       49.770000       39.097938 
      29       49.860000       39.118587 
      29       49.810000       39.092978 
      29       49.840000       39.030799 
      29       49.850000       39.029777 
      29       49.860000       39.099359 
      29       49.850000       39.135517 
      29       49.840000       39.110131 
      29       49.860000       39.078184 
      29       49.840000       39.111044 
      29       49.810000       39.147202 
      30       49.860000       39.158552 
      30       49.810000       39.157973 
      30       49.780000       39.159438 
      30       49.900000       39.158000 
      30       49.830000       39.159438 
      30       49.840000       39.158000 
      30       49.810000       39.159438 
      30       49.870000       39.158000 
      30       49.830000       39.159438 
      30       49.810000       39.158000 
      30       49.800000       39.159438 
      31       49.810000       39.158000 
      31       49.830000       39.159438 
      31       49.840000       39.158000 
      31       49.830000       39.159438 
      31       49.870000       39.158000 
      31       49.800000       39.159438 
      31       49.750000       39.157973 
      32       49.730000       39.158525 
      32       49.830000       39.146315 
      32       49.830000       39.100246 
      32       49.860000       39.029817 
      32       49.860000       39.031255 
      32       49.790000       39.098794 
      32       49.790000       39.147297 
      32       49.830000       39.151258 
      32       49.820000       39.130245 
      33       49.880000       39.098877 
      33       49.800000       39.114575 
      33       49.850000       39.149070 
      33       49.860000       39.157127 
      33       49.810000       39.159411 
      33       49.780000       39.157972 
      33       49.780000       39.158538 
      34       49.820000       39.146771 
      34       49.890000       39.106061 
      34       49.760000       39.058527 
      34       49.820000       39.084522 
      34       49.790000       39.113591 
      34       49.820000       39.085877 
      34       49.750000       39.055342 
      34       49.820000       39.020833 
      34       49.810000       39.027171 
      35       49.810000       39.078623 
      35       49.770000       39.049527 
      35       49.830000       38.998948 
      35       49.840000       39.061184 
      35       49.820000       39.137841 
      35       49.810000       39.156213 
      35       49.800000       39.158928 
      35       49.840000       39.152170 
      35       49.820000       39.130272 
      35       49.840000       39.098878 
      35       49.810000       39.114574 
      36       49.820000       39.149043 
      36       49.830000       39.156240 
      36       49.820000       39.148613 
      36       49.860000       39.109605 
      36       49.840000       39.079649 
      36       49.790000       39.109592 
      36       49.860000       39.148196 
      36       49.770000       39.151687 
      36       49.830000       39.134328 
      37       49.860000       39.107307 
      37       49.770000       39.086847 
      37       49.860000       39.072812 
      37       49.820000       39.110601 
      37       49.840000       39.147188 
      37       49.840000       39.158552 
      37       49.780000       39.157973 
      37       49.800000       39.159438 
      37       49.850000       39.157999 
      37       49.820000       39.159411 
      37       49.870000       39.157127 
      37       49.860000       39.149070 
      38       49.830000       39.114574 
      38       49.850000       39.098850 
      38       49.780000       39.129359 
      38       49.740000       39.140499 
      38       49.810000       39.100219 
      38       49.840000       39.034773 
      38       49.780000       39.050483 
      38       49.840000       39.119474 
      38       49.860000       39.151284 
      39       49.920000       39.158928 
      39       49.840000       39.157099 
      39       49.890000       39.148613 
      39       49.870000       39.108719 
      39       49.860000       39.068851 
      39       49.840000       39.061211 
      39       49.810000       39.068825 
      40       49.860000       39.107833 
      40       49.860000       39.137815 
      40       49.860000       39.108705 
      40       49.890000       39.079166 
      40       49.890000       39.103736 
      40       49.860000       39.118144 
      40       49.860000       39.081767 
      40       49.890000       39.041070 
      40       49.880000       39.018589 
      40       49.900000       39.036128 
      40       49.860000       39.062983 
      40       49.840000       39.102876 
      40       49.870000       39.124376 
      41       49.880000       39.116332 
      41       49.840000       39.124416 
      41       49.840000       39.104206 
      41       49.800000       39.079206 
      41       49.890000       39.109565 
      41       49.810000       39.147727 
      41       49.820000       39.145428 
      41       49.850000       39.100192 
      41       49.810000       39.028943 
      41       49.840000       39.020847 
      41       49.850000       39.054013 
      41       49.790000       39.069679 
      41       49.820000       39.040987 
      42       49.800000       38.964396 
      42       49.840000       38.980536 
      42       49.840000       39.065667 
      42       49.830000       39.105548 
      42       49.890000       39.134301 
      42       49.780000       39.152560 
      42       49.860000       39.158551 
      42       49.890000       39.152560 
      42       49.860000       39.134341 
      42       49.830000       39.106851 
      42       49.840000       39.080991 
      43       49.810000       39.042786 
      43       49.780000       39.041513 
      43       49.890000       39.062969 
      43       49.850000       39.097034 
      43       49.880000       39.094350 
      43       49.850000       39.047258 
      43       49.820000       39.040627 
      43       49.840000       39.047685 
      43       49.820000       39.035698 
      43       49.850000       39.028917 
      44       49.840000       39.084521 
      44       49.890000       39.143174 
      44       49.800000       39.155354 
      44       49.780000       39.143630 
      44       49.860000       39.090351 
      44       49.860000       39.058110 
      44       49.870000       39.095706 
      44       49.840000       39.103320 
      44       49.800000       39.097105 
      45       49.800000       39.119876 
      45       49.840000       39.108718 
      45       49.810000       39.097508 
      45       49.910000       39.118574 
      45       49.840000       39.092978 
      45       49.820000       39.030799 
      45       49.810000       39.029804 
      45       49.870000       39.100246 
      45       49.830000       39.146315 
      45       49.820000       39.158498 
      46       49.840000       39.157099 
      46       49.820000       39.149056 
      46       49.860000       39.114118 
      46       49.780000       39.093048 
      46       49.830000       39.101092 
      46       49.880000       39.092605 
      46       49.850000       39.108719 
      46       49.820000       39.124832 
      46       49.820000       39.116346 
      46       49.800000       39.124389 
      46       49.850000       39.103320 
      47       49.810000       39.068382 
      47       49.780000       39.060325 
      47       49.830000       39.058456 
      47       49.820000       39.064408 
      47       49.830000       39.077228 
      47       49.820000       39.080105 
      47       49.840000       39.061557 
      47       49.790000       39.062153 
      47       49.800000       39.066056 
      47       49.850000       39.093477 
      47       49.830000       39.067855 
      48       49.840000       38.998448 
      48       49.860000       38.972023 
      48       49.880000       38.988979 
      48       49.850000       39.034798 
      48       49.900000       39.076341 
      48       49.870000       39.098875 
      48       49.890000       39.082170 
      48       49.850000       39.064394 
      48       49.920000       39.053044 
      48       50.200000       39.035254 
      48       50.300000       39.018105 
      48       50.290000       39.035214 
      49       50.270000       39.051727 
      49       50.280000       39.048600 
      49       50.310000       39.013675 
      49       50.250000       38.988106 
      49       50.260000       38.982764 
      49       50.330000       38.983154 
      49       50.290000       39.058109 
      49       50.300000       39.116622 
      49       50.330000       39.063964 
      49       50.320000       39.013623 
      49       50.300000       39.057237 
      49       50.270000       39.096079 
      50       50.320000       39.109701 
      50       50.380000       39.112652 
      50       50.290000       39.134314 
      50       50.290000       39.145858 
      50       50.310000       39.118574 
      50       50.270000       39.044614 
      50       50.260000       39.004719 
      50       50.330000       39.030246 
      50       50.310000       39.045482 
      50       50.370000       39.019434 
      50       50.250000       38.954969 
      50       50.310000       38.947728 
      50       50.270000       38.986320 
      51       50.300000       38.960724 
      51       50.320000       38.946926 
      51       50.320000       38.970101 
      51       50.280000       39.036582 
      51       50.370000       39.096924 
      51       50.330000       39.053555 
      51       50.330000       38.987666 
      51       50.280000       39.001092 
      51       50.310000       38.997961 
      51       50.270000       38.968395 
      51       50.320000       38.966167 
      51       50.270000       38.988509 
      51       50.270000       39.034354 
      52       50.310000       39.071358 
      52       50.280000       39.079191 
      52       50.340000       39.055648 
      52       50.300000       39.030824 
      52       50.240000       38.981698 
      52       50.300000       38.948795 
      52       50.300000       38.951286 
      52       50.290000       39.015956 
      52       50.290000       39.028337 
      52       50.270000       39.030783 
      52       50.290000       39.073599 
      53       50.250000       39.024402 
      53       50.280000       38.946470 
      53       50.330000       38.966567 
      53       50.310000       38.950883 
      53       50.270000       38.928101 
      53       50.290000       39.024390 
      53       50.300000       39.091591 
      53       50.310000       39.043271 
      53       50.250000       39.015035 
      53       50.320000       39.074153 
      54       50.330000       39.112758 
      54       50.300000       39.087139 
      54       50.320000       39.070196 
      54       50.260000       39.076824 
      54       50.280000       39.070139 
      54       50.310000       39.021719 
      54       50.300000       39.002903 
      54       50.330000       38.966554 
      54       50.300000       38.894032 
      55       50.270000       38.926260 
      55       50.310000       39.014088 
      55       50.300000       39.051297 
      55       50.360000       39.064757 
      55       50.300000       39.086709 
      55       50.350000       39.113187 
      55       50.240000       39.079526 
      55       50.210000       39.038399 
      55       50.240000       39.074140 
      55       50.320000       39.089004 
      55       50.260000       39.047285 
      55       50.270000       39.046886 
      56       50.270000       39.082223 
      56       50.320000       39.118104 
      56       50.250000       39.101950 
      56       50.270000       39.057100 
      56       50.260000       39.005632 
      56       50.310000       38.943243 
      56       50.280000       38.922756 
      56       50.320000       38.943215 
      56       50.290000       39.004705 
      57       50.340000       39.044946 
      57       50.260000       39.036512 
      57       50.300000       38.956229 
      57       50.240000       38.881063 
      57       50.300000       38.945514 
      57       50.310000       39.053552 
      57       50.260000       39.075481 
      57       50.350000       39.070156 
      57       50.290000       39.087152 
      57       50.290000       39.113174 
      58       50.250000       39.078666 
      58       50.260000       39.028474 
      58       50.290000       39.036114 
      58       50.340000       39.052654 
      58       50.280000       39.059882 
      58       50.320000       39.068811 
      58       50.210000       39.108718 
      58       50.280000       39.148586 
      58       50.250000       39.156226 
      59       50.320000       39.148573 
      59       50.300000       39.108289 
      59       50.310000       39.063882 
      59       50.300000       39.041983 
      59       50.340000       39.048185 
      59       50.330000       39.105188 
      59       50.280000       39.146744 
      59       50.270000       39.158511 
      59       50.300000       39.157046 
      59       50.280000       39.147297 
      59       50.330000       39.092978 
      60       50.260000       39.002076 
      60       50.260000       38.970252 
      60       50.330000       39.049983 
      60       50.280000       39.113188 
      60       50.300000       39.116319 
      60       50.290000       39.135161 
      60       50.220000       39.151727 
      60       50.330000       39.148600 
      60       50.360000       39.113662 
      60       50.260000       39.087649 
      60       50.240000       39.076882 
      60       50.250000       39.052268 
      60       50.310000       39.079123 
      61       50.270000       39.095236 
