Human trial picking the raspberry twin 

 time    ||     output     ||     loadcell

      0.000000       -800.616923       0.100000 
      0.030242       -800.616923       0.260000 
      0.062067       -800.616923       0.340000 
      0.094080       -800.616923       0.290000 
      0.126024       -800.616923       0.050000 
      0.157469       -800.616923       0.040000 
      0.188908       -800.616923       0.120000 
      0.220154       -800.616923       0.250000 
      0.251890       -800.616923       0.300000 
      0.282563       -800.616918       0.100000 
      0.314759       -800.615728       0.150000 
      0.345919       -800.508570       0.160000 
      0.376230       -796.959989       0.060000 
      0.406975       -753.729462       0.430000 
      0.438227       -559.984793       0.100000 
      0.469757       -240.566590       0.160000 
      0.501530       -46.877441       0.090000 
      0.533037       -3.698505       0.110000 
      0.564119       -0.117144       0.330000 
      0.594623       0.043277       0.120000 
      0.625588       0.057519       0.150000 
      0.656881       -0.004374       0.100000 
      0.688877       -0.021291       0.270000 
      0.718588       0.088410       0.020000 
      0.750726       0.146242       0.150000 
      0.781704       0.095570       0.240000 
      0.813690       0.067842       0.010000 
      0.844972       0.050686       0.140000 
      0.876247       -0.049615       0.320000 
      0.907128       -0.171983       0.240000 
      0.938165       -0.163956       0.150000 
      0.969525       -0.135290       0.320000 
      1.000949       -0.149172       0.230000 
      1.032035       -0.114660       0.370000 
      1.063029       -0.078840       0.180000 
      1.094402       -0.071142       0.280000 
      1.126575       -0.075195       0.390000 
      1.158191       -0.027217       0.220000 
      1.189113       0.062857       0.170000 
      1.220044       0.089751       0.330000 
      1.249996       0.058374       0.110000 
      1.281078       0.023462       0.090000 
      1.313061       0.026559       0.190000 
      1.343081       0.015349       0.100000 
      1.373403       -0.043774       0.040000 
      1.403952       -0.040699       0.060000 
      1.434835       -0.030805       0.260000 
      1.465966       -0.059568       0.110000 
      1.497865       -0.064371       0.210000 
      1.527931       -0.074892       0.180000 
      1.558293       -0.094370       0.110000 
      1.589228       -0.133585       0.370000 
      1.619008       -0.133405       0.120000 
      1.648892       -0.113361       0.180000 
      1.678606       -0.077011       0.040000 
      1.709513       -0.071652       0.000000 
      1.740407       -0.084625       0.040000 
      1.771163       -0.078822       0.220000 
      1.803052       -0.103007       0.140000 
      1.833971       -0.087752       0.200000 
      1.864868       -0.065840       0.240000 
      1.896785       -0.108379       0.230000 
      1.926699       -0.124475       0.170000 
      1.958614       -0.091392       0.230000 
      1.988542       -0.047818       0.140000 
      2.019119       -0.027743       0.120000 
      2.049987       -0.036161       0.250000 
      2.080927       -0.032213       0.460000 
      2.110823       0.003318       0.210000 
      2.141642       0.016151       0.030000 
      2.172073       -0.010108       0.010000 
      2.203213       -0.029085       0.010000 
      2.233640       -0.004309       0.240000 
      2.264895       -0.018787       0.330000 
      2.296349       -0.031634       0.310000 
      2.327084       -0.026871       0.030000 
      2.357503       -0.042003       0.060000 
      2.389675       -0.063125       0.260000 
      2.420783       -0.076595       0.300000 
      2.451975       -0.117349       0.090000 
      2.483778       -0.162212       0.150000 
      2.515531       -0.189510       0.250000 
      2.547051       -0.207493       0.220000 
      2.577818       -0.189993       0.240000 
      2.609523       -0.168967       0.060000 
      2.640642       -0.158629       0.090000 
      2.672020       -0.199891       0.280000 
      2.703079       -0.255802       0.170000 
      2.734356       -0.203864       0.180000 
      2.764851       -0.100335       0.280000 
      2.796710       -0.016061       0.140000 
      2.826666       0.056087       0.400000 
      2.857483       0.036347       0.430000 
      2.889060       -0.046458       0.250000 
      2.920121       -0.074752       0.180000 
      2.950983       -0.046515       0.180000 
      2.982369       -0.029059       0.090000 
      3.013743       -0.053244       0.100000 
      3.045620       -0.115603       0.310000 
      3.076424       -0.164799       0.040000 
      3.107848       -0.137532       0.160000 
      3.138967       -0.090064       0.130000 
      3.169760       -0.104792       0.080000 
      3.200821       -0.098564       0.180000 
      3.231594       -0.113844       0.400000 
      3.262647       -0.184528       0.080000 
      3.293881       -0.169866       0.150000 
      3.324693       -0.155042       0.080000 
      3.356217       -0.177011       0.020000 
      3.387021       -0.164038       0.000000 
      3.417390       -0.219218       0.170000 
      3.448032       -0.276927       0.240000 
      3.479942       -0.299448       0.340000 
      3.510810       -0.332079       0.330000 
      3.541736       -0.329001       0.110000 
      3.572991       -0.281896       0.050000 
      3.604475       -0.209322       0.470000 
      3.635414       -0.184665       0.030000 
      3.666832       -0.208362       0.020000 
      3.697289       -0.141599       0.230000 
      3.728299       -0.077525       0.040000 
      3.758510       -0.114678       0.050000 
      3.789411       -0.148726       0.140000 
      3.820260       -0.132200       0.040000 
      3.851104       -0.083727       0.180000 
      3.881963       -0.093289       0.210000 
      3.912067       -0.177854       0.160000 
      3.941921       -0.237585       0.310000 
      3.972884       -0.278755       0.340000 
      4.004639       -0.347816       0.110000 
      4.036268       -0.354057       0.100000 
      4.067923       -0.321405       0.290000 
      4.099601       -0.292695       0.150000 
      4.131360       -0.266253       0.170000 
      4.161765       -0.244328       0.090000 
      4.192757       -0.231718       0.210000 
      4.224722       -0.267625       0.050000 
      4.255838       -0.300278       0.010000 
      4.287435       -0.286853       0.160000 
      4.318495       -0.257313       0.180000 
      4.349791       -0.266226       0.060000 
      4.382063       -0.278809       0.150000 
      4.413264       -0.255028       0.070000 
      4.443942       -0.267598       0.080000 
      4.474180       -0.276067       0.250000 
      4.506076       -0.241116       0.410000 
      4.535998       -0.203077       0.060000 
      4.567519       -0.191296       0.170000 
      4.598572       -0.188762       0.130000 
      4.629735       -0.169784       0.320000 
      4.660418       -0.170836       0.310000 
      4.692061       -0.180998       0.070000 
      4.723012       -0.242527       0.070000 
      4.753667       -0.294369       0.150000 
      4.785735       -0.279707       0.260000 
      4.816655       -0.217779       0.260000 
      4.847182       -0.164122       0.030000 
      4.879652       -0.178825       0.010000 
      4.910257       -0.243911       0.100000 
      4.940636       -0.314607       0.210000 
      4.972063       -0.382382       0.060000 
      5.002954       -0.407851       0.150000 
      5.033902       -0.402093       0.120000 
      5.065817       -0.346972       0.060000 
      5.096729       -0.307534       0.370000 
      5.127652       -0.320117       0.060000 
      5.159566       -0.344687       0.080000 
      5.190452       -0.382892       0.240000 
      5.221401       -0.385400       0.140000 
      5.253284       -0.377106       0.120000 
      5.284237       -0.380015       0.060000 
      5.315151       -0.358695       0.240000 
      5.347032       -0.304766       0.220000 
      5.376954       -0.295033       0.040000 
      5.408867       -0.291296       0.090000 
      5.438851       -0.296804       0.140000 
      5.470029       -0.306081       0.130000 
      5.500963       -0.286436       0.190000 
      5.532804       -0.246985       0.220000 
      5.563716       -0.223648       0.050000 
      5.594641       -0.227744       0.060000 
      5.626552       -0.260385       0.020000 
      5.657436       -0.278406       0.090000 
      5.687388       -0.256801       0.080000 
      5.718306       -0.289678       0.060000 
      5.749316       -0.379612       0.240000 
      5.779970       -0.442027       0.310000 
      5.811373       -0.424935       0.000000 
      5.842314       -0.427246       0.060000 
      5.873410       -0.451817       0.160000 
      5.903944       -0.434427       0.150000 
      5.935575       -0.387753       0.100000 
      5.967033       -0.334459       0.090000 
      5.999144       -0.336701       0.430000 
      6.029964       -0.397634       0.030000 
      6.060651       -0.406121       0.260000 
      6.091352       -0.386923       0.150000 
      6.122356       -0.417335       0.320000 
      6.154078       -0.451413       0.050000 
      6.184919       -0.440216       0.170000 
      6.216262       -0.416462       0.280000 
      6.247895       -0.387739       0.330000 
      6.278929       -0.351981       0.080000 
      6.310290       -0.342928       0.040000 
      6.341866       -0.350103       0.020000 
      6.371613       -0.382879       0.190000 
      6.403509       -0.445488       0.270000 
      6.435458       -0.378379       0.210000 
      6.465343       -0.270784       0.050000 
      6.496818       -0.322858       0.150000 
      6.528740       -0.393924       0.310000 
      6.558657       -0.416585       0.040000 
      6.590549       -0.415427       0.120000 
      6.621675       -0.418357       0.040000 
      6.651594       -0.415507       0.000000 
      6.682510       -0.419243       0.210000 
      6.713933       -0.426265       0.180000 
      6.745847       -0.466322       0.110000 
      6.776766       -0.490326       0.250000 
      6.806688       -0.448370       0.700000 
      6.837602       -0.415107       0.440000 
      6.868490       -0.448716       1.210000 
      6.899003       -0.429028       2.110000 
      6.929788       -0.366240       2.920000 
      6.960811       -0.307578       3.220000 
      6.992077       -0.299907       3.620000 
      7.023163       -0.393634       4.870000 
      7.054000       -0.414107       6.220000 
      7.085413       -0.361866       8.050000 
      7.116187       -0.354063       11.250000 
      7.148013       -0.391418       16.170000 
      7.179132       -0.419050       20.910000 
      7.210147       -0.382865       31.580000 
      7.241655       -0.310165       46.910000 
      7.273705       -0.295490       74.880000 
      7.305747       -0.291740       115.020000 
      7.336387       -0.301760       156.510000 
      7.367048       -0.324851       182.480000 
      7.397883       -0.301180       221.110000 
      7.428459       -0.218234       255.660000 
      7.459791       -0.128143       288.720000 
      7.491037       -0.006206       299.040000 
      7.522052       0.056970       270.190000 
      7.554086       -0.026304       89.060000 
      7.585998       -0.057557       33.150000 
      7.617718       0.085324       24.990000 
      7.649036       0.251682       21.230000 
      7.680259       0.324678       19.730000 
      7.712094       0.361853       11.020000 
      7.743627       0.386677       9.340000 
      7.774595       0.322499       0.040000 
      7.805221       0.117205       19.500000 
      7.836306       0.125361       10.710000 
      7.868252       0.692854       0.060000 
      7.898498       1.491923       9.760000 
      7.930000       2.224202       9.020000 
      7.961017       2.438829       5.600000 
      7.992229       1.550281       2.200000 
      8.023571       0.093892       3.790000 
      8.055097       -0.819338       10.330000 
      8.086904       -1.306175       9.990000 
      8.118312       -1.572097       6.960000 
      8.149677       -1.790112       1.840000 
      8.180892       -2.456988       2.720000 
      8.212044       -3.524360       6.910000 
      8.242896       -4.082553       7.280000 
      8.274395       -3.993414       5.850000 
      8.306395       -3.652042       4.920000 
      8.337725       -3.091336       4.120000 
      8.367414       -2.713405       3.970000 
      8.398490       -2.624590       3.930000 
      8.429221       -2.617134       4.610000 
      8.460303       -2.616465       5.880000 
      8.490757       -2.611077       7.350000 
      8.521115       -2.587323       6.240000 
      8.551849       -2.552828       4.810000 
      8.583762       -2.552828       4.840000 
      8.613865       -2.587323       6.910000 
      8.645897       -2.611077       8.000000 
      8.675868       -2.616462       7.750000 
      8.706545       -2.616905       7.250000 
      8.738327       -2.616918       6.760000 
      8.769826       -2.616892       7.050000 
      8.800270       -2.616018       6.920000 
      8.831039       -2.605624       7.170000 
      8.861899       -2.561339       7.180000 
      8.893661       -2.490880       7.390000 
      8.924812       -2.425959       6.830000 
      8.956302       -2.391380       6.250000 
      8.987525       -2.432199       5.840000 
      9.018746       -2.441018       6.210000 
      9.049992       -2.380153       6.540000 
      9.080626       -2.340162       6.440000 
      9.111856       -2.285908       5.960000 
      9.143463       -2.141130       5.320000 
      9.175219       -1.993706       5.250000 
      9.204897       -1.925044       5.340000 
      9.236502       -1.899504       5.950000 
      9.267616       -1.906178       5.680000 
      9.298702       -1.950501       5.480000 
      9.330495       -1.939716       5.230000 
      9.361016       -1.846501       5.580000 
      9.392557       -1.763599       6.160000 
      9.423234       -1.742042       6.460000 
      9.454522       -1.727687       6.280000 
      9.485301       -1.676595       6.410000 
      9.516234       -1.652828       6.460000 
      9.546027       -1.663582       6.690000 
      9.578010       -1.671625       6.580000 
      9.609893       -1.697221       6.950000 
      9.640680       -1.730304       6.650000 
      9.671733       -1.732199       6.860000 
      9.702984       -1.702095       6.860000 
      9.733618       -1.708932       6.690000 
      9.764972       -1.760814       6.530000 
      9.795987       -1.802133       6.300000 
      9.827720       -1.795366       6.370000 
      9.858515       -1.798107       6.210000 
      9.889146       -1.817348       6.380000 
      9.921205       -1.840686       5.980000 
      9.952018       -1.856786       5.930000 
      9.983198       -1.840673       5.850000 
      10.014811       -1.816919       6.010000 
      10.061045       -1.793152       5.860000 
      10.092032       -1.776595       5.710000 
      10.122259       -1.787323       5.590000 
      10.153196       -1.787323       5.860000 
      10.184987       -1.776581       6.020000 
      10.216482       -1.792695       6.160000 
      10.247575       -1.811049       6.180000 
      10.279649       -1.810177       6.150000 
      10.310679       -1.781481       6.320000 
      10.342594       -1.723701       6.120000 
      10.373480       -1.695008       6.550000 
      10.404438       -1.757770       6.740000 
      10.435168       -1.863913       6.490000 
      10.465952       -1.884553       6.690000 
      10.497464       -1.800295       6.500000 
      10.528864       -1.734016       6.740000 
      10.559758       -1.718718       6.610000 
      10.591510       -1.722345       6.520000 
      10.622052       -1.740660       6.410000 
      10.652869       -1.750971       6.320000 
      10.683439       -1.711520       6.180000 
      10.715063       -1.658240       6.120000 
      10.745890       -1.653727       6.080000 
      10.776835       -1.693165       6.010000 
      10.807593       -1.740216       6.060000 
      10.838857       -1.774711       6.200000 
      10.870143       -1.751387       5.790000 
      10.900759       -1.681980       5.810000 
      10.932267       -1.653257       5.900000 
      10.962204       -1.663139       6.180000 
      10.993883       -1.665797       6.070000 
      11.025946       -1.668055       6.000000 
      11.055867       -1.671182       6.030000 
      11.087081       -1.687309       6.260000 
      11.119236       -1.692252       6.110000 
      11.150340       -1.694923       6.480000 
      11.181677       -1.702550       6.270000 
      11.212805       -1.665797       6.390000 
      11.243656       -1.628644       6.410000 
      11.275484       -1.629490       6.410000 
      11.305403       -1.676165       6.520000 
      11.336199       -1.746015       6.660000 
      11.367475       -1.756786       6.650000 
      11.398524       -1.735304       6.490000 
      11.428782       -1.756799       6.010000 
      11.475103       -1.746458       6.070000 
      11.505575       -1.681537       6.050000 
      11.536467       -1.652801       5.840000 
      11.567780       -1.657726       5.940000 
      11.599405       -1.641143       5.740000 
      11.644771       -1.622332       5.790000 
      11.675205       -1.617805       5.660000 
      11.706566       -1.622358       5.690000 
      11.736407       -1.642003       5.980000 
      11.766766       -1.667638       5.870000 
      11.797733       -1.690410       5.890000 
      11.828459       -1.713348       6.090000 
      11.860022       -1.719549       6.120000 
      11.890947       -1.731716       6.170000 
      11.921979       -1.706094       6.080000 
      11.953222       -1.651941       5.980000 
      11.985167       -1.623205       6.180000 
      12.015900       -1.617389       5.980000 
      12.047474       -1.616933       6.240000 
      12.078709       -1.616932       6.180000 
      12.110790       -1.617375       6.210000 
      12.141847       -1.622761       6.250000 
      12.173215       -1.646515       6.320000 
      12.205129       -1.681037       6.170000 
      12.236555       -1.681897       6.410000 
      12.267839       -1.657327       6.400000 
      12.298325       -1.671598       6.240000 
      12.329417       -1.702563       6.020000 
      12.359698       -1.689524       5.870000 
      12.390801       -1.667612       5.800000 
      12.421975       -1.642016       6.040000 
      12.452572       -1.622801       5.940000 
      12.483099       -1.623218       5.650000 
      12.514094       -1.646998       5.760000 
      12.544899       -1.687309       5.870000 
      12.575782       -1.716462       5.690000 
      12.606736       -1.740659       5.850000 
      12.637653       -1.756799       5.760000 
      12.669100       -1.741102       6.020000 
      12.699860       -1.721861       5.760000 
      12.730721       -1.711520       5.810000 
      12.762076       -1.687336       5.860000 
      12.793756       -1.652814       6.060000 
      12.824587       -1.652371       6.090000 
      12.856340       -1.681494       6.170000 
      12.887921       -1.681910       6.260000 
      12.920083       -1.657314       6.370000 
      12.951758       -1.671182       6.140000 
      12.983570       -1.698050       6.230000 
      13.015094       -1.676125       6.340000 
      13.045829       -1.676111       6.180000 
      13.076264       -1.697594       6.210000 
      13.107606       -1.665353       6.180000 
      13.139124       -1.628160       5.920000 
      13.169907       -1.623204       5.970000 
      13.201559       -1.641156       5.970000 
      13.249375       -1.657257       5.970000 
      13.279772       -1.646515       5.790000 
      13.311156       -1.646515       5.800000 
      13.342103       -1.657256       5.710000 
      13.373597       -1.641129       5.860000 
      13.404514       -1.622318       5.850000 
      13.435642       -1.617362       5.530000 
      13.466723       -1.616932       5.670000 
      13.497307       -1.616919       5.760000 
      13.528238       -1.616919       5.770000 
      13.559649       -1.616919       5.810000 
      13.590557       -1.616919       5.880000 
      13.621706       -1.616919       6.090000 
      13.652891       -1.616919       6.160000 
      13.682632       -1.616919       6.210000 
      13.713564       -1.616919       6.070000 
      13.744833       -1.616919       5.850000 
      13.775927       -1.616919       6.370000 
      13.806644       -1.616919       6.190000 
      13.837487       -1.616919       6.510000 
      13.867789       -1.616919       6.230000 
      13.898570       -1.616919       6.240000 
      13.929697       -1.616919       6.350000 
      13.960883       -1.616919       5.890000 
      13.992212       -1.616919       5.890000 
      14.023409       -1.616932       6.020000 
      14.054125       -1.617362       6.010000 
      14.085757       -1.622318       5.880000 
      14.117219       -1.641116       5.950000 
      14.147764       -1.656813       5.940000 
      14.179724       -1.641129       5.740000 
      14.210893       -1.622761       5.730000 
      14.241979       -1.622775       5.730000 
      14.273612       -1.641586       5.600000 
      14.304840       -1.662669       5.690000 
      14.336031       -1.671155       5.650000 
      14.368066       -1.691808       5.890000 
      14.400020       -1.705650       5.890000 
      14.431039       -1.686423       5.810000 
      14.462025       -1.646958       6.030000 
      14.492473       -1.622775       6.100000 
      14.524464       -1.617389       6.230000 
      14.554694       -1.617376       6.230000 
      14.584791       -1.622318       5.980000 
      14.614848       -1.641116       6.220000 
      14.644798       -1.656813       5.990000 
      14.675184       -1.641116       6.370000 
      14.705938       -1.622318       6.370000 
      14.736620       -1.617362       6.040000 
      14.767993       -1.616946       5.890000 
      14.798506       -1.617362       6.040000 
      14.829577       -1.622318       5.990000 
      14.860501       -1.641116       5.840000 
      14.891018       -1.656813       5.990000 
      14.923142       -1.641116       5.920000 
      14.954560       -1.622318       5.950000 
      14.985998       -1.617362       6.100000 
      15.017881       -1.616932       6.080000 
      15.047799       -1.616919       5.680000 
      15.079716       -1.616919       6.010000 
      15.111630       -1.616919       5.770000 
      15.141550       -1.616919       5.630000 
      15.171470       -1.616919       5.820000 
      15.203385       -1.616919       5.680000 
      15.233304       -1.616919       5.790000 
      15.263224       -1.616919       5.840000 
      15.293172       -1.616932       6.140000 
      15.325092       -1.617362       6.080000 
      15.355976       -1.622318       6.040000 
      15.386895       -1.641116       6.240000 
      15.418809       -1.656813       6.260000 
      15.450275       -1.641116       6.110000 
      15.481688       -1.622318       6.110000 
      15.512639       -1.617362       6.280000 
      15.543123       -1.616932       6.030000 
      15.573828       -1.616919       6.190000 
      15.604609       -1.616919       6.110000 
      15.635621       -1.616919       6.150000 
      15.667473       -1.616919       5.970000 
      15.698649       -1.616919       6.250000 
      15.729211       -1.616919       6.250000 
      15.760441       -1.616919       5.880000 
      15.791981       -1.616919       5.900000 
      15.822474       -1.616919       5.920000 
      15.852177       -1.616919       5.640000 
      15.883030       -1.616932       5.990000 
      15.913981       -1.617362       5.790000 
      15.945112       -1.622318       5.930000 
      15.976235       -1.641116       5.810000 
      16.007022       -1.656813       6.010000 
      16.037731       -1.641116       5.900000 
      16.068352       -1.622318       5.680000 
      16.100401       -1.617362       5.830000 
      16.130843       -1.616932       5.780000 
      16.161321       -1.616919       6.220000 
      16.191977       -1.616919       6.040000 
      16.223533       -1.616919       6.110000 
      16.254924       -1.616919       6.140000 
      16.285733       -1.616919       6.240000 
      16.316753       -1.616919       6.070000 
      16.346106       -1.616919       6.270000 
      16.378007       -1.616919       5.930000 
      16.409889       -1.616919       6.130000 
      16.439808       -1.616919       5.940000 
      16.471743       -1.616919       6.050000 
      16.503665       -1.616919       5.940000 
      16.535120       -1.616919       5.840000 
      16.566006       -1.616919       5.690000 
      16.596955       -1.616932       6.160000 
      16.628838       -1.617362       5.790000 
      16.659755       -1.622318       5.930000 
      16.690671       -1.641116       5.820000 
      16.722588       -1.656813       5.900000 
      16.753503       -1.641116       6.070000 
      16.784452       -1.622318       5.740000 
      16.816431       -1.617362       5.810000 
      16.847287       -1.616932       5.900000 
      16.877370       -1.616919       5.970000 
      16.908901       -1.616919       6.070000 
      16.955344       -1.616919       5.950000 
      16.985868       -1.616919       6.070000 
      17.016518       -1.616919       5.980000 
      17.047493       -1.616919       6.040000 
      17.078076       -1.616919       6.170000 
      17.109028       -1.616919       6.130000 
      17.139253       -1.616919       5.930000 
      17.171038       -1.616919       6.170000 
      17.201684       -1.616919       5.920000 
      17.233063       -1.616919       5.770000 
      17.264010       -1.616919       5.910000 
      17.294593       -1.616919       6.210000 
      17.325847       -1.616919       5.870000 
      17.356617       -1.616919       6.030000 
      17.387256       -1.616919       5.800000 
      17.418191       -1.616919       5.870000 
      17.449519       -1.616919       5.870000 
      17.481617       -1.616919       6.020000 
      17.512076       -1.616919       5.820000 
      17.542447       -1.616919       5.590000 
      17.573563       -1.616919       5.590000 
      17.604841       -1.616919       5.920000 
      17.636279       -1.616919       5.870000 
      17.668193       -1.616919       6.090000 
      17.698394       -1.616919       5.880000 
      17.729124       -1.616919       5.880000 
      17.760164       -1.616919       6.070000 
      17.790853       -1.616919       6.110000 
      17.822275       -1.616919       5.950000 
      17.853254       -1.616919       6.040000 
      17.885237       -1.616919       6.060000 
      17.915638       -1.616919       6.020000 
      17.946437       -1.616919       6.010000 
      17.977657       -1.616919       5.890000 
      18.008879       -1.616919       5.830000 
      18.039614       -1.616919       6.020000 
      18.070559       -1.616919       6.020000 
      18.100980       -1.616919       6.180000 
      18.132591       -1.616919       6.060000 
      18.164106       -1.616919       5.990000 
      18.194929       -1.616919       5.920000 
      18.225959       -1.616919       6.070000 
      18.257910       -1.616919       5.950000 
      18.289581       -1.616919       5.890000 
      18.320187       -1.616919       6.050000 
      18.351574       -1.616919       5.610000 
      18.382416       -1.616919       6.050000 
      18.414032       -1.616919       5.930000 
      18.444048       -1.616919       6.070000 
      18.475637       -1.616919       5.880000 
      18.506360       -1.616919       5.960000 
      18.537296       -1.616919       5.820000 
      18.568430       -1.616919       5.980000 
      18.598873       -1.616919       6.050000 
      18.629296       -1.616919       6.000000 
      18.661237       -1.616919       6.160000 
      18.693183       -1.616919       6.020000 
      18.723469       -1.616919       6.210000 
      18.754668       -1.616919       6.020000 
      18.785985       -1.616919       6.190000 
      18.818134       -1.616919       6.190000 
      18.848605       -1.616919       6.230000 
      18.880005       -1.616919       5.960000 
      18.910757       -1.616919       5.970000 
      18.942184       -1.616919       5.900000 
      18.973346       -1.616919       5.990000 
      19.003704       -1.616919       5.980000 
      19.035239       -1.616919       6.070000 
      19.066552       -1.616919       5.850000 
      19.097354       -1.616919       5.780000 
      19.128905       -1.616919       5.780000 
      19.159738       -1.616919       6.010000 
      19.190733       -1.616919       5.910000 
      19.221117       -1.616919       5.960000 
      19.252244       -1.616919       5.840000 
      19.300145       -1.616919       5.840000 
      19.330758       -1.616919       5.960000 
      19.361917       -1.616919       5.800000 
      19.393096       -1.616919       6.020000 
      19.424400       -1.616919       6.070000 
      19.455814       -1.616919       6.130000 
      19.486462       -1.616919       5.980000 
      19.518286       -1.616919       5.960000 
      19.549535       -1.616919       5.820000 
      19.580719       -1.616919       6.140000 
      19.611378       -1.616919       6.030000 
      19.641980       -1.616919       6.050000 
      19.673222       -1.616919       5.890000 
      19.705130       -1.616919       5.950000 
      19.735994       -1.616919       6.000000 
      19.766927       -1.616919       5.780000 
      19.797672       -1.616919       5.950000 
      19.844429       -1.616919       6.210000 
      19.874947       -1.616919       5.810000 
      19.906366       -1.616919       5.970000 
      19.936983       -1.616919       5.680000 
      19.968737       -1.616919       5.920000 
      20.000733       -1.616919       5.970000 
      20.030887       -1.616919       5.820000 
      20.062045       -1.616919       5.900000 
      20.093255       -1.616919       5.800000 
      20.123987       -1.616919       5.750000 
      20.155022       -1.616919       6.060000 
      20.186348       -1.616919       5.990000 
      20.217925       -1.616919       6.000000 
      20.248886       -1.616919       5.980000 
      20.278842       -1.616919       5.800000 
      20.310238       -1.616919       5.990000 
      20.340863       -1.616919       5.970000 
      20.372207       -1.616919       6.000000 
      20.403095       -1.616919       6.000000 
      20.434149       -1.616919       6.270000 
      20.465268       -1.616919       6.280000 
      20.495092       -1.616919       6.100000 
      20.526488       -1.616919       6.140000 
      20.571922       -1.616919       5.980000 
      20.602862       -1.616919       6.590000 
      20.633349       -1.616919       5.940000 
      20.665354       -1.616919       6.010000 
      20.697273       -1.616919       6.180000 
      20.727461       -1.616919       5.940000 
      20.759072       -1.616919       6.200000 
      20.790658       -1.616919       6.200000 
      20.822033       -1.616919       6.290000 
      20.853579       -1.616919       5.890000 
      20.885681       -1.616919       6.250000 
      20.917045       -1.616919       6.150000 
      20.948567       -1.616919       6.110000 
      20.979002       -1.616919       5.980000 
      21.010069       -1.616919       6.240000 
