

 time    ||    gripping force   ||   raspberry measurement 

      0       0.120000       -794.790385 
      0       0.290000       -794.790385 
      0       0.210000       -794.790385 
      0       0.040000       -794.790385 
      0       0.380000       -794.790385 
      0       0.480000       -794.790385 
      0       0.280000       -794.790385 
      1       8.060000       -786.842481 
      1       51.660000       -778.974056 
      1       70.010000       -771.184311 
      1       107.070000       -763.471300 
      1       119.080000       -755.731521 
      1       84.930000       -752.217052 
      1       68.680000       -709.401785 
      1       67.230000       -517.514005 
      1       100.620000       -201.132689 
      1       119.480000       -9.219327 
      2       122.260000       33.636637 
      2       106.720000       37.184397 
      2       78.400000       37.259129 
      2       83.060000       37.243572 
      2       117.490000       37.346747 
      2       128.370000       37.689827 
      2       87.210000       38.316383 
      2       101.600000       39.114244 
      2       129.490000       39.716094 
      2       132.260000       39.752278 
      3       98.800000       39.413184 
      3       65.360000       39.233301 
      3       65.530000       39.446984 
      3       67.770000       39.878100 
      3       89.840000       40.121437 
      3       116.630000       40.054220 
      3       106.950000       39.805224 
      3       87.510000       39.695345 
      3       69.820000       39.922783 
      3       82.220000       40.091835 
      3       104.400000       39.941584 
      4       92.040000       39.799780 
      4       73.680000       40.061131 
      4       79.750000       40.298330 
      4       97.780000       40.043503 
      4       103.710000       39.538850 
      4       87.840000       39.185731 
      4       79.570000       39.114978 
      4       86.000000       39.335760 
      4       99.510000       39.719769 
      4       104.000000       39.946020 
      5       90.390000       39.797795 
      5       88.050000       39.454080 
      5       90.560000       39.398209 
      5       92.110000       39.667796 
      5       92.270000       39.750764 
      5       92.270000       39.511910 
      5       92.170000       39.420528 
      5       92.180000       39.650346 
      5       92.140000       39.851595 
      5       92.170000       39.718022 
      6       92.130000       39.452416 
      6       92.110000       39.459960 
      6       92.130000       39.711391 
      6       92.030000       39.890125 
      6       92.020000       39.837735 
      6       92.090000       39.623537 
      6       91.970000       39.528202 
      6       91.980000       39.645074 
      6       91.990000       39.807333 
      6       92.050000       39.876717 
      6       91.960000       39.829265 
      6       92.010000       39.745461 
      7       91.890000       39.689467 
      7       91.920000       39.651814 
      7       91.850000       39.667042 
      7       91.910000       39.701537 
      7       91.900000       39.710076 
      7       91.850000       39.719036 
      7       91.860000       39.756232 
      7       91.850000       39.848117 
      7       91.840000       39.888397 
      7       91.840000       39.784898 
      7       91.820000       39.672887 
      7       91.830000       39.662099 
      7       91.760000       39.661639 
      7       91.800000       39.602950 
      7       91.760000       39.597997 
      8       91.770000       39.701066 
      8       91.810000       39.772701 
      8       91.770000       39.728889 
      8       91.740000       39.646307 
      8       91.760000       39.599379 
      8       91.750000       39.589463 
      8       91.780000       39.600209 
      8       91.750000       39.591739 
      8       91.690000       39.669228 
      8       91.710000       39.767331 
      8       91.660000       39.734634 
      8       91.630000       39.680899 
      8       91.690000       39.597924 
      9       91.620000       39.493632 
      9       91.660000       39.497167 
      9       91.610000       39.621734 
      9       91.620000       39.782639 
      9       91.650000       39.847564 
      9       91.580000       39.789411 
      9       91.660000       39.727509 
      9       91.610000       39.718203 
      9       91.570000       39.729747 
      9       91.610000       39.733404 
      9       91.540000       39.723479 
      9       91.540000       39.746816 
      9       91.540000       39.726122 
      10       91.630000       39.679114 
      10       91.530000       39.670570 
      10       91.510000       39.610422 
      10       91.500000       39.488692 
      10       91.470000       39.443276 
      10       91.470000       39.510590 
      10       91.490000       39.582681 
      10       91.450000       39.646346 
      10       91.450000       39.660688 
      10       91.460000       39.669215 
      10       91.420000       39.697965 
      11       91.380000       39.683983 
      11       91.440000       39.674269 
      11       91.450000       39.694769 
      11       91.410000       39.746829 
      11       91.470000       39.755276 
      11       91.410000       39.743688 
      11       91.390000       39.741860 
      11       91.340000       39.686712 
      11       91.320000       39.642458 
      11       91.370000       39.681340 
      11       91.350000       39.718173 
      11       91.360000       39.711423 
      12       91.310000       39.782768 
      12       91.290000       39.909441 
      12       91.380000       39.962471 
      12       91.320000       39.921581 
      12       91.320000       39.828434 
      12       91.350000       39.711892 
      12       91.290000       39.678739 
      12       91.290000       39.701993 
      12       91.280000       39.704194 
      12       91.290000       39.687238 
      12       91.230000       39.665616 
      12       91.270000       39.669353 
      12       91.230000       39.695198 
      13       91.290000       39.756701 
      13       91.260000       39.792025 
      13       91.220000       39.765573 
      13       91.290000       39.676886 
      13       91.180000       39.623961 
      13       91.250000       39.610037 
      13       91.260000       39.529415 
      13       91.190000       39.503406 
      13       91.210000       39.536064 
      13       91.220000       39.582308 
      13       91.240000       39.681271 
      13       91.220000       39.689770 
      14       91.180000       39.632920 
      14       91.200000       39.622592 
      14       91.200000       39.570541 
      14       91.170000       39.488692 
      14       91.180000       39.483156 
      14       91.200000       39.558541 
      14       91.180000       39.627908 
      14       91.160000       39.669227 
      14       91.140000       39.644907 
      14       91.130000       39.576912 
      14       91.170000       39.545461 
      14       91.180000       39.541874 
      14       91.190000       39.485423 
      15       91.150000       39.427590 
      15       91.130000       39.424892 
      15       91.180000       39.469269 
      15       91.110000       39.535588 
      15       91.160000       39.526149 
      15       91.130000       39.491241 
      15       91.130000       39.536061 
      15       91.160000       39.574070 
      15       91.100000       39.511448 
      15       91.160000       39.441449 
      15       91.130000       39.464384 
      15       91.150000       39.499722 
      15       91.120000       39.512348 
      15       91.120000       39.527066 
      16       91.090000       39.589881 
      16       91.130000       39.654359 
      16       91.070000       39.625290 
      16       91.130000       39.562558 
      16       91.090000       39.578685 
      16       91.080000       39.649500 
      16       91.070000       39.683955 
      16       91.130000       39.635578 
      16       91.060000       39.574641 
      16       91.110000       39.548643 
      16       91.110000       39.498437 
      16       91.020000       39.497178 
      17       91.060000       39.596983 
      17       91.120000       39.664741 
      17       91.060000       39.662903 
      17       91.060000       39.657588 
      17       91.030000       39.635132 
      17       91.060000       39.618137 
      17       91.050000       39.619921 
      17       91.030000       39.638676 
      17       91.020000       39.592580 
      17       91.040000       39.490339 
      17       91.010000       39.480984 
      17       91.040000       39.528821 
      18       91.030000       39.558469 
      18       91.000000       39.496070 
      18       91.010000       39.391725 
      18       91.000000       39.372898 
      18       91.050000       39.392148 
      18       91.000000       39.373824 
      18       91.020000       39.403853 
      18       91.010000       39.560688 
      18       91.030000       39.711708 
      18       90.970000       39.706769 
      18       91.030000       39.600626 
      18       90.960000       39.522163 
      19       90.980000       39.484081 
      19       90.950000       39.450915 
      19       91.020000       39.461199 
      19       90.920000       39.472330 
      19       91.010000       39.449585 
      19       90.970000       39.456659 
      19       90.970000       39.458957 
      19       91.000000       39.458957 
      19       90.960000       39.522579 
      19       90.910000       39.544034 
      19       90.940000       39.513219 
      19       90.970000       39.472773 
      19       90.930000       39.402936 
      20       90.970000       39.386366 
      20       90.950000       39.442747 
      20       90.900000       39.454873 
      20       90.900000       39.443689 
      20       90.970000       39.442277 
      20       90.900000       39.391264 
      20       90.900000       39.357160 
      20       90.960000       39.388137 
      20       90.910000       39.423892 
      20       90.930000       39.432988 
      20       91.010000       39.424795 
      20       91.000000       39.463040 
      20       90.900000       39.499641 
      20       90.920000       39.510978 
      21       90.940000       39.509580 
      21       90.970000       39.502422 
      21       90.920000       39.478243 
      21       90.910000       39.504277 
      21       90.920000       39.577229 
      21       90.870000       39.560312 
      21       90.900000       39.535149 
      21       90.940000       39.579543 
      21       90.900000       39.600538 
      21       90.890000       39.585354 
      21       90.920000       39.480386 
      21       90.810000       39.362183 
      21       90.920000       39.320447 
      22       90.910000       39.323158 
      22       90.910000       39.378740 
      22       90.870000       39.490768 
      22       90.850000       39.613525 
      22       90.850000       39.663344 
      22       90.890000       39.627880 
      22       90.870000       39.563470 
      22       90.830000       39.501551 
      22       90.810000       39.500279 
      22       90.860000       39.545475 
      22       90.870000       39.619004 
      22       90.900000       39.635938 
      23       90.900000       39.578710 
      23       90.790000       39.556632 
      23       90.850000       39.528891 
      23       90.850000       39.482711 
      23       90.870000       39.492526 
      23       90.800000       39.444531 
      23       90.870000       39.350484 
      23       90.830000       39.295740 
      23       90.830000       39.281907 
      23       90.820000       39.337889 
      23       90.820000       39.406922 
      24       90.790000       39.463372 
      24       90.830000       39.521665 
      24       90.830000       39.527880 
      24       90.890000       39.505149 
      24       90.800000       39.451663 
      24       90.780000       39.382809 
      24       90.820000       39.370612 
      24       90.790000       39.394366 
      24       90.850000       39.380457 
      24       90.810000       39.419035 
      24       90.820000       39.465517 
      25       90.860000       39.384550 
      25       90.790000       39.293525 
      25       90.830000       39.307034 
      25       90.780000       39.395265 
      25       90.760000       39.521237 
      25       90.790000       39.591125 
      25       90.810000       39.589743 
      25       90.780000       39.522166 
      25       90.780000       39.472356 
      25       90.780000       39.455343 
      25       90.800000       39.354458 
      25       90.820000       39.312875 
      25       90.760000       39.344050 
      26       90.810000       39.343768 
      26       90.760000       39.355720 
      26       90.820000       39.352242 
      26       90.730000       39.319409 
      26       90.770000       39.319616 
      26       90.800000       39.334178 
      26       90.750000       39.365795 
      26       90.760000       39.403255 
      26       90.730000       39.497052 
      26       90.810000       39.538192 
      26       90.710000       39.508719 
      26       90.810000       39.465216 
      27       90.790000       39.441489 
      27       90.800000       39.511891 
      27       90.730000       39.579429 
      27       90.750000       39.558943 
      27       90.740000       39.515408 
      27       90.750000       39.484040 
      27       90.690000       39.456273 
      27       90.710000       39.484523 
      27       90.750000       39.501896 
      27       90.730000       39.431659 
      27       90.740000       39.416796 
      27       90.770000       39.493036 
      27       90.800000       39.518022 
      28       90.710000       39.497096 
      28       90.740000       39.488443 
      28       90.730000       39.487167 
      28       90.760000       39.415463 
      28       90.700000       39.357656 
      28       90.750000       39.371099 
      28       90.720000       39.423975 
      28       90.740000       39.516307 
      28       90.730000       39.544047 
      28       90.750000       39.519894 
      28       90.780000       39.511837 
      28       90.710000       39.499197 
      29       90.710000       39.456742 
      29       90.740000       39.389383 
      29       90.680000       39.340187 
      29       90.680000       39.306520 
      29       90.720000       39.343260 
      29       90.740000       39.406009 
      29       90.710000       39.446303 
      29       90.680000       39.438316 
      29       90.700000       39.361146 
      29       90.730000       39.369370 
      29       90.700000       39.463772 
      29       90.680000       39.499693 
      29       90.700000       39.425750 
      30       90.660000       39.386742 
      30       90.710000       39.423062 
      30       90.690000       39.422979 
      30       90.630000       39.386365 
      30       90.670000       39.336436 
      30       90.670000       39.304818 
      30       90.700000       39.325306 
      30       90.670000       39.398892 
      30       90.670000       39.440035 
      30       90.650000       39.494381 
      30       90.690000       39.554748 
      31       90.650000       39.524350 
      31       90.670000       39.449531 
      31       90.670000       39.402853 
      31       90.660000       39.343328 
      31       90.690000       39.311933 
      31       90.700000       39.365256 
      31       90.700000       39.439592 
      31       90.620000       39.522591 
      31       90.640000       39.543507 
      32       90.660000       39.441487 
      32       90.690000       39.347291 
      32       90.660000       39.364383 
      32       90.640000       39.393866 
      32       90.670000       39.381839 
      32       90.630000       39.351304 
      32       90.600000       39.367014 
      32       90.620000       39.401066 
      32       90.630000       39.403750 
      32       90.590000       39.382698 
      32       90.630000       39.351304 
      32       90.620000       39.366168 
      32       90.630000       39.391584 
      33       90.660000       39.371097 
      33       90.620000       39.369685 
      33       90.630000       39.393869 
      33       90.620000       39.374252 
      33       90.590000       39.386725 
      33       90.590000       39.410523 
      33       90.670000       39.436961 
      33       90.660000       39.531977 
      33       90.630000       39.533263 
      33       90.630000       39.455399 
      34       90.640000       39.424839 
      34       90.600000       39.439685 
      34       90.540000       39.466071 
      34       90.630000       39.436518 
      34       90.660000       39.405123 
      34       90.620000       39.428435 
      34       90.610000       39.428404 
      34       90.590000       39.406479 
      34       90.580000       39.367417 
      34       90.640000       39.350014 
      34       90.590000       39.366474 
      35       90.590000       39.330259 
      35       90.600000       39.270128 
      35       90.610000       39.240146 
      35       90.630000       39.224405 
      35       90.560000       39.252229 
      35       90.570000       39.250388 
      35       90.620000       39.221331 
      35       90.650000       39.225349 
      35       90.600000       39.281356 
      35       90.610000       39.399266 
      35       90.610000       39.466818 
      35       90.600000       39.399266 
      35       90.600000       39.281356 
      36       90.570000       39.225362 
      36       90.640000       39.221762 
      36       90.550000       39.255384 
      36       90.520000       39.272356 
      36       90.630000       39.256246 
      36       90.580000       39.295254 
      36       90.610000       39.348960 
      36       90.590000       39.295250 
      36       90.530000       39.192598 
      36       90.600000       39.184125 
      36       90.590000       39.245458 
      37       90.620000       39.271013 
      37       90.560000       39.249504 
      37       90.540000       39.255316 
      37       90.650000       39.242303 
      37       90.570000       39.180511 
      37       90.550000       39.172883 
      37       90.610000       39.202853 
      37       90.560000       39.219988 
      37       90.600000       39.256189 
      37       90.620000       39.282268 
      37       90.550000       39.293855 
      37       90.560000       39.327118 
      37       90.560000       39.323838 
      38       90.550000       39.292207 
      38       90.570000       39.265589 
      38       90.570000       39.263483 
      38       90.490000       39.264273 
      38       90.580000       39.276426 
      38       90.580000       39.255773 
      38       90.580000       39.221277 
      38       90.540000       39.218164 
      38       90.580000       39.234730 
      38       90.570000       39.253572 
      38       90.510000       39.256730 
      39       90.570000       39.320820 
      39       90.550000       39.411310 
      39       90.550000       39.426591 
      39       90.520000       39.400570 
      39       90.570000       39.336974 
      39       90.600000       39.276441 
      39       90.490000       39.269810 
      39       90.500000       39.290269 
      39       90.540000       39.337917 
      39       90.520000       39.376745 
      39       90.500000       39.385850 
      39       90.610000       39.311312 
      39       90.500000       39.247883 
      40       90.510000       39.282186 
      40       90.560000       39.322229 
      40       90.540000       39.318523 
      40       90.540000       39.338789 
      40       90.510000       39.358833 
      40       90.520000       39.375123 
      40       90.530000       39.345821 
      40       90.530000       39.282808 
      40       90.550000       39.276401 
      40       90.500000       39.322646 
      40       90.560000       39.328807 
      40       90.550000       39.316377 
      40       90.510000       39.305053 
      40       90.510000       39.282738 
      40       90.580000       39.251344 
      41       90.550000       39.267471 
      41       90.490000       39.306895 
      41       90.540000       39.332891 
      41       90.560000       39.340987 
      41       90.550000       39.287142 
      41       90.500000       39.248313 
      41       90.520000       39.311339 
      41       90.510000       39.386267 
      41       89.870000       39.381285 
      41       90.330000       39.352188 
      42       90.560000       39.292111 
      42       90.330000       39.256756 
      42       90.580000       39.283168 
      42       90.540000       39.304637 
      42       90.430000       39.311408 
      42       90.670000       39.309579 
      42       90.530000       39.301939 
      42       90.470000       39.271514 
      42       90.530000       39.263843 
      42       90.490000       39.263400 
      42       90.550000       39.199752 
      42       90.500000       39.177866 
      42       90.490000       39.203725 
      43       90.490000       39.225374 
      43       90.540000       39.279514 
      43       90.480000       39.311793 
      43       90.450000       39.274614 
      43       90.510000       39.271540 
      43       90.510000       39.292027 
      43       90.560000       39.271111 
      43       90.460000       39.269672 
      43       90.510000       39.293439 
      43       90.490000       39.269242 
      44       90.490000       39.266141 
      44       90.530000       39.272786 
      44       90.460000       39.250444 
      44       90.450000       39.266115 
      44       90.450000       39.290724 
      44       90.530000       39.261172 
      44       90.540000       39.231593 
      44       90.530000       39.255330 
      44       90.460000       39.260698 
      44       90.530000       39.197067 
      45       90.510000       39.167541 
      45       90.390000       39.227049 
      45       90.550000       39.270597 
      45       90.390000       39.263413 
      45       90.510000       39.259360 
      45       90.420000       39.256286 
      45       90.550000       39.309566 
      45       90.440000       39.356671 
      45       90.460000       39.313123 
      45       90.440000       39.279641 
      45       90.430000       39.289356 
      45       90.400000       39.316374 
      46       90.450000       39.280870 
      46       90.470000       39.237918 
      46       90.410000       39.272427 
      46       90.520000       39.339562 
      46       90.420000       39.350886 
      46       90.410000       39.318496 
      46       90.540000       39.309193 
      46       90.260000       39.288927 
      46       90.370000       39.281879 
      46       90.460000       39.257546 
      46       90.270000       39.237501 
      46       90.380000       39.291185 
      47       90.600000       39.359342 
      47       90.150000       39.344048 
      47       90.610000       39.276926 
      47       90.400000       39.246804 
      47       90.610000       39.258554 
      47       90.680000       39.264729 
      47       90.240000       39.287211 
      47       90.700000       39.304154 
      47       90.440000       39.300676 
      47       90.400000       39.262918 
      48       90.570000       39.242457 
      48       90.350000       39.305054 
      48       90.440000       39.356684 
      48       90.350000       39.318066 
      48       90.430000       39.298465 
      48       90.430000       39.305926 
      48       90.540000       39.311018 
      48       90.300000       39.304584 
      48       90.440000       39.281838 
      48       90.430000       39.240532 
      48       90.320000       39.218634 
      48       90.480000       39.221734 
      48       90.310000       39.261185 
      49       90.240000       39.301066 
      49       90.450000       39.309566 
      49       90.360000       39.311864 
      49       90.390000       39.310439 
      49       90.580000       39.311435 
      49       90.490000       39.304637 
      50       90.380000       39.283168 
      50       90.410000       39.256689 
      50       90.320000       39.289895 
      50       90.430000       39.325193 
      50       90.400000       39.260299 
      50       90.290000       39.186782 
      50       90.330000       39.189897 
      50       90.430000       39.215489 
      51       90.300000       39.255786 
      51       90.120000       39.282671 
      51       90.130000       39.298381 
      51       91.020000       39.340934 
      51       89.980000       39.319877 
      51       90.250000       39.250874 
      51       90.630000       39.224006 
      51       90.440000       39.235160 
      51       90.720000       39.252672 
      52       90.210000       39.245032 
      52       90.410000       39.261158 
      52       90.350000       39.276856 
      52       90.320000       39.263856 
      52       90.360000       39.258488 
      52       90.270000       39.245488 
      53       90.270000       39.261172 
      53       90.430000       39.276856 
      53       90.120000       39.263829 
      53       90.530000       39.257614 
      53       89.810000       39.235106 
      53       90.560000       39.217304 
      53       90.230000       39.210896 
      53       90.390000       39.211904 
      53       90.340000       39.210439 
      53       90.200000       39.211435 
      53       90.470000       39.204637 
      53       90.390000       39.183168 
      54       90.310000       39.156730 
      54       90.250000       39.191225 
      54       90.320000       39.241417 
      54       90.370000       39.233803 
      54       90.370000       39.218150 
      54       90.400000       39.221694 
      54       90.280000       39.260299 
      54       90.270000       39.290241 
      54       90.370000       39.260285 
      54       90.260000       39.221251 
      55       90.330000       39.212791 
      55       90.320000       39.210936 
      55       90.330000       39.217720 
      55       90.290000       39.239619 
      55       90.340000       39.271013 
      55       90.290000       39.255316 
      55       90.300000       39.220821 
      56       90.310000       39.212764 
      56       90.330000       39.210466 
      56       90.210000       39.211435 
      56       90.330000       39.204624 
      56       90.280000       39.182725 
      56       90.320000       39.151331 
      57       90.320000       39.167028 
      57       90.340000       39.201523 
      57       90.300000       39.209580 
      57       90.340000       39.211864 
      57       90.390000       39.210452 
      57       90.140000       39.211891 
      57       90.380000       39.210453 
      57       90.180000       39.211891 
      57       90.180000       39.210453 
      57       90.240000       39.211891 
      58       90.350000       39.210453 
      58       90.310000       39.211904 
      58       90.250000       39.210896 
      58       90.280000       39.217263 
      58       90.350000       39.233763 
      58       90.120000       39.240987 
      58       90.400000       39.186256 
      58       90.220000       39.137515 
      58       90.270000       39.162945 
      59       90.260000       39.206505 
      59       90.320000       39.233764 
      59       90.180000       39.251758 
      59       90.300000       39.234649 
      59       90.330000       39.217290 
      59       90.270000       39.210896 
      59       90.310000       39.211905 
      59       90.230000       39.210479 
      60       90.280000       39.212764 
      60       90.260000       39.220821 
      60       90.200000       39.255316 
      60       90.280000       39.271013 
      60       90.220000       39.239619 
      60       90.250000       39.217720 
      60       90.210000       39.210936 
      60       90.300000       39.212791 
      60       90.270000       39.221251 
