

 time    ||    gripping force   ||   raspberry measurement 

      0       0.090000       -802.494643 
      0       0.100000       -802.494643 
      0       0.140000       -802.494643 
      0       0.090000       -802.494643 
      0       0.100000       -802.494643 
      0       0.100000       -802.494643 
      0       0.110000       -802.494643 
      0       0.130000       -802.494643 
      0       0.070000       -802.494643 
      0       0.090000       -802.494643 
      0       0.080000       -802.494643 
      0       0.090000       -802.494643 
      0       0.620000       -802.494643 
      0       0.260000       -802.494643 
      0       0.620000       -802.494643 
      0       0.000000       -802.494643 
      0       0.190000       -802.494643 
      0       0.170000       -802.494643 
      0       0.190000       -802.494643 
      0       0.130000       -802.494643 
      1       0.110000       -794.469696 
      1       0.160000       -794.469696 
      1       0.030000       -786.524999 
      1       0.030000       -786.524999 
      1       0.050000       -778.659749 
      1       0.020000       -778.659749 
      1       0.150000       -778.659749 
      1       0.260000       -770.873152 
      1       0.230000       -763.164420 
      1       0.280000       -763.164420 
      1       0.490000       -755.532776 
      1       0.490000       -747.977444 
      1       0.410000       -747.977444 
      1       0.540000       -747.977444 
      1       3.750000       -740.496489 
      2       16.920000       -740.496489 
      2       27.890000       -732.985265 
      2       53.880000       -729.430910 
      2       87.870000       -686.129738 
      2       96.430000       -686.129738 
      2       96.730000       -492.064691 
      2       95.010000       -172.099127 
      2       107.890000       21.958724 
      2       115.620000       21.958724 
      2       119.440000       21.958724 
      2       119.100000       21.958724 
      2       118.370000       21.958724 
      2       115.640000       21.958724 
      2       106.730000       65.233054 
      2       89.550000       68.803523 
      2       70.760000       68.945363 
      2       45.530000       68.954613 
      2       35.070000       68.956904 
      3       26.520000       68.955626 
      3       25.230000       68.961524 
      3       25.920000       69.015030 
      3       26.260000       69.015030 
      3       26.570000       69.271479 
      3       27.530000       69.745193 
      3       28.930000       70.198025 
      3       31.680000       70.522057 
      3       35.350000       70.645402 
      3       39.590000       70.638328 
      3       43.580000       70.687631 
      3       44.640000       70.581220 
      3       44.550000       70.251504 
      3       42.890000       70.251504 
      3       39.490000       69.947424 
      4       37.800000       69.688765 
      4       35.950000       69.397820 
      4       34.390000       69.171439 
      4       32.960000       69.171439 
      4       32.850000       69.074940 
      4       32.600000       69.059308 
      4       31.480000       69.068614 
      4       30.810000       69.134643 
      4       29.650000       69.286914 
      4       28.810000       69.472626 
      4       27.980000       69.627168 
      4       27.730000       69.765346 
      4       27.440000       69.836942 
      4       27.310000       69.842947 
      4       27.360000       69.784076 
      5       27.390000       69.662341 
      5       27.230000       69.551935 
      5       27.310000       69.514390 
      5       27.330000       69.498942 
      5       27.360000       69.471284 
      5       27.380000       69.398499 
      5       27.380000       69.308978 
      5       27.440000       69.227295 
      5       27.460000       69.227295 
      5       27.420000       69.217062 
      5       27.460000       69.236193 
      5       27.430000       69.205364 
      5       27.470000       69.166799 
      5       27.840000       69.165430 
      5       28.190000       69.206710 
      6       28.620000       69.317836 
      6       29.120000       69.380045 
      6       29.390000       69.294125 
      6       29.570000       69.231780 
      6       29.860000       69.231780 
      6       29.980000       69.231780 
      6       30.040000       69.244803 
      6       30.140000       69.234004 
      6       30.280000       69.237648 
      6       30.260000       69.249635 
      6       30.250000       69.245701 
      6       30.270000       69.207110 
      6       30.430000       69.178014 
      6       30.460000       69.217478 
      6       30.460000       69.290012 
      7       30.490000       69.320980 
      7       30.470000       69.313340 
      7       30.440000       69.316065 
      7       30.460000       69.272141 
      7       30.440000       69.213949 
      7       30.420000       69.259645 
      7       30.430000       69.394941 
      7       30.420000       69.497168 
      7       30.390000       69.482747 
      7       30.420000       69.391937 
      7       30.450000       69.391937 
      7       30.450000       69.323224 
      7       30.390000       69.323224 
      7       30.360000       69.323224 
      7       30.380000       69.323224 
      7       30.450000       69.325618 
      8       30.340000       69.381902 
      8       30.410000       69.440274 
      8       30.390000       69.363074 
      8       30.430000       69.240418 
      8       30.380000       69.240418 
      8       30.390000       69.220194 
      8       30.390000       69.220194 
      8       30.390000       69.325505 
      8       30.420000       69.420091 
      8       30.340000       69.420091 
      8       30.340000       69.403442 
      8       30.390000       69.403442 
      8       30.330000       69.378942 
      8       30.340000       69.410626 
      9       30.340000       69.466744 
      9       30.360000       69.472059 
      9       30.320000       69.472059 
      9       30.390000       69.440234 
      9       30.360000       69.440234 
      9       30.300000       69.440234 
      9       30.320000       69.357762 
      9       30.320000       69.357762 
      9       30.330000       69.279839 
      9       30.320000       69.269914 
      9       30.300000       69.243018 
      9       30.380000       69.260074 
      9       30.400000       69.350533 
      9       30.300000       69.348234 
      9       30.310000       69.348234 
      9       30.350000       69.250674 
      10       30.300000       69.191856 
      10       30.310000       69.175339 
      10       30.360000       69.175339 
      10       30.280000       69.156488 
      10       30.290000       69.216592 
      10       30.370000       69.300727 
      10       30.310000       69.304934 
      10       30.370000       69.297228 
      10       30.310000       69.297228 
      10       30.270000       69.344832 
      10       30.330000       69.433037 
      10       30.290000       69.524093 
      10       30.340000       69.502028 
      10       30.310000       69.392341 
      10       30.290000       69.392341 
      11       30.270000       69.392341 
      11       30.290000       69.308080 
      11       30.290000       69.308466 
      11       30.270000       69.308466 
      11       30.280000       69.332759 
      11       30.330000       69.358161 
      11       30.280000       69.393656 
      11       30.320000       69.381445 
      11       30.210000       69.366327 
      11       30.210000       69.296742 
      11       30.160000       69.213116 
      11       30.160000       69.225980 
      11       30.050000       69.317505 
      11       29.950000       69.442906 
      11       29.880000       69.524952 
      12       29.780000       69.502084 
      12       29.770000       69.456848 
      12       29.830000       69.406183 
      12       29.830000       69.354658 
      12       29.820000       69.298637 
      12       29.770000       69.227778 
      12       29.830000       69.234173 
      12       29.800000       69.321395 
      12       29.790000       69.321395 
      12       29.790000       69.396367 
      12       29.830000       69.432151 
      12       29.800000       69.461760 
      12       29.740000       69.430366 
      12       29.810000       69.394582 
      12       29.770000       69.387355 
      13       29.810000       69.331790 
      13       29.790000       69.288356 
      13       29.890000       69.336262 
      13       29.900000       69.399827 
      13       29.930000       69.373941 
      13       30.030000       69.309741 
      13       30.100000       69.309741 
      13       30.110000       69.261027 
      13       30.050000       69.230865 
      13       30.080000       69.288838 
      13       30.040000       69.288838 
      13       30.100000       69.357648 
      13       30.100000       69.366354 
      13       30.080000       69.321411 
      13       30.110000       69.328222 
      14       30.090000       69.394068 
      14       30.060000       69.418195 
      14       30.090000       69.331819 
      14       30.110000       69.235835 
      14       30.080000       69.237743 
      14       30.120000       69.271216 
      14       30.040000       69.366398 
      14       30.090000       69.472862 
      14       30.110000       69.485111 
      14       30.060000       69.425441 
      14       30.090000       69.416524 
      14       30.060000       69.416524 
      14       30.100000       69.429477 
      14       30.070000       69.365359 
      15       30.050000       69.257900 
      15       30.090000       69.222822 
      15       30.040000       69.222822 
      15       30.050000       69.255669 
      15       30.010000       69.294541 
      15       30.040000       69.294541 
      15       30.030000       69.294541 
      15       30.110000       69.383424 
      15       30.110000       69.468822 
      15       30.010000       69.468822 
      15       30.080000       69.524203 
      15       30.100000       69.533343 
      15       30.050000       69.533343 
      15       30.060000       69.482081 
      15       30.100000       69.413285 
      15       30.050000       69.375891 
      16       30.080000       69.375891 
      16       30.090000       69.321383 
      16       30.020000       69.321383 
      16       30.070000       69.321383 
      16       30.090000       69.340514 
      16       30.040000       69.442381 
      16       30.020000       69.442381 
      16       30.040000       69.516533 
      16       30.070000       69.463091 
      16       30.090000       69.428249 
      16       30.040000       69.453289 
      16       30.060000       69.453289 
      16       30.080000       69.479284 
      16       30.070000       69.479284 
      16       30.030000       69.501740 
      17       30.020000       69.498055 
      17       30.070000       69.473056 
      17       30.080000       69.420982 
      17       30.000000       69.416565 
      17       30.100000       69.416565 
      17       30.010000       69.435306 
      17       30.000000       69.435306 
      17       29.940000       69.395022 
      17       29.960000       69.324180 
      17       29.840000       69.312995 
      17       29.900000       69.394525 
      17       29.960000       69.439291 
      17       29.990000       69.439291 
      17       29.950000       69.359090 
      17       29.910000       69.276657 
      18       29.910000       69.248374 
      18       29.870000       69.212992 
      18       29.940000       69.206737 
      18       29.900000       69.271188 
      18       29.970000       69.271188 
      18       29.910000       69.310263 
      18       29.980000       69.285556 
      18       29.910000       69.279802 
      18       29.930000       69.338463 
      18       29.890000       69.414678 
      18       29.910000       69.365332 
      18       29.910000       69.271745 
      18       29.880000       69.287882 
      18       29.880000       69.287882 
      18       29.950000       69.287882 
      19       29.860000       69.326294 
      19       29.980000       69.326294 
      19       29.910000       69.296451 
      19       29.850000       69.293614 
      19       29.930000       69.330447 
      19       29.870000       69.299456 
      19       29.910000       69.326490 
      19       29.890000       69.395731 
      19       29.900000       69.374437 
      19       29.930000       69.320956 
      19       29.850000       69.314377 
      19       29.900000       69.329465 
      19       29.890000       69.353399 
      19       29.910000       69.359061 
      19       29.860000       69.384297 
      19       29.880000       69.414656 
      20       29.850000       69.414656 
      20       29.910000       69.468488 
      20       29.890000       69.468431 
      20       29.960000       69.349245 
      20       30.000000       69.211251 
      20       29.990000       69.169059 
      20       30.020000       69.251571 
      20       30.000000       69.318652 
      20       29.990000       69.280186 
      20       30.010000       69.225038 
      20       29.930000       69.217447 
      20       29.970000       69.178401 
      20       29.990000       69.147199 
      20       29.970000       69.227211 
      20       29.980000       69.312521 
      21       29.950000       69.335279 
      21       29.950000       69.364046 
      21       29.980000       69.333950 
      21       29.960000       69.316578 
      21       29.950000       69.322767 
      21       29.970000       69.308881 
      21       29.980000       69.302210 
      21       29.970000       69.274745 
      21       29.970000       69.238158 
      21       30.010000       69.238158 
      21       29.910000       69.216523 
      21       29.980000       69.239474 
      21       29.980000       69.290513 
      21       30.000000       69.369844 
      21       30.070000       69.409725 
      22       30.060000       69.378344 
      22       30.140000       69.332705 
      22       30.090000       69.332705 
      22       30.090000       69.286457 
      22       30.110000       69.286457 
      22       30.120000       69.268668 
      22       30.140000       69.268668 
      22       30.060000       69.286483 
      22       30.060000       69.333578 
      22       30.110000       69.388727 
      22       30.060000       69.453647 
      22       30.140000       69.437563 
      22       30.180000       69.363590 
      22       30.150000       69.377985 
      22       30.130000       69.373788 
      23       30.120000       69.285680 
      23       30.150000       69.197712 
      23       30.140000       69.170883 
      23       30.130000       69.202211 
      23       30.160000       69.299024 
      23       30.080000       69.363462 
      23       30.210000       69.299024 
      23       30.120000       69.202184 
      23       30.120000       69.169983 
      23       30.140000       69.186457 
      23       30.190000       69.231443 
      23       30.080000       69.264377 
      23       30.040000       69.264586 
      23       30.140000       69.277003 
      23       30.140000       69.277003 
      24       30.060000       69.347485 
      24       30.110000       69.315526 
      24       30.170000       69.252114 
      24       30.200000       69.307969 
      24       30.120000       69.381512 
      24       30.130000       69.388284 
      24       29.960000       69.400314 
      24       29.990000       69.392324 
      24       29.870000       69.345662 
      24       29.830000       69.349306 
      24       29.870000       69.397183 
      24       29.880000       69.415148 
      24       29.850000       69.312939 
      24       29.840000       69.238163 
      24       29.890000       69.328206 
      24       29.870000       69.328206 
      25       29.880000       69.413266 
      25       29.850000       69.413266 
      25       29.830000       69.379340 
      25       29.900000       69.320955 
      25       29.850000       69.309421 
      25       29.920000       69.310223 
      25       29.820000       69.332236 
      25       29.810000       69.348305 
      25       29.860000       69.334863 
      25       29.870000       69.257816 
      25       29.860000       69.257816 
      25       29.870000       69.257816 
      25       29.910000       69.186957 
      25       29.950000       69.186957 
      26       29.870000       69.186957 
      26       29.800000       69.186957 
      26       29.730000       69.214377 
      26       29.880000       69.263517 
      26       29.880000       69.271740 
      26       29.910000       69.239793 
      26       29.870000       69.239017 
      26       30.010000       69.261320 
      26       30.030000       69.304477 
      26       30.020000       69.330753 
      26       30.060000       69.291924 
      26       30.080000       69.274789 
      26       30.160000       69.313420 
      26       30.040000       69.313420 
      26       30.080000       69.298955 
      27       30.040000       69.272657 
      27       30.080000       69.279674 
      27       30.050000       69.279674 
      27       30.030000       69.286066 
      27       30.060000       69.286066 
      27       29.980000       69.231777 
      27       30.090000       69.189282 
      27       30.070000       69.248377 
      27       30.100000       69.364002 
      27       30.050000       69.421795 
      27       30.090000       69.364002 
      27       30.030000       69.248390 
      27       30.110000       69.189698 
      27       30.080000       69.189698 
      27       30.050000       69.236303 
      27       30.120000       69.236303 
      28       30.040000       69.236303 
      28       30.050000       69.299894 
      28       30.020000       69.276130 
      28       30.130000       69.235863 
      28       30.020000       69.235863 
      28       29.990000       69.235863 
      28       30.030000       69.235863 
      28       30.040000       69.271671 
      28       30.020000       69.271671 
      28       30.160000       69.287798 
      28       30.080000       69.260100 
      28       30.080000       69.306613 
      28       30.080000       69.356442 
      28       30.080000       69.356442 
      28       29.950000       69.333964 
      28       30.070000       69.324665 
      29       30.120000       69.358147 
      29       30.060000       69.401252 
      29       30.020000       69.401252 
      29       30.070000       69.348748 
      29       30.130000       69.348748 
      29       30.040000       69.271271 
      29       29.990000       69.234492 
      29       30.080000       69.215676 
      29       30.060000       69.233606 
      29       30.070000       69.260487 
      29       30.050000       69.300824 
      29       29.970000       69.327722 
      29       30.120000       69.327722 
      29       29.990000       69.343849 
      29       30.090000       69.390914 
      30       30.010000       69.383243 
      30       30.060000       69.305310 
      30       30.020000       69.217895 
      30       30.050000       69.167282 
      30       30.080000       69.167282 
      30       30.090000       69.159629 
      30       30.110000       69.159629 
      30       29.940000       69.159629 
      30       30.120000       69.177611 
      30       30.000000       69.260903 
      30       29.960000       69.361305 
      30       29.830000       69.395826 
      30       29.830000       69.385931 
      30       29.840000       69.385931 
      30       29.820000       69.385931 
      31       29.870000       69.385931 
      31       29.830000       69.311126 
      31       29.830000       69.244414 
      31       29.850000       69.217020 
      31       29.810000       69.217020 
      31       29.790000       69.174458 
      31       29.800000       69.270429 
      31       29.870000       69.462961 
      31       29.830000       69.456760 
      31       29.830000       69.456760 
      31       29.840000       69.456760 
      31       29.780000       69.295056 
      31       29.840000       69.230895 
      31       29.820000       69.253370 
      31       29.880000       69.279312 
      32       29.880000       69.302653 
      32       29.900000       69.309740 
      32       29.910000       69.332248 
      32       29.950000       69.332248 
      32       29.960000       69.349151 
      32       29.960000       69.344344 
      32       29.960000       69.290416 
      32       29.960000       69.198237 
      32       29.950000       69.151559 
      32       29.990000       69.175312 
      32       29.930000       69.195912 
      32       29.930000       69.258687 
      32       29.940000       69.258687 
      32       29.890000       69.258687 
      32       30.010000       69.315927 
      33       29.990000       69.315927 
      33       30.070000       69.258673 
      33       30.070000       69.195469 
      33       30.040000       69.169926 
      33       30.000000       69.127778 
      33       30.080000       69.162869 
      33       30.000000       69.280073 
      33       30.040000       69.336234 
      33       30.080000       69.336234 
      33       30.030000       69.320940 
      33       30.030000       69.331735 
      33       30.060000       69.266688 
      33       30.080000       69.171799 
      33       30.110000       69.188312 
      33       30.050000       69.231290 
      34       29.980000       69.216579 
      34       30.110000       69.225468 
      34       30.120000       69.286012 
      34       30.050000       69.284197 
      34       29.930000       69.223320 
      34       30.050000       69.213842 
      34       30.050000       69.304894 
      34       30.060000       69.382783 
      34       30.070000       69.321880 
      34       30.050000       69.231864 
      34       30.050000       69.231864 
      34       30.090000       69.283368 
      34       30.020000       69.352332 
      34       30.080000       69.347489 
      34       29.910000       69.369818 
      34       30.030000       69.351849 
      35       30.060000       69.254258 
      35       30.030000       69.212523 
      35       30.040000       69.194567 
      35       30.080000       69.161457 
      35       30.050000       69.216982 
      35       30.010000       69.299410 
      35       30.050000       69.299410 
      35       30.050000       69.288670 
      35       30.030000       69.222421 
      35       29.940000       69.198127 
      35       29.980000       69.238547 
      35       30.020000       69.296686 
      35       29.980000       69.318708 
      35       29.980000       69.214237 
      35       30.030000       69.065985 
      35       30.040000       69.065985 
      36       30.050000       69.031933 
      36       30.030000       69.161843 
      36       30.030000       69.161843 
      36       30.030000       69.319594 
      36       30.040000       69.319594 
      36       29.990000       69.359851 
      36       30.060000       69.319167 
      36       29.980000       69.220494 
      36       30.020000       69.220494 
      36       30.090000       69.100037 
      36       29.940000       69.044002 
      36       29.980000       69.107566 
      36       30.070000       69.185569 
      36       30.030000       69.196740 
      37       30.000000       69.173513 
      37       30.030000       69.128207 
      37       29.990000       69.164171 
      37       29.980000       69.294942 
      37       30.070000       69.392655 
      37       29.990000       69.392655 
      37       30.040000       69.368905 
      37       29.990000       69.294998 
      37       30.110000       69.253276 
      37       30.020000       69.253276 
      37       29.990000       69.212119 
      37       30.060000       69.191426 
      37       30.050000       69.208965 
      37       30.030000       69.233964 
      37       30.050000       69.272144 
      38       30.080000       69.273443 
      38       30.030000       69.252886 
      38       30.070000       69.230023 
      38       30.010000       69.285197 
      38       29.980000       69.420897 
      38       30.060000       69.420897 
      38       30.030000       69.451861 
      38       30.010000       69.383314 
      38       30.000000       69.310254 
      38       30.020000       69.256957 
      38       30.050000       69.287855 
      38       29.990000       69.340222 
      38       30.040000       69.341616 
      38       29.990000       69.287315 
      38       29.990000       69.183466 
      39       29.940000       69.163673 
      39       30.000000       69.255171 
      39       30.010000       69.346450 
      39       29.990000       69.410238 
      39       29.970000       69.386787 
      39       30.020000       69.308978 
      39       30.100000       69.239006 
      39       30.030000       69.278027 
      39       30.050000       69.386025 
      39       30.000000       69.432094 
      39       30.010000       69.406642 
      39       29.970000       69.406642 
      39       29.990000       69.362687 
      39       30.020000       69.333978 
      39       29.920000       69.333978 
      40       29.960000       69.252944 
      40       30.010000       69.234988 
      40       30.000000       69.234988 
      40       30.070000       69.307110 
      40       29.950000       69.322780 
      40       30.040000       69.384739 
      40       30.020000       69.436041 
      40       29.960000       69.369068 
      40       30.050000       69.320539 
      40       30.020000       69.315179 
      40       29.990000       69.274373 
      40       29.990000       69.285666 
      40       30.030000       69.296684 
      40       30.020000       69.296684 
      40       30.060000       69.228289 
      41       29.990000       69.221026 
      41       30.020000       69.326362 
      41       29.980000       69.342863 
      41       29.980000       69.251144 
      41       30.020000       69.203500 
      41       29.970000       69.233658 
      41       29.950000       69.274329 
      41       30.030000       69.302223 
      41       30.010000       69.309727 
      41       30.030000       69.332248 
      41       30.010000       69.349191 
      41       30.010000       69.345661 
      41       29.980000       69.306250 
      41       30.070000       69.268115 
      41       29.990000       69.268115 
      42       30.010000       69.268115 
      42       30.000000       69.280272 
      42       30.000000       69.362258 
      42       30.010000       69.455419 
      42       30.010000       69.399454 
      42       30.000000       69.315210 
      42       30.000000       69.326005 
      42       30.040000       69.329962 
      42       30.110000       69.348929 
      42       30.010000       69.409660 
      42       29.980000       69.483312 
      42       29.960000       69.483312 
      42       29.960000       69.466146 
      42       29.980000       69.327763 
      42       30.010000       69.179897 
      43       30.020000       69.185643 
      43       30.010000       69.296878 
      43       30.060000       69.375573 
      43       30.020000       69.368586 
      43       29.990000       69.308372 
      43       30.030000       69.335003 
      43       29.950000       69.363491 
      43       29.950000       69.363491 
      43       29.970000       69.350241 
      43       30.030000       69.307957 
      43       30.030000       69.283009 
      43       30.060000       69.337109 
      43       30.000000       69.414735 
      43       29.920000       69.432068 
      43       30.010000       69.377139 
      43       30.010000       69.295843 
      44       30.080000       69.277251 
      44       30.010000       69.319597 
      44       30.070000       69.417047 
      44       30.070000       69.417047 
      44       29.980000       69.457138 
      44       30.010000       69.457138 
      44       29.970000       69.457138 
      44       30.040000       69.430515 
      44       29.990000       69.430515 
      44       30.020000       69.381421 
      44       30.070000       69.348996 
      44       30.000000       69.360378 
      44       30.010000       69.404561 
      44       30.040000       69.404561 
      44       30.010000       69.432096 
      45       30.050000       69.474428 
      45       30.050000       69.481875 
      45       29.980000       69.490524 
      45       30.000000       69.441538 
      45       30.020000       69.354728 
      45       30.010000       69.329066 
      45       30.000000       69.306653 
      45       30.030000       69.288781 
      45       30.010000       69.282439 
      45       30.020000       69.219707 
      45       30.060000       69.219707 
      45       30.080000       69.213067 
      45       30.040000       69.364929 
      45       29.960000       69.469301 
      45       30.050000       69.469301 
      46       29.970000       69.469301 
      46       30.050000       69.399525 
      46       30.010000       69.367205 
      46       30.020000       69.438946 
      46       30.040000       69.468003 
      46       30.050000       69.460045 
      46       30.020000       69.438340 
      46       30.050000       69.438340 
      46       29.970000       69.438340 
      46       30.030000       69.366811 
      46       30.030000       69.246589 
      46       30.010000       69.246589 
      46       30.050000       69.187054 
      46       30.040000       69.226422 
      46       29.940000       69.328604 
      47       29.990000       69.328604 
      47       29.900000       69.345161 
      47       29.900000       69.256004 
      47       29.850000       69.256004 
      47       29.870000       69.239947 
      47       29.880000       69.320938 
      47       29.870000       69.384669 
      47       29.890000       69.384669 
      47       29.900000       69.372059 
      47       29.920000       69.322337 
      47       29.850000       69.248417 
      47       29.920000       69.248417 
      47       29.940000       69.232264 
      47       29.860000       69.297254 
      47       29.880000       69.332148 
      48       29.920000       69.297254 
      48       29.930000       69.232250 
      48       29.820000       69.248001 
      48       29.860000       69.317837 
      48       29.890000       69.359104 
      48       29.840000       69.359104 
      48       29.890000       69.359104 
      48       29.920000       69.398568 
      48       29.850000       69.400713 
      48       29.900000       69.322434 
      48       29.850000       69.286500 
      48       29.910000       69.343890 
      48       29.900000       69.367586 
      48       29.940000       69.350591 
      48       29.870000       69.350591 
      48       29.910000       69.350591 
      49       29.930000       69.306210 
      49       29.870000       69.261829 
      49       29.920000       69.244874 
      49       29.880000       69.269859 
      49       29.900000       69.342090 
      49       29.800000       69.361704 
      49       29.940000       69.361704 
      49       29.950000       69.321060 
      49       29.960000       69.244294 
      49       30.090000       69.223404 
      49       30.120000       69.320039 
      49       30.090000       69.390051 
      49       30.110000       69.390051 
      49       30.090000       69.333495 
      49       30.130000       69.333495 
      50       30.110000       69.284798 
      50       30.130000       69.284798 
      50       30.090000       69.284798 
      50       30.080000       69.284798 
      50       30.080000       69.311083 
      50       30.060000       69.366784 
      50       30.120000       69.372946 
      50       30.080000       69.351047 
      50       30.070000       69.306680 
      50       30.080000       69.267672 
      50       30.050000       69.274497 
      50       30.120000       69.334877 
      50       30.120000       69.418336 
      50       30.090000       69.456765 
      50       30.060000       69.489597 
      51       30.150000       69.454479 
      51       30.090000       69.345718 
      51       30.070000       69.266343 
      51       30.090000       69.219288 
      51       30.120000       69.161056 
      51       30.040000       69.208554 
      51       30.130000       69.409779 
      51       30.080000       69.541421 
      51       30.090000       69.484202 
      51       30.050000       69.484202 
      51       30.070000       69.408870 
      51       30.070000       69.403910 
      51       30.100000       69.330407 
      51       30.000000       69.253815 
      51       30.090000       69.253815 
      51       30.090000       69.228565 
      52       30.110000       69.136747 
      52       30.070000       69.136747 
      52       30.070000       69.066454 
      52       30.090000       69.095427 
      52       30.090000       69.117545 
      52       30.030000       69.174830 
      52       30.040000       69.289183 
      52       30.100000       69.289183 
      52       30.030000       69.352292 
      52       30.010000       69.406265 
      52       30.010000       69.439226 
      52       30.000000       69.431389 
      52       30.100000       69.409781 
      52       30.100000       69.404908 
      52       30.060000       69.407569 
      53       30.090000       69.488243 
      53       30.080000       69.488243 
      53       30.110000       69.572887 
      53       30.100000       69.572887 
      53       30.040000       69.477884 
      53       29.920000       69.300053 
      53       29.880000       69.250691 
      53       29.860000       69.347098 
      53       29.830000       69.424522 
      53       29.910000       69.415665 
      53       29.850000       69.420511 
      53       29.850000       69.467602 
      53       29.910000       69.472032 
      53       29.870000       69.438476 
      53       29.900000       69.336649 
      54       29.900000       69.189739 
      54       29.880000       69.149415 
      54       29.870000       69.242975 
      54       29.870000       69.315648 
      54       29.830000       69.337980 
      54       29.870000       69.372089 
      54       29.860000       69.372089 
      54       29.870000       69.367546 
      54       29.900000       69.321061 
      54       29.860000       69.321061 
      54       29.920000       69.238492 
      54       29.820000       69.194681 
      54       29.850000       69.266316 
      54       29.820000       69.369358 
      54       29.890000       69.363532 
      55       29.820000       69.363532 
      55       29.850000       69.294555 
      55       29.900000       69.253302 
      55       29.850000       69.213409 
      55       29.910000       69.206321 
      55       29.860000       69.266245 
      55       29.940000       69.291854 
      55       29.880000       69.273433 
      55       29.870000       69.296380 
      55       29.860000       69.280530 
      55       29.930000       69.208579 
      55       30.060000       69.204868 
      55       30.070000       69.273416 
      55       30.110000       69.253342 
      55       30.080000       69.253342 
      56       30.080000       69.215597 
      56       30.040000       69.212136 
      56       30.030000       69.212136 
      56       30.070000       69.212136 
      56       30.080000       69.227277 
      56       30.030000       69.315692 
      56       30.070000       69.315692 
      56       30.090000       69.352695 
      56       30.070000       69.352695 
      56       30.030000       69.383866 
      56       30.090000       69.395718 
      56       30.100000       69.316617 
      56       30.020000       69.262263 
      56       30.070000       69.262263 
      56       30.110000       69.303068 
      57       30.080000       69.331235 
      57       30.040000       69.279754 
      57       30.080000       69.143918 
      57       30.020000       69.061542 
      57       30.100000       69.154287 
      57       30.080000       69.154287 
      57       30.060000       69.324064 
      57       30.030000       69.402554 
      57       30.010000       69.402554 
      57       30.070000       69.377887 
      57       30.030000       69.333954 
      57       30.090000       69.300411 
      57       29.980000       69.313377 
      57       30.070000       69.274342 
      57       30.040000       69.156975 
      58       30.070000       69.187966 
      58       30.060000       69.187966 
      58       30.060000       69.307412 
      58       30.150000       69.307412 
      58       29.900000       69.307412 
      58       30.100000       69.307412 
      58       30.000000       69.309420 
      58       30.110000       69.303499 
      58       30.010000       69.355047 
      58       30.010000       69.338960 
      58       30.060000       69.346591 
      58       29.980000       69.392284 
      58       30.140000       69.392284 
      58       29.940000       69.398082 
      58       30.010000       69.383411 
      59       29.980000       69.364863 
      59       29.970000       69.364863 
      59       30.050000       69.382995 
      59       30.050000       69.382995 
      59       30.030000       69.393530 
      59       30.020000       69.377609 
      59       30.060000       69.377609 
      59       29.990000       69.340666 
      59       30.080000       69.343517 
      59       29.950000       69.373872 
      59       30.050000       69.373872 
      59       30.020000       69.386455 
      59       29.970000       69.341192 
      59       30.040000       69.320136 
      59       30.050000       69.338961 
      60       30.030000       69.315623 
      60       30.020000       69.327377 
      60       30.010000       69.327377 
      60       30.100000       69.390442 
      60       30.020000       69.390442 
      60       29.960000       69.416078 
      60       30.070000       69.395455 
      60       30.080000       69.412025 
      60       29.990000       69.446104 
      60       30.100000       69.448802 
      60       30.030000       69.428166 
      60       30.050000       69.401310 
      60       30.040000       69.430394 
      60       30.020000       69.430394 
      60       30.030000       69.455972 
      61       30.040000       69.455972 
