Human trial picking the raspberry twin 

 time    ||     output compensated 

      0       -800.013043 
      0       -800.013043 
      0       -800.013043 
      0       -800.013043 
      0       -800.013043 
      0       -800.013043 
      0       -800.013043 
      0       -800.013043 
      0       -800.013043 
      0       -800.013039 
      0       -800.011849 
      0       -799.904798 
      0       -796.359750 
      0       -753.171946 
      0       -559.614594 
      0       -240.481409 
      1       -46.907501 
      1       -3.706684 
      1       -0.122184 
      1       0.014863 
      1       -0.013044 
      1       -0.042135 
      1       -0.012153 
      1       0.026882 
      1       0.035355 
      1       0.037626 
      1       0.035355 
      1       0.026882 
      1       -0.012153 
      1       -0.042108 
      1       -0.012153 
      2       0.026855 
      2       0.034469 
      2       0.026828 
      2       -0.013026 
      2       -0.052477 
      2       -0.055578 
      2       -0.033679 
      2       0.007601 
      2       0.029499 
      2       0.026425 
      2       -0.012166 
      2       -0.042109 
      2       -0.012153 
      2       0.026855 
      2       0.034469 
      2       0.026855 
      2       -0.012153 
      2       -0.042108 
      2       -0.012153 
      2       0.026882 
      2       0.035355 
      2       0.037626 
      2       0.035355 
      3       0.026882 
      3       -0.012153 
      3       -0.042108 
      3       -0.012153 
      3       0.026882 
      3       0.035355 
      3       0.037653 
      3       0.036241 
      3       0.037680 
      3       0.036242 
      3       0.037680 
      3       0.036242 
      3       0.037680 
      3       0.036241 
      3       0.037653 
      3       0.035355 
      3       0.026855 
      3       -0.013039 
      3       -0.052933 
      3       -0.061433 
      4       -0.063731 
      4       -0.062306 
      4       -0.063302 
      4       -0.056464 
      4       -0.033706 
      4       0.007627 
      4       0.030386 
      4       0.037223 
      4       0.036228 
      4       0.037680 
      4       0.036242 
      4       0.037680 
      4       0.036241 
      4       0.037653 
      4       0.035355 
      4       0.026882 
      4       -0.012153 
      4       -0.042135 
      4       -0.013039 
      5       0.016057 
      5       -0.013912 
      5       -0.052503 
      5       -0.055578 
      5       -0.033679 
      5       0.007627 
      5       0.030386 
      5       0.037223 
      5       0.036228 
      5       0.037680 
      5       0.036242 
      5       0.037680 
      5       0.036241 
      5       0.037653 
      5       0.035355 
      5       0.026855 
      5       -0.013039 
      5       -0.052907 
      5       -0.060547 
      5       -0.052907 
      5       -0.013039 
      5       0.026855 
      6       0.035355 
      6       0.037653 
      6       0.036241 
      6       0.037680 
      6       0.035879 
      6       0.036944 
      6       0.035151 
      6       0.036223 
      6       0.034437 
      6       0.035490 
      6       0.032860 
      6       0.024143 
      6       -0.014742 
      6       -0.044251 
      6       -0.014153 
      6       0.024607 
      6       0.031898 
      6       0.024042 
      7       -0.014817 
      7       -0.044351 
      7       -0.015102 
      7       0.013880 
      7       -0.015103 
      7       -0.044183 
      7       -0.018965 
      7       0.001232 
      7       -0.006782 
      7       0.001288 
      7       -0.018733 
      7       -0.043295 
      7       -0.012781 
      7       0.025979 
      7       0.033310 
      7       0.027168 
      7       0.008807 
      7       0.065072 
      8       0.214905 
      8       0.318334 
      8       0.402725 
      8       0.559724 
      8       0.760151 
      8       0.877234 
      8       0.925927 
      8       1.077020 
      8       1.343380 
      8       1.628541 
      8       1.948670 
      8       2.277712 
      8       2.554896 
      8       2.778195 
      8       2.955411 
      8       3.169297 
      8       3.458483 
      8       3.708565 
      8       3.844972 
      8       3.885700 
      8       3.892980 
      8       3.879415 
      8       3.809547 
      8       3.615334 
      8       3.336184 
      8       3.106616 
      8       3.003043 
      8       2.945152 
      8       2.903874 
      8       2.895306 
      8       2.892148 
      8       2.883608 
      8       2.843284 
      8       2.798434 
      9       2.771136 
      9       2.753167 
      9       2.771136 
      9       2.798434 
      9       2.843284 
      9       2.883608 
      9       2.892121 
      9       2.894419 
      9       2.893007 
      9       2.894446 
      9       2.893008 
      9       2.894446 
      9       2.892967 
      9       2.893022 
      9       2.873667 
      9       2.782611 
      9       2.583706 
      9       2.419599 
      9       2.347008 
      9       2.309355 
      9       2.407099 
      9       2.550386 
      9       2.655423 
      9       2.777242 
      9       2.841816 
      9       2.820374 
      9       2.789450 
      9       2.745070 
      9       2.714670 
      9       2.744503 
      9       2.779746 
      9       2.736624 
      9       2.434235 
      9       1.513838 
      9       -0.065904 
      9       -1.336013 
      9       -1.332501 
      9       -0.880319 
      9       -0.805675 
      10       -1.118196 
      10       -1.574696 
      10       -1.948575 
      10       -2.219870 
      10       -2.514027 
      10       -2.812597 
      10       -2.971803 
      10       -3.013611 
      10       -3.025616 
      10       -3.034510 
      10       -3.007674 
      10       -2.961236 
      10       -2.913835 
      10       -2.891848 
      10       -2.871612 
      10       -2.846585 
      10       -2.876111 
      10       -2.905247 
      10       -2.876125 
      11       -2.847028 
      11       -2.877011 
      11       -2.916045 
      11       -2.924519 
      11       -2.926817 
      11       -2.925405 
      11       -2.926817 
      11       -2.924519 
      11       -2.916045 
      11       -2.877011 
      11       -2.847055 
      11       -2.877011 
      11       -2.916045 
      11       -2.924519 
      11       -2.926790 
      11       -2.924519 
      11       -2.916045 
      11       -2.877011 
      11       -2.847055 
      11       -2.877011 
      11       -2.916045 
      12       -2.924519 
      12       -2.926817 
      12       -2.925405 
      12       -2.926857 
      12       -2.925848 
      12       -2.932243 
      12       -2.949602 
      12       -2.966711 
      12       -2.948716 
      12       -2.921458 
      12       -2.877897 
      12       -2.852468 
      12       -2.901208 
      12       -2.955913 
      12       -2.947830 
      12       -2.921418 
      12       -2.877454 
      12       -2.847069 
      12       -2.877011 
      12       -2.916019 
      13       -2.923632 
      13       -2.916019 
      13       -2.877010 
      13       -2.847028 
      13       -2.876125 
      13       -2.905247 
      13       -2.876125 
      13       -2.847042 
      13       -2.877454 
      13       -2.921418 
      13       -2.947843 
      13       -2.956343 
      13       -2.906150 
      14       -2.870795 
      14       -2.887296 
      14       -2.870309 
      14       -2.835801 
      14       -2.800317 
      14       -2.779891 
      14       -2.791561 
      14       -2.803141 
      14       -2.783524 
      14       -2.757964 
      14       -2.728987 
      14       -2.703121 
      14       -2.674666 
      14       -2.649357 
      15       -2.621865 
      15       -2.601976 
      15       -2.593143 
      15       -2.584175 
      15       -2.541369 
      15       -2.498770 
      15       -2.467452 
      15       -2.443776 
      15       -2.417901 
      15       -2.395146 
      15       -2.369770 
      15       -2.347496 
      15       -2.322597 
      15       -2.300795 
      15       -2.276364 
      15       -2.255024 
      15       -2.231050 
      16       -2.210163 
      16       -2.186638 
      16       -2.166195 
      16       -2.143109 
      16       -2.123102 
      16       -2.100447 
      16       -2.080840 
      16       -2.057756 
      16       -2.028764 
      16       -1.968981 
      16       -1.909796 
      16       -1.882283 
      16       -1.861185 
      16       -1.843971 
      16       -1.824107 
      16       -1.807290 
      16       -1.787819 
      16       -1.772216 
      16       -1.762883 
      16       -1.783911 
      17       -1.796167 
      17       -1.753855 
      17       -1.720350 
      17       -1.719508 
      17       -1.667312 
      17       -1.600949 
      17       -1.593354 
      17       -1.603608 
      17       -1.631947 
      17       -1.655548 
      17       -1.647421 
      17       -1.633222 
      17       -1.615492 
      17       -1.600735 
      17       -1.582452 
      17       -1.558213 
      17       -1.503135 
      17       -1.448609 
      17       -1.425708 
      17       -1.409215 
      17       -1.397797 
      17       -1.397140 
      17       -1.441274 
      17       -1.481871 
      17       -1.459075 
      17       -1.418311 
      17       -1.359753 
      18       -1.306261 
      18       -1.285622 
      18       -1.280329 
      18       -1.306995 
      18       -1.333419 
      18       -1.328487 
      18       -1.317039 
      18       -1.297152 
      18       -1.262501 
      18       -1.218769 
      18       -1.221270 
      18       -1.233369 
      18       -1.190940 
      18       -1.140400 
      18       -1.121458 
      18       -1.117781 
      18       -1.145221 
      18       -1.163451 
      18       -1.123011 
      18       -1.082950 
      18       -1.100952 
      18       -1.118748 
      18       -1.077878 
      18       -1.028481 
      18       -1.010659 
      18       -1.008116 
      18       -1.037504 
      18       -1.066624 
      19       -1.064372 
      19       -1.055978 
      19       -1.043169 
      19       -1.024323 
      19       -0.974584 
      19       -0.925343 
      19       -0.907675 
      19       -0.896349 
      19       -0.889634 
      19       -0.889126 
      19       -0.918879 
      19       -0.939347 
      19       -0.900297 
      19       -0.852650 
      19       -0.835735 
      19       -0.825102 
      19       -0.818249 
      19       -0.808643 
      19       -0.801993 
      19       -0.792988 
      19       -0.791801 
      19       -0.805563 
      19       -0.828587 
      19       -0.804762 
      20       -0.762590 
      20       -0.747839 
      20       -0.747911 
      20       -0.779050 
      20       -0.800916 
      20       -0.763250 
      20       -0.716974 
      20       -0.701415 
      20       -0.692126 
      20       -0.686603 
      20       -0.678339 
      20       -0.673830 
      20       -0.675481 
      20       -0.707370 
      20       -0.729953 
      20       -0.692997 
      20       -0.647423 
      20       -0.632560 
      20       -0.623999 
      20       -0.620434 
      20       -0.627550 
      20       -0.679380 
      20       -0.727622 
      20       -0.713220 
      20       -0.689753 
      20       -0.676552 
      20       -0.670785 
