Human trial picking the raspberry twin 

 time    ||     output compensated 

      0       -806.044828 
      0       -806.044828 
      0       -806.044828 
      0       -806.044828 
      0       -806.044828 
      0       -806.044828 
      0       -806.044828 
      0       -806.044828 
      0       -806.044828 
      0       -806.044823 
      0       -806.043624 
      0       -805.935744 
      0       -802.363244 
      0       -758.841556 
      0       -563.793924 
      0       -242.225806 
      0       -47.194731 
      0       -3.686056 
      0       -0.153007 
      0       -0.075082 
      0       -0.043499 
      0       0.000470 
      0       0.026882 
      0       0.034965 
      0       -0.019713 
      0       -0.067620 
      0       -0.033125 
      0       0.038536 
      0       0.064132 
      0       0.033597 
      0       0.011725 
      0       0.004914 
      0       0.005909 
      0       0.004458 
      0       0.005909 
      0       0.004914 
      0       0.011725 
      0       0.033624 
      1       0.065018 
      1       0.049321 
      1       0.014826 
      1       0.006769 
      1       0.004484 
      1       0.005896 
      1       0.004458 
      1       0.005896 
      1       0.004458 
      1       0.005909 
      1       0.004887 
      1       0.010839 
      1       0.022826 
      1       0.016624 
      1       -0.030468 
      1       -0.033568 
      1       -0.004029 
      1       0.003598 
      1       0.005869 
      1       0.004457 
      1       0.005896 
      1       0.004458 
      1       0.005896 
      2       0.004458 
      2       0.005896 
      2       0.004458 
      2       0.005896 
      2       0.004458 
      2       0.005896 
      2       0.004458 
      2       0.005909 
      2       0.004900 
      2       0.011268 
      2       0.027768 
      2       0.034992 
      2       -0.019740 
      2       -0.068493 
      2       -0.043493 
      2       -0.004889 
      2       0.003571 
      2       0.005869 
      2       0.004457 
      2       0.005896 
      3       0.004457 
      3       0.005869 
      3       0.003571 
      3       -0.004902 
      3       -0.043937 
      3       -0.073893 
      3       -0.043937 
      3       -0.004902 
      3       0.003571 
      3       0.005869 
      3       0.004457 
      3       0.005896 
      3       0.004458 
      3       0.005909 
      3       0.004901 
      3       0.011295 
      3       0.028655 
      4       0.045790 
      4       0.028655 
      4       0.011295 
      4       0.004901 
      4       0.005909 
      4       0.004458 
      4       0.005896 
      4       0.004458 
      4       0.005896 
      4       0.004458 
      4       0.005896 
      4       0.004458 
      4       0.005896 
      4       0.004457 
      4       0.005869 
      4       0.003584 
      4       -0.004472 
      4       -0.038967 
      4       -0.054665 
      4       -0.023270 
      4       -0.001372 
      4       0.005439 
      4       0.004386 
      4       0.005341 
      4       -0.001482 
      4       -0.023998 
      4       -0.064651 
      4       -0.085684 
      4       -0.081757 
      4       -0.041883 
      5       -0.002009 
      5       0.005588 
      5       -0.001593 
      5       -0.035701 
      5       -0.050884 
      5       -0.019321 
      5       0.001701 
      5       -0.001386 
      5       -0.039577 
      5       -0.068825 
      5       -0.038480 
      5       0.000549 
      5       0.008932 
      5       0.011118 
      5       0.009609 
      5       0.010937 
      5       0.009403 
      5       0.010707 
      5       0.008338 
      6       0.000279 
      6       -0.033874 
      6       -0.049076 
      6       -0.017505 
      6       0.004350 
      6       0.011023 
      6       0.009076 
      6       0.000610 
      6       -0.038040 
      6       -0.067342 
      6       -0.037864 
      6       -0.008680 
      6       -0.038276 
      6       -0.076511 
      6       -0.083284 
      6       -0.074913 
      6       -0.035519 
      6       -0.004644 
      6       -0.024002 
      6       -0.019841 
      6       0.027004 
      6       0.032874 
      6       0.020691 
      6       0.015018 
      6       0.020799 
      6       0.038190 
      6       0.059691 
      6       0.061166 
      6       0.063815 
      6       0.059916 
      6       0.057245 
      7       0.034790 
      7       0.016844 
      7       0.010850 
      7       0.019718 
      7       0.074149 
      7       0.259348 
      7       0.531441 
      7       0.738653 
      7       0.842794 
      7       0.870326 
      7       0.882233 
      7       0.947992 
      7       1.161876 
      7       1.466649 
      7       1.718558 
      7       1.840128 
      7       1.885906 
      7       1.930396 
      7       1.969916 
      7       2.056934 
      7       2.225967 
      7       2.451395 
      7       2.656766 
      7       2.768823 
      7       2.829066 
      7       2.870695 
      7       2.965529 
      7       3.147809 
      7       3.315584 
      7       3.429443 
      7       3.593117 
      7       3.702433 
      7       3.725925 
      7       3.784149 
      7       3.843781 
      7       3.867189 
      7       3.908803 
      7       3.953693 
      7       3.981018 
      7       3.999870 
      7       3.992416 
      7       4.003946 
      8       3.916659 
      8       3.300242 
      8       1.846079 
      8       -0.024865 
      8       -1.080334 
      8       -0.543876 
      8       0.312989 
      8       0.601199 
      8       0.686822 
      8       0.792228 
      8       0.677016 
      8       0.269046 
      8       -0.320036 
      8       -1.081689 
      8       -1.781740 
      8       -2.137998 
      8       -2.292754 
      8       -2.498691 
      8       -2.711197 
      8       -2.829181 
      8       -2.826541 
      8       -2.846779 
      8       -2.953477 
      8       -3.023353 
      8       -3.040949 
      8       -3.040840 
      8       -3.042319 
      8       -3.040881 
      8       -3.042319 
      8       -3.040881 
      8       -3.011896 
      8       -2.980353 
      9       -2.951974 
      9       -2.921030 
      9       -2.922468 
      9       -2.921057 
      9       -2.923355 
      9       -2.931855 
      9       -2.971749 
      9       -3.011643 
      9       -3.020143 
      9       -3.022415 
      9       -3.020143 
      9       -3.011643 
      9       -2.971749 
      9       -2.931882 
      9       -2.924241 
      9       -2.931882 
      9       -2.971749 
      9       -3.011643 
      9       -3.020143 
      9       -3.022441 
      9       -3.021029 
      9       -3.022468 
      10       -3.021030 
      10       -3.022468 
      10       -3.021030 
      10       -3.022468 
      10       -3.021029 
      10       -3.022442 
      10       -3.020157 
      10       -3.012100 
      10       -2.977605 
      10       -2.961908 
      10       -2.993302 
      10       -3.015201 
      10       -3.022012 
      10       -3.021016 
      10       -3.022468 
      10       -3.021030 
      10       -3.022468 
      10       -3.021030 
      10       -3.022468 
      10       -3.021030 
      10       -3.022468 
      10       -3.021030 
      10       -3.022468 
      11       -3.021030 
      11       -3.022468 
      11       -3.021030 
      11       -3.022468 
      11       -3.021029 
      11       -3.022441 
      11       -3.020143 
      11       -3.011670 
      11       -2.972636 
      11       -2.942680 
      11       -2.972635 
      11       -3.011643 
      11       -3.019257 
      11       -3.011616 
      11       -2.971749 
      11       -2.931855 
      12       -2.923355 
      12       -2.921057 
      12       -2.893244 
      12       -2.862887 
      12       -2.835682 
      12       -2.805928 
      12       -2.780144 
      12       -2.760731 
      12       -2.771768 
      12       -2.773706 
      12       -2.716313 
      12       -2.650506 
      12       -2.615612 
      12       -2.587207 
      12       -2.563571 
      12       -2.545911 
      12       -2.554602 
      12       -2.544596 
      12       -2.488070 
      12       -2.441483 
      12       -2.409487 
      12       -2.376965 
      12       -2.318606 
      13       -2.274973 
      13       -2.264694 
      13       -2.248187 
      13       -2.247988 
      13       -2.243132 
      13       -2.227045 
      13       -2.203776 
      13       -2.183175 
      13       -2.159920 
      13       -2.139745 
      13       -2.116949 
      13       -2.098042 
      13       -2.085038 
      13       -2.098338 
      13       -2.092907 
      13       -2.041324 
      13       -2.004137 
      13       -1.995989 
      13       -1.993393 
      13       -1.965895 
      13       -1.962215 
      13       -1.958571 
      13       -1.931422 
      13       -1.929471 
      13       -1.922030 
      13       -1.884773 
      13       -1.820964 
      13       -1.766932 
      13       -1.749632 
      13       -1.773411 
      13       -1.740123 
      13       -1.677938 
      13       -1.669148 
      13       -1.668818 
      13       -1.658434 
      13       -1.640851 
      13       -1.625879 
      14       -1.608196 
      14       -1.593512 
      14       -1.575315 
      14       -1.551585 
      14       -1.501880 
      14       -1.470058 
      14       -1.472118 
      14       -1.427315 
      14       -1.382374 
      14       -1.396999 
      14       -1.407792 
      14       -1.420877 
      14       -1.423867 
      14       -1.406172 
      14       -1.353866 
      14       -1.309833 
      14       -1.316579 
      14       -1.304837 
      14       -1.269097 
      14       -1.289761 
      14       -1.312686 
      14       -1.310809 
      14       -1.297554 
      14       -1.290935 
      14       -1.295212 
      14       -1.299224 
      14       -1.269267 
      14       -1.239388 
      14       -1.220651 
      14       -1.209017 
      14       -1.190571 
      14       -1.161040 
      14       -1.127094 
      14       -1.107968 
      14       -1.064354 
      14       -0.994398 
      14       -0.933792 
      14       -0.965798 
      14       -1.056771 
      14       -1.137186 
      14       -1.165309 
      14       -1.110544 
      14       -1.008208 
      14       -0.942501 
      14       -0.922577 
      14       -0.901676 
      14       -0.927811 
      15       -0.943721 
      15       -0.959624 
      15       -0.965568 
      15       -0.933668 
      15       -0.886265 
      15       -0.846730 
      15       -0.876907 
      15       -0.871634 
      15       -0.846556 
      15       -0.885562 
      15       -0.912129 
      15       -0.896047 
      15       -0.870974 
      15       -0.878816 
      15       -0.881895 
      15       -0.856276 
      15       -0.816208 
      15       -0.813786 
      15       -0.802579 
      15       -0.771449 
      15       -0.797076 
      15       -0.824901 
      15       -0.827038 
      15       -0.808369 
      15       -0.764077 
      15       -0.718613 
      15       -0.720828 
      15       -0.719759 
      15       -0.737914 
      15       -0.765496 
      15       -0.764567 
      15       -0.744438 
      15       -0.678915 
      15       -0.617117 
      15       -0.618922 
      15       -0.638907 
      15       -0.676880 
      15       -0.709566 
      15       -0.704703 
      15       -0.666164 
      15       -0.581428 
      15       -0.523293 
      15       -0.557529 
      15       -0.651334 
      16       -0.723772 
      16       -0.711683 
      16       -0.671294 
      16       -0.656605 
      16       -0.646899 
      16       -0.631151 
      16       -0.575944 
      16       -0.497963 
      16       -0.467604 
      16       -0.493131 
      16       -0.508976 
      16       -0.499952 
      16       -0.446495 
      16       -0.369822 
      16       -0.340744 
      16       -0.367540 
      16       -0.384680 
      16       -0.378202 
      16       -0.341546 
      16       -0.332004 
      16       -0.392464 
      16       -0.426346 
      16       -0.386947 
      16       -0.329974 
      16       -0.313219 
      16       -0.385690 
      16       -0.449903 
      16       -0.434123 
      16       -0.349685 
      16       -0.288313 
      16       -0.279881 
      16       -0.328757 
      16       -0.341657 
      16       -0.317615 
      16       -0.317374 
      16       -0.370261 
      16       -0.407686 
      16       -0.415258 
      16       -0.409655 
      16       -0.395906 
      16       -0.338146 
      16       -0.243933 
      16       -0.200574 
      16       -0.244351 
      16       -0.282596 
      16       -0.296299 
      16       -0.310509 
      16       -0.313731 
      16       -0.246597 
      16       -0.158644 
      16       -0.150728 
      16       -0.218519 
      16       -0.264562 
      16       -0.276329 
      16       -0.270430 
      16       -0.249418 
      17       -0.227896 
      17       -0.279913 
      17       -0.331352 
      17       -0.256199 
      17       -0.189318 
      17       -0.240545 
      17       -0.327308 
      17       -0.353903 
      17       -0.297785 
      17       -0.300084 
      17       -0.297369 
      17       -0.283470 
      17       -0.285285 
      17       -0.233597 
      17       -0.208304 
      17       -0.181090 
      17       -0.121358 
      17       -0.111244 
      17       -0.214505 
      17       -0.272548 
      17       -0.251232 
      17       -0.205829 
      17       -0.173199 
      17       -0.133291 
      17       -0.117124 
      17       -0.147646 
      17       -0.159632 
      17       -0.128808 
      17       -0.095155 
      17       -0.113979 
      17       -0.103199 
      17       -0.099237 
      17       -0.148395 
      17       -0.120277 
      17       -0.065532 
      17       -0.051704 
      17       -0.039533 
      17       -0.075041 
      17       -0.100847 
      17       -0.129289 
      17       -0.140268 
      17       -0.053541 
      17       0.031725 
      17       -0.017221 
      17       -0.113453 
      17       -0.175412 
      17       -0.146166 
      17       -0.102812 
      17       -0.126992 
      17       -0.151562 
      18       -0.112264 
      18       -0.090602 
      18       -0.115391 
      18       -0.104014 
      18       -0.108706 
      18       -0.114716 
      18       -0.097962 
      18       -0.056507 
      18       -0.046401 
      18       -0.090602 
      18       -0.181267 
      18       -0.199460 
      18       -0.141390 
      18       -0.106272 
      18       -0.088465 
      18       -0.030940 
      18       0.006964 
      18       0.014384 
      18       0.049143 
      18       0.090045 
      18       0.029889 
      18       -0.012085 
      18       -0.025290 
      18       -0.086478 
      18       -0.105920 
      18       -0.054693 
      18       -0.015422 
      18       -0.004511 
      18       -0.015835 
      18       0.004415 
      18       -0.031948 
      18       -0.078017 
      18       -0.058333 
      18       -0.046719 
      18       -0.006255 
      18       0.080967 
      18       0.121897 
      18       0.076095 
      18       0.040824 
      18       0.053241 
      18       0.093258 
      18       0.110631 
      18       0.094560 
      18       0.068526 
      18       0.101784 
      18       0.138385 
      18       0.088802 
      18       0.077079 
      18       0.151468 
      18       0.169366 
      18       0.170335 
      18       0.143341 
      18       0.039438 
      19       -0.009408 
      19       0.061806 
      19       0.101604 
      19       0.012100 
      19       -0.052034 
      19       -0.035021 
      19       -0.017911 
      19       0.096345 
      19       0.198839 
      19       0.161848 
      19       0.137999 
      19       0.088732 
      19       0.031869 
      19       0.144823 
      19       0.240059 
      19       0.180274 
      19       0.111963 
      19       0.087376 
      19       0.040767 
      19       0.042552 
      19       0.025013 
      19       -0.047078 
      19       -0.028653 
      19       0.058583 
      19       0.121981 
      19       0.164854 
      19       0.186033 
      19       0.171196 
      19       0.222854 
      19       0.262582 
      19       0.212972 
      19       0.197275 
      19       0.243797 
      19       0.218315 
      19       0.175306 
      19       0.200332 
      19       0.168078 
      19       0.126925 
      19       0.160398 
      19       0.166749 
      19       0.150622 
      19       0.136241 
      19       0.099115 
      19       0.144382 
      19       0.253669 
      19       0.308414 
      19       0.307033 
      19       0.254652 
      19       0.223272 
      19       0.269920 
      19       0.305244 
      19       0.293661 
      19       0.262696 
      19       0.273060 
      19       0.284608 
      20       0.266349 
      20       0.285963 
      20       0.269836 
      20       0.176206 
      20       0.160079 
      20       0.179746 
      20       0.163193 
      20       0.194188 
      20       0.276481 
      20       0.308511 
      20       0.285012 
      20       0.300928 
      20       0.309648 
      20       0.295569 
      20       0.261728 
      20       0.280288 
      20       0.311047 
      20       0.312082 
      20       0.274324 
      20       0.249310 
      20       0.296775 
      20       0.336652 
      20       0.273451 
      20       0.214386 
      20       0.268938 
      20       0.322810 
      20       0.299876 
      20       0.280718 
      20       0.277894 
      20       0.304486 
      20       0.340200 
      20       0.352393 
      20       0.298091 
      20       0.249364 
      20       0.274767 
      20       0.317455 
      20       0.334358 
      20       0.309372 
      20       0.237141 
      20       0.217540 
      20       0.258654 
      20       0.341679 
      20       0.396678 
      20       0.377533 
      20       0.363099 
      20       0.393204 
      20       0.398946 
      20       0.334469 
      20       0.229141 
      20       0.221071 
      20       0.289189 
      20       0.334425 
      20       0.339841 
      20       0.317389 
      20       0.353310 
      20       0.396274 
      21       0.361766 
