

 time    ||    gripping force   ||   raspberry measurement 

      0       0.170000       -794.988235 
      0       0.270000       -794.988235 
      0       0.390000       -794.988235 
      0       0.100000       -794.988235 
      0       0.260000       -794.988235 
      1       0.230000       -787.038353 
      1       0.180000       -779.167969 
      2       19.840000       -771.376290 
      2       48.080000       -763.662527 
      2       66.290000       -756.025897 
      2       75.990000       -748.464469 
      2       86.500000       -740.874626 
      2       88.410000       -737.355752 
      2       87.080000       -694.487354 
      2       86.500000       -502.367568 
      2       85.900000       -185.626625 
      2       85.490000       6.477464 
      2       84.880000       49.342761 
      3       84.710000       52.859821 
      3       84.350000       52.968931 
      3       83.770000       52.988026 
      3       83.440000       53.101601 
      3       82.560000       53.410042 
      3       82.560000       53.852840 
      3       81.910000       54.190508 
      3       81.860000       54.432124 
      3       81.840000       54.692254 
      3       81.690000       54.850847 
      3       81.100000       54.881608 
      3       80.640000       54.851434 
      3       80.350000       54.849852 
      3       80.130000       54.862257 
      4       79.660000       54.868195 
      4       79.650000       54.866340 
      4       78.750000       54.858712 
      4       78.420000       54.828730 
      4       77.780000       54.826418 
      4       77.750000       54.848829 
      4       77.790000       54.808435 
      4       77.650000       54.732743 
      4       77.660000       54.619732 
      4       77.690000       54.525671 
      4       77.560000       54.535460 
      4       77.500000       54.600432 
      4       76.980000       54.611133 
      4       76.870000       54.528703 
      4       76.670000       54.473112 
      5       76.600000       54.504032 
      5       76.540000       54.495865 
      5       76.450000       54.426958 
      5       76.420000       54.367669 
      5       76.420000       54.316188 
      5       76.170000       54.267794 
      5       76.190000       54.294635 
      5       76.000000       54.334059 
      5       75.610000       54.349339 
      5       75.420000       54.374383 
      5       75.420000       54.347944 
      6       75.350000       54.335915 
      6       75.270000       54.363665 
      6       74.270000       54.314775 
      6       74.080000       54.275507 
      6       73.970000       54.391826 
      6       74.010000       54.511614 
      6       73.930000       54.457702 
      6       73.370000       54.370966 
      6       70.900000       54.347889 
      6       70.910000       54.360232 
      7       70.430000       54.347017 
      7       69.170000       54.360638 
      7       68.970000       54.415566 
      7       68.440000       54.465868 
      7       68.360000       54.418706 
      7       68.320000       54.293264 
      7       68.240000       54.165525 
      8       68.270000       54.109044 
      8       68.190000       54.110802 
      8       68.180000       54.102249 
      8       67.700000       54.122445 
      8       66.010000       54.147444 
      8       64.270000       54.117059 
      9       64.230000       54.078011 
      9       64.310000       54.069511 
      9       64.320000       54.066366 
      9       64.320000       54.058283 
      9       64.250000       54.023788 
      10       64.330000       54.008117 
      10       64.250000       54.040371 
      10       62.940000       54.072182 
      10       62.700000       54.116589 
      10       63.010000       54.146988 
      10       63.020000       54.117045 
      11       63.010000       54.078011 
      11       63.010000       54.069537 
      11       63.010000       54.067239 
      11       62.950000       54.068625 
      11       63.010000       54.066326 
      11       63.010000       54.057853 
      11       63.000000       54.018818 
      12       61.810000       53.988836 
      12       61.810000       54.017932 
      13       61.770000       54.047028 
      13       61.810000       54.017046 
      13       61.830000       53.978038 
      13       61.810000       53.970424 
      14       61.850000       53.978064 
      14       61.750000       54.017932 
      14       61.800000       54.057800 
      14       61.820000       54.065453 
      14       61.770000       54.058256 
      14       61.820000       54.023761 
      14       61.830000       54.007204 
      14       61.840000       54.028660 
      15       61.270000       54.012103 
      15       61.240000       53.977608 
      15       61.180000       53.970411 
      15       61.110000       53.978038 
      15       61.120000       54.017059 
      15       61.160000       54.047458 
      15       61.170000       54.022874 
      15       61.160000       54.007191 
      15       61.160000       54.029116 
      15       61.130000       54.017959 
      16       61.190000       54.007634 
      16       61.140000       54.039445 
      16       61.170000       54.060497 
      16       61.120000       54.057370 
      17       61.120000       54.017919 
      17       61.000000       53.978064 
      17       61.060000       53.970424 
      18       60.670000       53.978038 
      18       60.610000       54.017059 
      18       60.570000       54.047458 
      18       60.560000       54.022874 
      19       60.540000       54.007177 
      19       60.620000       54.028686 
      19       60.550000       54.012990 
      19       60.580000       53.988406 
      19       60.540000       54.018792 
      19       60.520000       54.057410 
      20       60.580000       54.060927 
      20       60.510000       54.044427 
      20       60.460000       54.027318 
      20       60.490000       54.044454 
      20       60.560000       54.061814 
      20       60.470000       54.068208 
      20       60.470000       54.067199 
      21       60.490000       54.068624 
      21       60.540000       54.066326 
      21       60.340000       54.057826 
      22       60.190000       54.017932 
      22       60.150000       53.978078 
      22       60.190000       53.970867 
      23       60.110000       53.983437 
      23       60.200000       54.041243 
      23       60.050000       54.086922 
      23       60.110000       54.042129 
      24       60.180000       53.994235 
      25       60.100000       54.019261 
      25       60.110000       54.057840 
      25       60.080000       54.065440 
      25       60.110000       54.057826 
      25       60.060000       54.018818 
      25       60.060000       53.988862 
      26       60.120000       54.018805 
      26       60.070000       54.057396 
      26       60.100000       54.060471 
      27       60.130000       54.038572 
      27       60.080000       53.997292 
      28       60.010000       53.975393 
      28       60.030000       53.978468 
      28       60.100000       54.017059 
      29       59.990000       54.047001 
      29       60.000000       54.017046 
      29       60.050000       53.978038 
      29       60.040000       53.970424 
      29       60.030000       53.978038 
      30       60.020000       54.017046 
      30       60.110000       54.047001 
      30       59.910000       54.017046 
      30       60.030000       53.978038 
      30       60.070000       53.970424 
      30       59.990000       53.978064 
      30       59.910000       54.017932 
      30       59.990000       54.057826 
      31       60.010000       54.066326 
      31       59.990000       54.068598 
      31       60.020000       54.066326 
      31       59.980000       54.057866 
      31       59.990000       54.019262 
      31       59.950000       53.994262 
      32       60.040000       54.043015 
      32       59.910000       54.097720 
      32       59.980000       54.089637 
      33       59.950000       54.063225 
      33       59.970000       54.019261 
      33       59.970000       53.988876 
      33       59.980000       54.018819 
      34       59.940000       54.057853 
      34       59.910000       54.066326 
      35       59.940000       54.068624 
      35       59.920000       54.067212 
      35       59.870000       54.068624 
      35       59.880000       54.066340 
      35       59.830000       54.058283 
      36       59.940000       54.023761 
      36       59.850000       54.007204 
      36       59.910000       54.028687 
      36       59.900000       54.012990 
      36       59.850000       53.988406 
      37       59.820000       54.018805 
      37       59.840000       54.057826 
      37       59.860000       54.065453 
      37       59.820000       54.058243 
      37       59.910000       54.023331 
      38       59.790000       54.002235 
      38       59.820000       54.009432 
      39       59.800000       53.991437 
      39       59.910000       53.974051 
      39       59.830000       53.967683 
      39       59.890000       53.969551 
      39       59.840000       53.978038 
      39       59.800000       54.017918 
      40       59.760000       54.057369 
      40       59.850000       54.060470 
      40       59.850000       54.038571 
      40       59.790000       53.997265 
      41       59.840000       53.974507 
      41       59.790000       53.967669 
      41       59.770000       53.968665 
      41       59.860000       53.967213 
      42       59.840000       53.968651 
      42       59.780000       53.967239 
      43       59.890000       53.969537 
      43       59.780000       53.978011 
      43       59.820000       54.017046 
      43       59.790000       54.047028 
      44       59.860000       54.017932 
      44       59.810000       53.988809 
      44       59.760000       54.017932 
      44       59.750000       54.047028 
      44       59.910000       54.017046 
      44       59.850000       53.978011 
      44       59.830000       53.969538 
      44       59.840000       53.967266 
      44       59.830000       53.969538 
      45       59.820000       53.978011 
      45       59.800000       54.017046 
      45       59.840000       54.047028 
      45       59.810000       54.017918 
      45       59.790000       53.988379 
      45       59.810000       54.012962 
      46       59.800000       54.027800 
      46       59.830000       53.996406 
      47       59.820000       53.975367 
      47       59.820000       53.978467 
      47       59.860000       54.017059 
      47       59.810000       54.047001 
      48       59.820000       54.017045 
      48       59.910000       53.978011 
      49       59.860000       53.969538 
      49       59.880000       53.967266 
      49       59.880000       53.969538 
      49       59.810000       53.978038 
      49       59.820000       54.017931 
      49       59.840000       54.057786 
      50       59.930000       54.064996 
      50       59.800000       54.052400 
      51       59.820000       53.993735 
      51       59.950000       53.938170 
      51       59.740000       53.946227 
      51       59.820000       53.972639 
      52       59.900000       54.016602 
      52       59.810000       54.046988 
      52       59.850000       54.017045 
      52       59.840000       53.978038 
      53       59.830000       53.970424 
      53       59.810000       53.978038 
      53       59.840000       54.017046 
      53       59.860000       54.047001 
      54       59.890000       54.017045 
      54       59.810000       53.978011 
      54       59.840000       53.969537 
      54       59.830000       53.967239 
      54       59.780000       53.968651 
      55       59.780000       53.967213 
      55       59.770000       53.968651 
      55       59.740000       53.967239 
      55       59.780000       53.969537 
      56       59.780000       53.978011 
      56       59.890000       54.017046 
      57       59.840000       54.047028 
      57       59.810000       54.017918 
      58       59.760000       53.988379 
      58       59.830000       54.012962 
      58       59.800000       54.027800 
      58       59.860000       53.996406 
      58       59.870000       53.975367 
      58       59.780000       53.978467 
      58       59.910000       54.017059 
      58       59.840000       54.046988 
      59       59.810000       54.016602 
      59       59.840000       53.972639 
      60       59.890000       53.946227 
      60       59.750000       53.938170 
      60       59.870000       53.993735 
      60       59.870000       54.052387 
