Human trial picking the raspberry twin 

 time    ||     output compensated 

      0       -799.100000 
      0       -799.100000 
      0       -799.100000 
      0       -799.100000 
      0       -799.100000 
      0       -799.100000 
      0       -799.100000 
      0       -799.100000 
      0       -799.100000 
      0       -799.099995 
      0       -799.098807 
      0       -798.991877 
      0       -795.450803 
      0       -752.311161 
      0       -558.966627 
      0       -240.173692 
      0       -46.801834 
      0       -3.664447 
      0       -0.092822 
      0       0.076718 
      0       0.078928 
      0       0.008921 
      0       -0.032179 
      0       -0.025162 
      0       -0.003956 
      0       -0.002294 
      0       -0.003123 
      0       -0.016150 
      0       -0.005838 
      0       -0.013908 
      0       -0.061429 
      0       -0.067618 
      0       -0.054771 
      0       -0.038895 
      0       -0.001891 
      0       0.035911 
      0       0.021876 
      0       0.001416 
      0       -0.025631 
      0       -0.043851 
      0       -0.050271 
      0       -0.049263 
      0       -0.050715 
      0       -0.049277 
      0       -0.050715 
      0       -0.049277 
      0       -0.050715 
      1       -0.049263 
      1       -0.050258 
      1       -0.043421 
      1       -0.020662 
      1       0.020644 
      1       0.042556 
      1       0.039899 
      1       0.005860 
      1       -0.009394 
      1       0.026956 
      1       0.067653 
      1       0.090135 
      1       0.072595 
      1       0.045754 
      1       0.006277 
      1       -0.010710 
      1       0.010759 
      1       -0.004952 
      1       -0.029978 
      1       -0.004978 
      1       0.009886 
      1       -0.021105 
      1       -0.038008 
      1       -0.024732 
      1       0.006829 
      1       0.046073 
      1       0.075779 
      1       0.021460 
      1       -0.042991 
      1       -0.087398 
      1       -0.085157 
      1       -0.033149 
      1       -0.008150 
      1       -0.004440 
      1       -0.026088 
      1       -0.043864 
      1       -0.050272 
      1       -0.049263 
      1       -0.050715 
      1       -0.049303 
      1       -0.051601 
      1       -0.060075 
      1       -0.099109 
      2       -0.129052 
      2       -0.098666 
      2       -0.054676 
      2       -0.027404 
      2       -0.009369 
      2       -0.025175 
      2       -0.027250 
      2       0.027289 
      2       0.089647 
      2       0.042543 
      2       -0.029522 
      2       -0.046631 
      2       -0.039863 
      2       -0.000882 
      2       0.029074 
      2       -0.000882 
      2       -0.039917 
      2       -0.048390 
      2       -0.050688 
      2       -0.049276 
      2       -0.050688 
      2       -0.048403 
      2       -0.040347 
      2       -0.005852 
      2       0.009846 
      2       -0.021522 
      2       -0.042561 
      2       -0.039460 
      2       -0.000855 
      2       0.029517 
      2       0.004485 
      2       -0.015169 
      2       -0.002959 
      2       -0.002108 
      2       -0.002908 
      2       -0.014911 
      2       0.005698 
      2       0.040191 
      2       0.046953 
      2       0.039758 
      2       0.009704 
      2       0.007332 
      2       0.029924 
      3       -0.003744 
      3       -0.039954 
      3       -0.055698 
      3       -0.073165 
      3       -0.088998 
      3       -0.066225 
      3       -0.029341 
      3       -0.002271 
      3       -0.000177 
      3       -0.001808 
      3       -0.023660 
      3       -0.041035 
      3       -0.046968 
      3       -0.045500 
      3       -0.046482 
      3       -0.044567 
      3       -0.044694 
      3       -0.032997 
      3       0.003554 
      3       0.040943 
      3       0.027064 
      3       0.011444 
      3       0.003163 
      3       0.000635 
      3       -0.021229 
      3       -0.037339 
      3       -0.028151 
      3       0.034278 
      3       0.102222 
      3       0.085686 
      3       0.014310 
      3       -0.024890 
      3       0.003327 
      3       0.032099 
      3       0.002946 
      3       -0.025889 
      3       0.004040 
      3       0.042218 
      3       0.045278 
      3       0.028490 
      3       0.011267 
      3       0.028093 
      3       0.044147 
      3       0.040223 
      4       0.001589 
      4       -0.028535 
      4       -0.004790 
      4       0.000135 
      4       -0.068167 
      4       -0.119408 
      4       -0.084463 
      4       -0.012261 
      4       0.018121 
      4       0.006746 
      4       0.005471 
      4       0.001744 
      4       -0.000358 
      4       -0.022238 
      4       -0.039628 
      4       -0.045575 
      4       -0.044121 
      4       -0.045117 
      4       -0.043242 
      4       -0.044233 
      4       -0.042340 
      4       -0.042477 
      4       -0.030403 
      4       0.010191 
      4       0.056710 
      4       0.025062 
      4       -0.027949 
      4       -0.040552 
      4       -0.042834 
      4       -0.041007 
      4       -0.041596 
      4       -0.034850 
      4       -0.017315 
      4       -0.000165 
      4       -0.016702 
      4       -0.028814 
      4       -0.016247 
      4       0.000455 
      4       -0.016487 
      4       -0.032219 
      4       -0.023082 
      4       0.038910 
      4       0.103191 
      4       0.083167 
      4       0.056574 
      4       0.092403 
      4       0.083872 
      4       0.015706 
      5       -0.032496 
      5       -0.036504 
      5       -0.019791 
      5       -0.001365 
      5       -0.003132 
      5       0.041739 
      5       0.115367 
      5       0.144894 
      5       0.136732 
      5       0.082605 
      5       0.044515 
      5       0.056897 
      5       0.019051 
      5       -0.034364 
      5       -0.046891 
      5       -0.048258 
      5       -0.036565 
      5       0.000035 
      5       0.037897 
      5       0.029381 
      5       0.037254 
      5       0.062865 
      5       0.059740 
      5       0.003095 
      5       -0.038090 
      5       -0.050236 
      5       -0.058986 
      5       -0.097067 
      5       -0.125753 
      5       -0.094839 
      5       -0.055246 
      5       -0.046305 
      5       -0.043567 
      5       -0.044543 
      5       -0.043111 
      5       -0.049410 
      5       -0.070157 
      5       -0.095217 
      5       -0.055621 
      5       0.008742 
      5       0.002528 
      5       -0.030371 
      5       -0.032672 
      5       -0.010626 
      5       0.031212 
      5       0.062871 
      5       0.103041 
      5       0.133626 
      6       0.169099 
      6       0.257611 
      6       0.368589 
      6       0.549171 
      6       0.738431 
      6       0.858987 
      6       0.929410 
      6       1.014709 
      6       1.219111 
      6       1.480459 
      6       1.670962 
      6       1.755336 
      6       1.761690 
      6       1.801280 
      6       1.926378 
      6       2.143390 
      6       2.416893 
      6       2.661203 
      6       2.869374 
      6       3.126670 
      6       3.455335 
      6       3.705927 
      6       3.810458 
      6       3.858108 
      6       3.985416 
      6       4.137393 
      6       4.172806 
      6       4.185969 
      6       4.209129 
      6       4.204907 
      6       4.281902 
      6       4.454988 
      7       4.568803 
      7       4.662162 
      7       4.771464 
      7       4.864774 
      7       4.915803 
      7       4.922057 
      7       4.884987 
      7       4.688736 
      7       4.217315 
      7       3.289871 
      7       1.768614 
      7       0.592845 
      7       0.731946 
      7       1.260855 
      7       1.280368 
      7       0.909115 
      7       0.437396 
      7       -0.023958 
      7       -0.471757 
      7       -0.892834 
      7       -1.122321 
      7       -1.190305 
      7       -1.277184 
      7       -1.372347 
      7       -1.383949 
      7       -1.348625 
      7       -1.301946 
      7       -1.268833 
      7       -1.223540 
      7       -1.183646 
      7       -1.180531 
      7       -1.202416 
      7       -1.243280 
      7       -1.260679 
      7       -1.244609 
      7       -1.218614 
      7       -1.253109 
      7       -1.302858 
      7       -1.289846 
      7       -1.250035 
      7       -1.214974 
      7       -1.244263 
      7       -1.325670 
      8       -1.335122 
      8       -1.269875 
      8       -1.266056 
      8       -1.287971 
      8       -1.294674 
      8       -1.324279 
      8       -1.291041 
      8       -1.219205 
      8       -1.212728 
      8       -1.224139 
      8       -1.183492 
      8       -1.164711 
      8       -1.236828 
      8       -1.321516 
      8       -1.300060 
      8       -1.248487 
      8       -1.245412 
      8       -1.280280 
      8       -1.312643 
      8       -1.274828 
      8       -1.218999 
      8       -1.181624 
      8       -1.155791 
      8       -1.128317 
      8       -1.174136 
      8       -1.260096 
      8       -1.281636 
      8       -1.228842 
      8       -1.233702 
      8       -1.325228 
      8       -1.392766 
      8       -1.417129 
      8       -1.375244 
      8       -1.319039 
      8       -1.282470 
      8       -1.265259 
      8       -1.260501 
      8       -1.280930 
      8       -1.284697 
      8       -1.310459 
      8       -1.328191 
      8       -1.331428 
      8       -1.247127 
      8       -1.133300 
      8       -1.102901 
      8       -1.136330 
      8       -1.198829 
      8       -1.218280 
      8       -1.204657 
      8       -1.165872 
      8       -1.165193 
      8       -1.174909 
      8       -1.169163 
      8       -1.130186 
      8       -1.162895 
      9       -1.289722 
      9       -1.361397 
      9       -1.361024 
      9       -1.283841 
      9       -1.218154 
      9       -1.249316 
      9       -1.272749 
      9       -1.257398 
      9       -1.235513 
      9       -1.147155 
      9       -1.116330 
      9       -1.183009 
      9       -1.253797 
      9       -1.236828 
      9       -1.134753 
      9       -1.080046 
      9       -1.083344 
      9       -1.123586 
      9       -1.120699 
      9       -1.098020 
      9       -1.085190 
      9       -1.018491 
      9       -0.950614 
      9       -0.933158 
      9       -0.945932 
      9       -0.987205 
      9       -1.038360 
      9       -1.080545 
      9       -1.093530 
      9       -1.094271 
      9       -1.034871 
      9       -1.001978 
      9       -0.992341 
      9       -0.945566 
      9       -0.900249 
      9       -0.882268 
      9       -0.882833 
      9       -0.850900 
      9       -0.863263 
      9       -0.904773 
      9       -0.907222 
      9       -0.907542 
      9       -0.917910 
      9       -0.931436 
      9       -0.868337 
      9       -0.799902 
      9       -0.822368 
      9       -0.828434 
      9       -0.778821 
      9       -0.770225 
      9       -0.793052 
      9       -0.807818 
      9       -0.797507 
      9       -0.824121 
      9       -0.846973 
      9       -0.810493 
      10       -0.782532 
      10       -0.766153 
      10       -0.756820 
      10       -0.736755 
      10       -0.744502 
      10       -0.747678 
      10       -0.708682 
      10       -0.679490 
      10       -0.661511 
      10       -0.643467 
      10       -0.653823 
      10       -0.740964 
      10       -0.805776 
      10       -0.778314 
      10       -0.732790 
      10       -0.718350 
      10       -0.722759 
      10       -0.762921 
      10       -0.762417 
      10       -0.668703 
      10       -0.598622 
      10       -0.585481 
      10       -0.617819 
      10       -0.651109 
      10       -0.653438 
      10       -0.654099 
      10       -0.665195 
      10       -0.680374 
      10       -0.673940 
      10       -0.650836 
      10       -0.566614 
      10       -0.496290 
      10       -0.526697 
      10       -0.559623 
      10       -0.550917 
      10       -0.553796 
      10       -0.527000 
      10       -0.482648 
      10       -0.455729 
      10       -0.447937 
      10       -0.467591 
      10       -0.492024 
      10       -0.550745 
      10       -0.590286 
      10       -0.615667 
      10       -0.617722 
      10       -0.574911 
      10       -0.507809 
      11       -0.472650 
      11       -0.450108 
      11       -0.465615 
      11       -0.495534 
      11       -0.498980 
      11       -0.500733 
      11       -0.508031 
      11       -0.501280 
      11       -0.462924 
      11       -0.447249 
      11       -0.422290 
      11       -0.405731 
      11       -0.418408 
      11       -0.378797 
      11       -0.319974 
      11       -0.301234 
      11       -0.284926 
      11       -0.302910 
      11       -0.338924 
      11       -0.356789 
      11       -0.347068 
      11       -0.287190 
      11       -0.244016 
      11       -0.239300 
      11       -0.270219 
      11       -0.283869 
      11       -0.259377 
      11       -0.268733 
      11       -0.287782 
      11       -0.310297 
      11       -0.393175 
      11       -0.438990 
      11       -0.439958 
      11       -0.475905 
      11       -0.458263 
      11       -0.423121 
      11       -0.411270 
      11       -0.341072 
      11       -0.242736 
      11       -0.201264 
      11       -0.252012 
      11       -0.332472 
      11       -0.379262 
      11       -0.389230 
      11       -0.336113 
      11       -0.298641 
      11       -0.322680 
      11       -0.350520 
      11       -0.390964 
      11       -0.417136 
      11       -0.382883 
      11       -0.335105 
      11       -0.300673 
      12       -0.270177 
      12       -0.295416 
      12       -0.308796 
      12       -0.225936 
      12       -0.166848 
      12       -0.191340 
      12       -0.232908 
      12       -0.261633 
      12       -0.220798 
      12       -0.154384 
      12       -0.154539 
      12       -0.173892 
      12       -0.198317 
      12       -0.290386 
      12       -0.353547 
      12       -0.297251 
      12       -0.184251 
      12       -0.132276 
      12       -0.146026 
      12       -0.128586 
      12       -0.103801 
      12       -0.142670 
      12       -0.217094 
      12       -0.253541 
      12       -0.212388 
      12       -0.134426 
      12       -0.093587 
      12       -0.120618 
      12       -0.148630 
      12       -0.122845 
      12       -0.108191 
      12       -0.152496 
      12       -0.223176 
      12       -0.251669 
      12       -0.178072 
      12       -0.169344 
      12       -0.258426 
      12       -0.292824 
      12       -0.218790 
      12       -0.137311 
      12       -0.170896 
      12       -0.282819 
      12       -0.286117 
      12       -0.203926 
      12       -0.158336 
      12       -0.178976 
      12       -0.182024 
      12       -0.111902 
      12       -0.058861 
      12       -0.092023 
      13       -0.162473 
      13       -0.191507 
      13       -0.182466 
      13       -0.188631 
      13       -0.165447 
      13       -0.123885 
      13       -0.091540 
      13       -0.058268 
      13       -0.067880 
      13       -0.078234 
      13       -0.055346 
      13       -0.066291 
      13       -0.082032 
      13       -0.083022 
      13       -0.131882 
      13       -0.155339 
      13       -0.094860 
      13       -0.054842 
      13       -0.070255 
      13       -0.053574 
      13       -0.028661 
      13       -0.057618 
      13       -0.085913 
      13       -0.057060 
      13       -0.037071 
      13       -0.098684 
      13       -0.148413 
      13       -0.104641 
      13       -0.075366 
      13       -0.102841 
      13       -0.144113 
      13       -0.092382 
      13       -0.034382 
      13       -0.072080 
      13       -0.115344 
      13       -0.075537 
      13       -0.055377 
      13       -0.127891 
      13       -0.167080 
      13       -0.131658 
      13       -0.135674 
      13       -0.126736 
      13       -0.090055 
      13       -0.058886 
      13       -0.030860 
      13       -0.059356 
      13       -0.085336 
      13       -0.046850 
      13       -0.039682 
      13       -0.055251 
      13       -0.069387 
      14       -0.111232 
      14       -0.094579 
      14       -0.047999 
      14       -0.045669 
      14       -0.023515 
      14       0.010909 
      14       0.013870 
      14       -0.003042 
      14       -0.024856 
      14       -0.026253 
      14       -0.024358 
      14       -0.002683 
      14       0.009611 
      14       -0.008084 
      14       -0.048058 
      14       -0.064750 
      14       -0.046917 
      14       -0.005967 
      14       0.016611 
      14       0.023214 
      14       0.021996 
      14       0.023213 
      14       0.021557 
      14       0.022766 
      14       0.021114 
      14       0.022327 
      14       0.020653 
      14       0.020993 
      14       0.008669 
      14       -0.037890 
      14       -0.117461 
      14       -0.156603 
      14       -0.134221 
      14       -0.065017 
      14       -0.043495 
      14       -0.083897 
      14       -0.083440 
      14       -0.047622 
      14       -0.011611 
      14       -0.027061 
      14       -0.066273 
      14       -0.097528 
      14       -0.137845 
      14       -0.152827 
      14       -0.124274 
      14       -0.044480 
      14       0.019362 
      14       0.031639 
      15       0.018879 
      15       -0.043870 
      15       -0.112582 
      15       -0.105755 
      15       -0.071385 
      15       -0.062283 
      15       -0.054079 
      15       -0.031820 
      15       -0.000008 
      15       -0.011067 
      15       -0.031377 
      15       -0.041258 
      15       -0.064375 
      15       -0.028183 
      15       0.015484 
      15       -0.009008 
      15       -0.037736 
      15       -0.012583 
      15       0.007152 
      15       -0.004978 
      15       -0.005749 
      15       -0.004871 
      15       0.007210 
      15       -0.013309 
      15       -0.047326 
      15       -0.049962 
      15       -0.033939 
      15       -0.025623 
      15       -0.069752 
      15       -0.080513 
      15       -0.028345 
      15       -0.034188 
      15       -0.054276 
      15       -0.006236 
      15       0.034129 
      15       0.044973 
      15       0.037780 
      15       0.005484 
      15       -0.068655 
      15       -0.112782 
      15       -0.109036 
      15       -0.116787 
      15       -0.099679 
      15       -0.082691 
      15       -0.088976 
      15       -0.064939 
      15       -0.023136 
      15       0.022457 
      15       0.039006 
      16       0.012029 
      16       -0.061736 
      16       -0.105906 
      16       -0.101777 
      16       -0.103829 
      16       -0.057990 
      16       0.016674 
      16       0.048451 
      16       0.055574 
      16       0.054046 
      16       0.054518 
      16       0.047642 
      16       0.029980 
      16       0.012716 
      16       0.029553 
      16       0.046443 
      16       0.052309 
      16       0.050774 
      16       0.051278 
      16       0.044435 
      16       0.026805 
      16       0.009573 
      16       0.026441 
      16       0.043363 
      16       0.049259 
      16       0.047768 
      16       0.048728 
      16       0.046817 
      16       0.047772 
      16       0.045871 
      16       0.046836 
      16       0.044944 
      16       0.045918 
      16       0.044035 
      16       0.045019 
      16       0.043144 
      16       0.044137 
      16       0.042272 
      16       0.043273 
      16       0.041416 
      16       0.042426 
      16       0.040578 
      16       0.041596 
      16       0.039756 
      16       0.040756 
      17       0.038087 
      17       0.029729 
      17       -0.004744 
      17       -0.021089 
      17       0.000364 
      17       -0.016031 
      17       -0.050021 
      17       -0.056646 
      17       -0.048542 
      17       -0.009864 
      17       0.014984 
      17       -0.033419 
      17       -0.086843 
      17       -0.073917 
      17       -0.038207 
      17       -0.015129 
      17       -0.021678 
      17       -0.000576 
      17       0.033593 
      17       0.036314 
      17       0.018752 
      17       -0.008186 
      17       -0.028360 
      17       -0.041997 
      17       -0.005017 
      17       0.021428 
      17       -0.005182 
      17       -0.041689 
      17       -0.027352 
      17       -0.006835 
      17       0.019584 
      17       0.032519 
      17       0.019940 
      17       0.003203 
      17       0.020148 
      17       0.037133 
      17       0.043091 
      17       0.041649 
      17       0.042231 
      17       0.035039 
      17       0.012158 
      17       -0.028857 
      17       -0.050262 
      17       -0.047167 
      17       -0.014247 
      17       -0.012858 
      17       -0.094309 
      18       -0.138176 
      18       -0.063604 
      18       -0.015553 
      18       -0.068991 
      18       -0.106055 
      18       -0.078356 
      18       -0.046518 
      18       -0.002103 
      18       0.028012 
      18       -0.001911 
      18       -0.040509 
      18       -0.047655 
      18       -0.040040 
      18       -0.005090 
      18       0.015421 
      18       0.003235 
      18       0.002408 
      18       0.004056 
      18       0.025860 
      18       0.042375 
      18       0.038894 
      18       0.004781 
      18       -0.010794 
      18       0.020368 
      18       0.041006 
      18       0.037925 
      18       0.003409 
      18       -0.017059 
      18       -0.004457 
      18       0.000451 
      18       0.008010 
      18       -0.030289 
      18       -0.070688 
      18       -0.029266 
      18       0.009684 
      18       0.007342 
      18       0.025509 
      18       0.042466 
      18       0.047908 
      18       0.040260 
      18       0.008351 
      18       -0.060896 
      18       -0.086053 
      19       -0.061689 
      19       -0.061498 
      19       -0.024058 
      19       0.011210 
      19       0.008467 
      19       0.026610 
      19       0.043556 
      19       0.049012 
      19       0.042178 
      19       0.019239 
      19       -0.021873 
      19       -0.044172 
      19       -0.050061 
      19       -0.043230 
      19       -0.020279 
      19       0.020843 
      19       0.043165 
      19       0.049503 
      19       0.048022 
      19       0.048979 
      19       0.047066 
      19       0.048019 
      19       0.046115 
      19       0.047078 
      19       0.045183 
      19       0.046155 
      19       0.044270 
      19       0.045251 
      19       0.043374 
      19       0.044364 
      19       0.042471 
      19       0.042619 
      19       0.030956 
      19       -0.005176 
      19       -0.038467 
      19       -0.014978 
      19       -0.011758 
      19       -0.017369 
      19       0.014697 
      19       0.034979 
      19       0.026614 
      20       -0.031758 
      20       -0.091807 
      20       -0.107705 
      20       -0.129324 
      20       -0.139485 
      20       -0.110640 
      20       -0.030982 
      20       0.032300 
      20       0.039553 
      20       0.008504 
      20       -0.065600 
      20       -0.108906 
      20       -0.095347 
      20       -0.064737 
      20       -0.002325 
      20       0.039278 
      20       0.050574 
      20       0.049509 
      20       0.050464 
      20       0.048509 
      20       0.048597 
      20       0.036874 
      20       0.000683 
      20       -0.032666 
      20       -0.009235 
      20       -0.006073 
      20       -0.011740 
      20       0.020309 
      20       0.041812 
      20       0.048137 
      20       0.046657 
      20       0.047202 
      20       0.040400 
      20       0.022810 
      20       0.005617 
      20       0.022525 
      20       0.039473 
      20       0.044970 
      20       0.038163 
      21       0.014838 
