

 time    ||    gripping force   ||   raspberry measurement 

      0       0.240000       -795.112821 
      0       0.150000       -795.112821 
      0       0.100000       -795.112821 
      0       0.290000       -795.112821 
      0       0.280000       -795.112821 
      0       0.210000       -795.112821 
      0       0.100000       -795.112821 
      0       0.290000       -795.112821 
      0       0.120000       -795.112821 
      0       0.280000       -795.112816 
      0       0.090000       -795.111635 
      0       0.220000       -795.005360 
      0       0.310000       -791.485989 
      0       0.040000       -748.610459 
      0       0.090000       -556.446143 
      1       0.050000       -239.582553 
      1       0.070000       -47.342059 
      1       0.140000       -4.394895 
      1       0.160000       -0.826591 
      1       0.080000       -0.781415 
      1       0.060000       -0.886202 
      1       0.150000       -0.925410 
      1       0.210000       -0.904582 
      1       0.310000       -0.859978 
      1       0.200000       -0.796204 
      1       0.380000       -0.773490 
      2       0.390000       -0.788178 
      2       1.750000       -0.887733 
      2       12.070000       -0.981337 
      2       32.840000       -0.979108 
      2       47.060000       -0.944201 
      2       46.540000       -0.915930 
      2       50.200000       -0.899387 
      2       56.250000       -0.849155 
      2       63.300000       -0.837554 
      2       67.870000       -0.893935 
      3       67.820000       -0.901145 
      3       67.550000       -0.872009 
      3       67.180000       -0.864367 
      3       66.840000       -0.861156 
      3       66.700000       -0.849957 
      3       66.510000       -0.777225 
      3       66.360000       -0.586749 
      3       66.230000       -0.314686 
      3       66.170000       -0.127243 
      3       66.030000       -0.069781 
      3       65.970000       -0.031099 
      3       65.900000       0.115107 
      4       65.890000       0.427078 
      4       65.820000       0.707640 
      4       65.730000       0.815700 
      4       65.760000       0.835525 
      4       65.600000       0.824752 
      4       65.540000       0.779140 
      4       65.520000       0.713224 
      4       65.430000       0.728061 
      4       65.460000       0.787100 
      4       65.320000       0.780025 
      4       65.220000       0.741434 
      5       65.220000       0.715465 
      5       65.160000       0.707422 
      5       65.120000       0.762973 
      5       65.170000       0.821222 
      5       65.120000       0.829265 
      5       65.130000       0.807353 
      5       65.090000       0.760688 
      5       65.020000       0.714619 
      5       65.040000       0.678659 
      5       65.020000       0.702965 
      5       64.960000       0.765144 
      5       64.920000       0.767442 
      5       64.840000       0.712311 
      6       64.830000       0.728034 
      6       64.910000       0.787100 
      6       64.790000       0.780039 
      6       64.610000       0.741850 
      6       64.390000       0.719978 
      6       64.350000       0.720794 
      6       64.240000       0.753600 
      6       63.870000       0.755236 
      6       62.510000       0.741959 
      6       62.170000       0.725667 
      6       62.130000       0.684580 
      6       62.170000       0.638335 
      6       62.100000       0.679627 
      7       62.100000       0.770073 
      7       61.570000       0.809068 
      7       61.400000       0.755774 
      7       59.640000       0.672359 
      7       59.920000       0.625807 
      7       59.940000       0.619908 
      7       59.420000       0.636974 
      7       59.170000       0.577299 
      7       59.410000       0.499825 
      7       59.350000       0.533891 
      7       59.430000       0.630135 
      8       59.350000       0.641459 
      8       59.340000       0.579946 
      8       58.970000       0.570630 
      8       58.400000       0.579056 
      8       58.110000       0.567013 
      8       58.030000       0.493497 
      8       58.000000       0.443760 
      9       57.890000       0.496198 
      9       56.720000       0.578170 
      9       56.670000       0.630594 
      9       56.460000       0.580388 
      9       56.420000       0.500653 
      9       56.460000       0.455803 
      9       56.450000       0.402036 
      9       56.440000       0.398412 
      9       56.490000       0.426608 
      10       56.440000       0.418078 
      10       56.130000       0.349061 
      10       55.760000       0.243276 
      10       55.010000       0.233877 
      10       54.950000       0.286254 
      10       54.980000       0.264714 
      10       54.960000       0.179158 
      10       54.910000       0.137448 
      10       54.940000       0.174225 
      10       54.980000       0.182699 
      10       54.990000       0.187281 
      10       54.940000       0.258420 
      10       54.950000       0.326204 
      10       54.990000       0.353906 
      11       54.980000       0.353130 
      11       54.960000       0.312626 
      11       54.370000       0.293247 
      11       53.280000       0.294123 
      11       53.340000       0.270457 
      11       53.340000       0.154012 
      11       53.400000       0.065709 
      11       53.460000       0.093680 
      11       53.410000       0.132373 
      11       53.440000       0.132312 
      12       53.440000       0.170926 
      12       53.480000       0.218920 
      12       53.420000       0.269052 
      12       53.480000       0.255290 
      12       53.420000       0.145762 
      12       53.410000       0.071645 
      12       53.470000       0.033049 
      12       53.480000       0.013791 
      12       53.410000       0.007296 
      12       53.430000       0.009059 
      12       53.470000       0.016944 
      12       53.430000       0.051338 
      13       53.500000       0.070911 
      13       53.410000       0.054966 
      13       53.330000       0.054638 
      13       52.730000       0.114663 
      13       52.670000       0.213102 
      13       52.240000       0.185470 
      13       52.280000       0.125731 
      13       52.290000       0.126953 
      13       52.310000       0.150182 
      14       52.280000       0.114452 
      14       52.360000       0.062805 
      14       52.310000       0.061204 
      14       52.290000       0.054426 
      14       52.300000       0.084524 
      14       52.320000       0.155913 
      14       52.320000       0.133086 
      14       52.320000       0.091438 
      14       52.300000       0.117919 
      14       52.360000       0.094205 
      14       52.350000       0.020443 
      14       52.300000       -0.019600 
      14       52.340000       0.000891 
      14       52.340000       0.082641 
      14       52.320000       0.149064 
      15       52.200000       0.184146 
      15       51.600000       0.127969 
      15       51.520000       0.003558 
      15       51.540000       -0.058243 
      15       51.510000       -0.005751 
      15       51.520000       0.024908 
      15       51.590000       0.037515 
      15       51.530000       0.061095 
      15       51.570000       0.027194 
      15       51.540000       -0.008061 
      15       51.560000       -0.009805 
      15       51.530000       0.024005 
      15       51.550000       0.043760 
      16       51.610000       0.025985 
      16       51.580000       0.002239 
      16       51.550000       -0.021326 
      16       51.580000       0.027314 
      16       51.610000       0.062850 
      16       51.630000       -0.007339 
      16       51.550000       -0.041428 
      16       51.620000       0.004643 
      16       51.610000       -0.006037 
      16       51.620000       -0.035655 
      16       51.610000       0.028547 
      17       51.360000       0.091668 
      17       51.230000       0.055342 
      17       51.180000       0.016570 
      17       51.140000       0.018662 
      17       51.110000       0.000222 
      17       51.150000       -0.017431 
      17       51.080000       -0.028494 
      17       51.170000       -0.045821 
      17       51.090000       -0.062353 
      18       51.080000       -0.045204 
      18       51.080000       -0.032911 
      18       51.120000       -0.050193 
      18       51.080000       -0.089746 
      18       51.080000       -0.106009 
      18       51.030000       -0.087337 
      18       51.070000       -0.041050 
      18       51.070000       0.001352 
      18       51.070000       0.033899 
      18       51.060000       0.059573 
      18       51.100000       0.095963 
      18       51.100000       0.086398 
      18       51.010000       0.025371 
      19       51.070000       -0.059340 
      19       51.020000       -0.100300 
      19       51.030000       -0.087469 
      19       50.740000       -0.046553 
      19       51.060000       -0.023596 
      19       50.880000       -0.017030 
      19       50.770000       -0.023189 
      19       50.640000       -0.045449 
      19       50.840000       -0.085049 
      19       50.600000       -0.096465 
      19       50.740000       -0.059280 
      19       50.610000       0.002215 
      19       50.590000       0.026968 
      20       50.680000       0.021848 
      20       50.590000       -0.022742 
      20       50.660000       -0.020694 
      20       50.620000       0.027380 
      20       50.640000       -0.014608 
      20       50.590000       -0.052503 
      20       50.580000       0.002893 
      20       50.650000       0.045976 
      20       50.630000       0.042394 
      20       50.600000       0.045079 
      20       50.610000       0.001090 
      21       50.610000       -0.058697 
      21       50.610000       -0.038693 
      21       50.610000       -0.012558 
      21       50.610000       -0.049704 
      21       50.610000       -0.052264 
      21       50.550000       -0.031446 
      21       50.550000       -0.051401 
      21       50.570000       -0.046992 
      21       50.630000       0.000137 
      21       50.600000       0.006688 
      21       50.280000       -0.000764 
      22       49.830000       0.007108 
      22       49.800000       0.006680 
      22       49.850000       -0.006278 
      22       49.890000       0.066579 
      22       49.870000       0.140353 
      22       49.800000       0.082667 
      22       50.010000       0.005538 
      22       49.930000       -0.022505 
      22       49.910000       -0.062201 
      23       49.900000       -0.086368 
      23       49.980000       -0.036813 
      23       49.910000       0.022646 
      23       49.880000       0.033878 
      23       49.920000       0.032718 
      23       49.920000       0.009695 
      23       49.960000       -0.017852 
      23       49.900000       -0.062088 
      23       49.970000       -0.101335 
      23       49.970000       -0.107048 
      24       49.910000       -0.088628 
      24       49.970000       -0.011903 
      24       49.970000       0.048992 
      24       49.970000       -0.010972 
      24       49.990000       -0.072419 
      24       50.030000       -0.038521 
      24       49.970000       -0.007480 
      24       50.010000       -0.039333 
      24       49.950000       -0.022549 
      24       49.960000       0.022460 
      24       49.960000       0.013395 
      25       49.950000       -0.012939 
      25       49.980000       -0.057185 
      25       50.000000       -0.096534 
      25       49.950000       -0.103996 
      25       49.980000       -0.105232 
      25       49.960000       -0.102768 
      25       49.970000       -0.102727 
      25       49.980000       -0.094969 
      25       49.970000       -0.072752 
      26       49.980000       -0.045412 
      26       49.960000       -0.073789 
      26       49.960000       -0.099638 
      26       50.000000       -0.061395 
      26       49.940000       -0.057711 
      26       49.970000       -0.077004 
      26       50.060000       -0.051059 
      26       49.990000       -0.035832 
      26       49.950000       -0.066554 
      26       50.020000       -0.086717 
      26       49.950000       -0.082754 
      26       49.980000       -0.042870 
      27       49.950000       -0.002959 
      27       49.980000       0.005458 
      27       50.000000       0.006802 
      27       49.610000       -0.005314 
      27       50.000000       -0.050457 
      27       50.010000       -0.115210 
      27       49.910000       -0.099355 
      27       50.060000       -0.039462 
      27       49.960000       -0.040301 
      27       49.960000       -0.049268 
      27       49.950000       -0.017230 
      28       50.020000       0.004662 
      28       49.990000       0.012196 
      28       49.970000       0.020489 
      28       49.970000       0.054448 
      28       49.930000       0.069443 
      28       49.980000       0.037668 
      28       49.980000       0.015586 
      29       49.970000       0.007835 
      29       49.960000       -0.001110 
      29       49.950000       -0.041045 
      29       49.920000       -0.085436 
      29       49.980000       -0.115662 
      29       49.970000       -0.141118 
      29       49.940000       -0.101089 
      29       49.950000       -0.036245 
      29       49.940000       -0.041145 
      29       50.010000       -0.063356 
      29       49.920000       -0.022802 
      30       49.950000       0.052879 
      30       49.980000       0.086939 
      30       49.930000       0.039505 
      30       50.000000       -0.005249 
      30       49.940000       0.038737 
      30       49.970000       0.080460 
      30       49.960000       0.032201 
      30       49.940000       -0.031077 
      30       49.930000       -0.006017 
      30       49.980000       0.046951 
      31       49.960000       0.048114 
      31       49.920000       0.014485 
      31       49.960000       -0.020812 
      31       49.930000       -0.000995 
      31       49.970000       -0.018401 
      31       49.990000       -0.043832 
      31       49.930000       -0.026194 
      31       49.950000       -0.041845 
      31       49.980000       -0.064926 
      31       49.980000       -0.024369 
      31       49.980000       0.051752 
      32       50.020000       0.090730 
      32       49.970000       0.061855 
      32       49.980000       0.032019 
      32       49.990000       0.056063 
      32       49.990000       0.071042 
      32       49.990000       0.049038 
      32       49.960000       0.064087 
      32       49.960000       0.087771 
      32       49.980000       0.056360 
      32       49.950000       0.011794 
      32       49.980000       -0.020668 
      32       49.950000       -0.062205 
      33       49.940000       -0.083290 
      33       49.930000       -0.079413 
      33       49.960000       -0.040401 
      33       49.930000       -0.009915 
      33       49.930000       -0.034127 
      33       49.940000       -0.048488 
      33       49.910000       -0.017335 
      33       49.960000       -0.000801 
      33       49.990000       -0.017154 
      33       49.940000       -0.047650 
      33       49.990000       -0.032471 
      33       49.890000       -0.007809 
      33       49.970000       -0.036975 
      34       49.950000       -0.065423 
      34       49.960000       -0.035087 
      34       49.970000       0.003908 
      34       49.900000       0.012245 
      34       49.910000       0.013972 
      34       49.960000       0.007528 
      34       49.960000       -0.009733 
      34       49.910000       -0.026613 
      34       49.890000       -0.009822 
      34       49.950000       0.002117 
      34       49.960000       -0.015528 
      35       49.930000       -0.055827 
      35       49.960000       -0.076510 
      35       49.970000       -0.067769 
      35       49.960000       -0.009424 
      35       49.950000       0.045705 
      35       49.980000       0.038535 
      35       49.940000       0.026296 
      36       49.920000       0.033419 
      36       49.960000       0.030588 
      36       49.940000       -0.007142 
      36       49.900000       -0.027352 
      36       49.880000       -0.031177 
      36       49.940000       -0.018821 
      36       50.020000       -0.033787 
      36       50.070000       -0.044908 
      36       49.960000       -0.022353 
      36       49.890000       -0.033162 
      36       49.970000       -0.043052 
      37       49.980000       -0.011102 
      37       49.940000       0.010728 
      37       49.970000       0.018188 
      37       49.880000       0.025983 
      37       49.990000       0.054567 
      37       49.920000       0.046458 
      37       49.940000       -0.014743 
      37       49.960000       -0.022173 
      37       49.960000       0.006416 
      37       49.910000       0.007745 
      37       49.980000       -0.022162 
      38       49.890000       -0.080801 
      38       49.910000       -0.062382 
      38       49.940000       0.025330 
      38       49.960000       0.055966 
      38       49.940000       0.058245 
      38       50.010000       0.018441 
      38       49.950000       -0.007756 
      38       49.960000       -0.037963 
      38       49.970000       -0.072585 
      38       49.960000       -0.074969 
      38       49.950000       -0.057872 
      39       49.980000       -0.040354 
      39       49.940000       -0.056876 
      39       49.950000       -0.072243 
      39       49.990000       -0.063956 
      39       49.940000       -0.015450 
      39       49.940000       0.002520 
      39       50.000000       -0.035285 
      39       49.970000       -0.015280 
      39       49.960000       0.034385 
      39       49.970000       0.059954 
      39       49.940000       0.037923 
      39       49.930000       -0.002294 
      39       49.920000       -0.033339 
      40       49.960000       0.001145 
      40       49.900000       0.055691 
      40       49.960000       0.065342 
      40       49.950000       0.054507 
      40       49.930000       0.000216 
      40       49.950000       -0.025400 
      40       49.990000       0.028435 
      40       49.950000       0.043704 
      40       49.940000       -0.006819 
      40       49.910000       0.010079 
      40       49.960000       0.078292 
      40       49.950000       0.108124 
      41       49.930000       0.103960 
      41       49.970000       0.054490 
      41       49.920000       -0.018263 
      41       50.000000       -0.043433 
      41       49.950000       -0.011932 
      41       49.940000       0.019255 
      41       49.880000       0.058956 
      41       49.950000       0.079252 
      41       49.930000       0.066002 
      41       49.980000       0.059176 
      42       49.890000       0.035450 
      42       49.970000       0.007632 
      42       49.970000       -0.036859 
      42       49.980000       -0.076411 
      42       49.960000       -0.084049 
      42       49.950000       -0.084619 
      42       49.940000       -0.072097 
      42       49.900000       -0.029385 
      42       49.920000       0.037181 
      43       49.930000       0.081007 
      43       49.970000       0.098998 
      43       49.940000       0.055731 
      43       49.950000       -0.003700 
      43       49.950000       -0.039250 
      43       49.960000       -0.001065 
      43       49.920000       0.062713 
      43       49.950000       0.055507 
      43       49.930000       0.016321 
      43       49.940000       -0.014896 
      43       49.890000       -0.046652 
      43       49.900000       -0.030233 
      43       49.900000       0.009538 
      43       49.900000       0.040496 
      44       49.940000       0.071185 
      44       49.980000       0.045984 
      44       49.880000       -0.016432 
      44       50.010000       -0.022173 
      44       49.930000       0.028711 
      44       49.970000       0.052297 
      44       49.960000       0.045607 
      44       49.920000       -0.014352 
      44       49.950000       -0.072726 
      44       49.880000       -0.085320 
      44       49.930000       -0.086729 
      45       49.960000       -0.079132 
      45       49.910000       -0.055823 
      45       49.940000       -0.014771 
      45       49.940000       0.003002 
      45       49.970000       -0.008869 
      45       49.900000       -0.025306 
      45       49.940000       -0.008102 
      45       49.920000       0.008328 
      45       49.960000       0.005200 
      45       49.940000       -0.027765 
      45       49.890000       -0.034491 
      45       49.920000       0.018997 
      45       49.910000       0.010418 
      45       49.930000       -0.083722 
      46       49.940000       -0.103288 
      46       49.980000       -0.031311 
      46       49.950000       0.048896 
      46       49.910000       0.064759 
      46       49.940000       -0.004150 
      46       49.930000       -0.066256 
      46       49.960000       -0.074407 
      46       49.890000       -0.057301 
      46       49.940000       -0.033581 
      46       49.890000       -0.015578 
      46       49.870000       0.054358 
      46       49.930000       0.145059 
      47       49.970000       0.173043 
      47       49.930000       0.131257 
      47       49.980000       0.065739 
      47       49.890000       0.003330 
      47       50.000000       -0.003308 
      47       49.930000       0.017527 
      47       49.880000       0.051050 
      47       49.920000       0.047444 
      47       49.960000       -0.004957 
      47       49.920000       -0.034164 
      47       49.920000       -0.052037 
      47       49.950000       -0.036416 
      48       49.890000       -0.020125 
      48       49.930000       -0.028300 
      48       49.890000       -0.019189 
      48       49.940000       -0.029605 
      48       49.910000       -0.021346 
      48       49.880000       0.025475 
      48       49.980000       0.026055 
      48       49.960000       -0.009151 
      48       49.930000       -0.043769 
      48       49.960000       -0.018804 
      48       49.980000       0.048235 
      48       49.910000       0.072267 
      48       49.930000       0.036396 
      49       49.930000       -0.004232 
      49       49.890000       -0.026446 
      49       49.960000       -0.008817 
      49       49.950000       0.017883 
      49       49.890000       0.058024 
      49       49.860000       0.087717 
      49       49.920000       0.107161 
      49       49.910000       0.118603 
      49       49.910000       0.081829 
      49       49.960000       0.112638 
      49       49.920000       0.139727 
      49       49.930000       0.055048 
      49       49.940000       -0.036959 
      50       49.930000       -0.037019 
      50       49.940000       -0.013188 
      50       49.900000       -0.037872 
      50       49.980000       -0.053021 
      50       49.970000       -0.030359 
      50       49.920000       -0.036221 
      50       49.950000       -0.028295 
      51       49.940000       0.010085 
      51       49.990000       -0.011270 
      51       49.920000       -0.016885 
      51       50.030000       0.039553 
      51       49.880000       0.046309 
      51       49.980000       0.017002 
      51       50.000000       0.009294 
      52       49.950000       0.006952 
      52       49.950000       0.008280 
      52       49.950000       0.006760 
      52       49.940000       0.007678 
      52       50.010000       0.000858 
      52       49.930000       -0.020830 
      52       49.910000       -0.051702 
      52       49.970000       -0.035658 
      52       49.910000       -0.001563 
      52       49.990000       0.001960 
      52       49.920000       -0.009088 
      52       49.980000       -0.002818 
      52       49.960000       0.044270 
      52       49.930000       0.052242 
      53       49.970000       0.046430 
      53       49.910000       0.077884 
      53       49.970000       0.097960 
      53       49.980000       0.093872 
      53       49.950000       0.053464 
      53       49.920000       0.008966 
      53       49.910000       -0.013268 
      53       49.970000       -0.013178 
      53       49.950000       0.010058 
      53       49.930000       -0.020272 
      53       49.920000       -0.039475 
      54       49.940000       0.025577 
      54       49.970000       0.087043 
      54       49.910000       0.093698 
      54       49.940000       0.061706 
      54       49.930000       -0.017011 
      54       49.950000       -0.070451 
      54       49.910000       -0.045396 
      54       50.010000       -0.005486 
      54       49.970000       0.016838 
      54       49.920000       0.065800 
      54       49.920000       0.082518 
      54       49.940000       0.037291 
      54       50.000000       0.017870 
      55       49.930000       -0.028946 
      55       49.950000       -0.082294 
      55       49.890000       -0.089473 
      55       50.020000       -0.072218 
      55       49.920000       -0.049252 
      55       49.960000       -0.042607 
      55       49.900000       -0.029232 
      55       49.960000       -0.042751 
      55       49.960000       -0.037800 
      55       49.920000       0.054834 
      56       49.940000       0.141634 
      56       49.890000       0.120761 
      56       49.880000       0.064982 
      56       49.970000       0.039006 
      56       49.980000       -0.012377 
      56       49.930000       -0.029096 
      56       49.940000       0.003482 
      56       49.890000       -0.024003 
      56       49.940000       -0.057927 
      56       49.900000       -0.053839 
      56       49.900000       -0.061716 
      56       49.930000       -0.041104 
      57       49.910000       -0.015943 
      57       49.910000       -0.045839 
      57       49.870000       -0.083174 
      57       49.910000       -0.080479 
      57       49.960000       -0.039385 
      57       49.940000       0.017403 
      57       49.960000       0.022956 
      57       49.970000       -0.003421 
      57       49.930000       -0.060614 
      57       49.890000       -0.091514 
      57       49.880000       -0.044430 
      58       49.920000       -0.009015 
      58       49.920000       -0.020380 
      58       49.930000       -0.050418 
      58       49.930000       -0.035199 
      58       49.930000       -0.010535 
      58       49.910000       -0.040525 
      58       49.900000       -0.078777 
      58       49.880000       -0.086378 
      58       49.900000       -0.087789 
      59       49.900000       -0.085500 
      59       49.920000       -0.085644 
      59       49.920000       -0.078457 
      59       49.900000       -0.060434 
      59       49.920000       -0.041150 
      59       49.850000       -0.037638 
      59       49.890000       0.025363 
      59       49.860000       0.105746 
      59       49.900000       0.092834 
      59       49.900000       0.077191 
      59       49.920000       0.094217 
      60       49.890000       0.054588 
      60       49.840000       -0.000815 
      60       49.880000       -0.032065 
      60       49.860000       -0.029335 
      60       49.920000       -0.008812 
      60       49.870000       0.028686 
      60       49.920000       0.030458 
