Human trial picking the raspberry twin 

 time    ||     output     ||     loadcell

      0.000000       -800.764615       0.180000 
      0.031916       -800.764615       0.080000 
      0.063917       -800.764615       0.150000 
      0.094412       -800.764615       0.020000 
      0.126442       -800.764615       0.010000 
      0.156905       -800.764615       0.250000 
      0.188693       -800.764615       0.060000 
      0.220212       -800.764615       0.010000 
      0.251194       -800.764615       0.110000 
      0.282339       -800.764611       0.030000 
      0.313422       -800.763420       0.090000 
      0.344618       -800.656249       0.160000 
      0.375148       -797.107211       0.340000 
      0.405568       -753.870829       0.050000 
      0.436301       -560.096147       0.080000 
      0.467590       -240.609353       0.050000 
      0.498901       -46.843144       0.000000 
      0.529725       -3.648081       0.030000 
      0.560536       -0.135671       0.170000 
      0.592021       -0.037635       0.010000 
      0.622875       -0.028668       0.100000 
      0.654367       -0.071408       0.040000 
      0.685602       -0.120992       0.120000 
      0.717631       -0.119329       0.030000 
      0.749378       -0.049317       0.170000 
      0.780484       -0.010861       0.030000 
      0.811620       -0.029629       0.070000 
      0.843026       -0.024230       0.090000 
      0.874706       0.019178       0.100000 
      0.906533       0.020590       0.120000 
      0.937767       -0.026515       0.130000 
      0.969421       -0.037646       0.050000 
      1.001332       -0.044054       0.050000 
      1.031227       -0.049730       0.060000 
      1.061676       -0.027055       0.050000 
      1.092927       -0.039515       0.090000 
      1.123939       -0.131860       0.020000 
      1.155525       -0.200380       0.020000 
      1.186799       -0.215218       0.190000 
      1.218508       -0.139847       0.020000 
      1.249818       0.004353       0.340000 
      1.281088       0.057286       0.040000 
      1.312557       0.018309       0.050000 
      1.344356       -0.007634       0.090000 
      1.375253       -0.014445       0.180000 
      1.405210       -0.009379       0.060000 
      1.436420       -0.002401       0.080000 
      1.467772       -0.028677       0.260000 
      1.498410       -0.105930       0.150000 
      1.528346       -0.145619       0.110000 
      1.559285       -0.135110       0.040000 
      1.590079       -0.094112       0.050000 
      1.620794       -0.083603       0.060000 
      1.650654       -0.123265       0.110000 
      1.682553       -0.199618       0.070000 
      1.712773       -0.214679       0.080000 
      1.744712       -0.154754       0.020000 
      1.776603       -0.055159       0.040000 
      1.807520       -0.005516       0.070000 
      1.837172       -0.000907       0.030000 
      1.868090       0.029923       0.070000 
      1.900004       0.044814       0.130000 
      1.931919       0.008906       0.160000 
      1.963556       -0.026015       0.020000 
      1.994848       -0.021103       0.130000 
      2.024751       0.033975       0.060000 
      2.055150       0.009309       0.210000 
      2.086559       -0.097308       0.050000 
      2.118691       -0.160083       0.110000 
      2.149517       -0.197293       0.170000 
      2.180883       -0.169886       0.120000 
      2.212532       -0.088905       0.080000 
      2.244610       -0.071327       0.200000 
      2.276512       -0.080791       0.050000 
      2.306927       -0.067712       0.010000 
      2.338513       -0.066024       0.090000 
      2.369291       -0.057827       0.050000 
      2.400039       -0.043169       0.050000 
      2.430065       -0.039059       0.320000 
      2.461449       -0.109918       0.100000 
      2.491611       -0.163614       0.250000 
      2.522629       -0.141272       0.080000 
      2.553620       -0.109891       0.130000 
      2.585538       -0.060581       0.010000 
      2.616449       -0.012218       0.050000 
      2.648094       -0.035516       0.030000 
      2.679216       -0.117958       0.190000 
      2.710588       -0.139887       0.050000 
      2.740392       -0.094238       0.130000 
      2.771871       -0.123831       0.210000 
      2.802700       -0.175792       0.160000 
      2.833500       -0.131002       0.120000 
      2.864278       -0.140488       0.080000 
      2.894994       -0.282398       0.110000 
      2.925738       -0.330845       0.190000 
      2.957428       -0.195106       0.010000 
      3.003838       -0.059271       0.130000 
      3.035227       0.004741       0.080000 
      3.067071       -0.039986       0.090000 
      3.099008       -0.169996       0.170000 
      3.130786       -0.227218       0.020000 
      3.161228       -0.170438       0.110000 
      3.191814       -0.045291       0.280000 
      3.223251       -0.016327       0.000000 
      3.255090       -0.060525       0.070000 
      3.285586       -0.040468       0.090000 
      3.316578       -0.025217       0.130000 
      3.348359       -0.111221       0.030000 
      3.378271       -0.192834       0.140000 
      3.408786       -0.206706       0.050000 
      3.439667       -0.191053       0.210000 
      3.470384       -0.173124       0.050000 
      3.501023       -0.180778       0.090000 
      3.531961       -0.165498       0.050000 
      3.563793       -0.159296       0.030000 
      3.595372       -0.205379       0.360000 
      3.626591       -0.228743       0.030000 
      3.657860       -0.218861       0.150000 
      3.689046       -0.221576       0.060000 
      3.719567       -0.243085       0.010000 
      3.750847       -0.274895       0.130000 
      3.781717       -0.264128       0.100000 
      3.813561       -0.247597       0.140000 
      3.844503       -0.246172       0.100000 
      3.874852       -0.200050       0.310000 
      3.905403       -0.183063       0.210000 
      3.936327       -0.211191       0.180000 
      3.967805       -0.170480       0.020000 
      3.999331       -0.148958       0.150000 
      4.031274       -0.220646       0.070000 
      4.062469       -0.237172       0.110000 
      4.094439       -0.179922       0.010000 
      4.126354       -0.155173       0.050000 
      4.158452       -0.180791       0.030000 
      4.190183       -0.183866       0.010000 
      4.220105       -0.174993       0.030000 
      4.252019       -0.190111       0.110000 
      4.283931       -0.214860       0.000000 
      4.314850       -0.231360       0.090000 
      4.345771       -0.220175       0.030000 
      4.377698       -0.148444       0.040000 
      4.407601       -0.099647       0.120000 
      4.439549       -0.076709       0.090000 
      4.470464       -0.030626       0.010000 
      4.501392       -0.036402       0.110000 
      4.532311       -0.110388       0.100000 
      4.563227       -0.172584       0.070000 
      4.593145       -0.189307       0.020000 
      4.625060       -0.186496       0.160000 
      4.656975       -0.177664       0.060000 
      4.687894       -0.134130       0.140000 
      4.718810       -0.157068       0.180000 
      4.750782       -0.229589       0.090000 
      4.782317       -0.276720       0.020000 
      4.812641       -0.280671       0.180000 
      4.844192       -0.258382       0.130000 
      4.874962       -0.278453       0.050000 
      4.905180       -0.272252       0.000000 
      4.935181       -0.217103       0.110000 
      4.966435       -0.243155       0.120000 
      4.998382       -0.279326       0.160000 
      5.028916       -0.297874       0.030000 
      5.060799       -0.324150       0.240000 
      5.092967       -0.309904       0.100000 
      5.123888       -0.278107       0.050000 
      5.155370       -0.282067       0.130000 
      5.186468       -0.275409       0.170000 
      5.217564       -0.296435       0.060000 
      5.249615       -0.330944       0.110000 
      5.279503       -0.268208       0.030000 
      5.309897       -0.223003       0.250000 
      5.339529       -0.276739       0.100000 
      5.369713       -0.371751       0.100000 
      5.400375       -0.413917       0.150000 
      5.432309       -0.373513       0.200000 
      5.464188       -0.361526       0.090000 
      5.495361       -0.402180       0.180000 
      5.526523       -0.408101       0.000000 
      5.557514       -0.313892       0.180000 
      5.588410       -0.222586       0.050000 
      5.620020       -0.226490       0.060000 
      5.651525       -0.279906       0.030000 
      5.682127       -0.301778       0.150000 
      5.714049       -0.285694       0.120000 
      5.746180       -0.254743       0.160000 
      5.778014       -0.270064       0.040000 
      5.808017       -0.300906       0.080000 
      5.838500       -0.305462       0.050000 
      5.869281       -0.353413       0.110000 
      5.899859       -0.434004       0.020000 
      5.931216       -0.427373       0.120000 
      5.978365       -0.372641       0.220000 
      6.008386       -0.337730       0.320000 
      6.039380       -0.298262       0.050000 
      6.071267       -0.292034       0.250000 
      6.102991       -0.295551       0.110000 
      6.134905       -0.323857       0.190000 
      6.166490       -0.375326       0.050000 
      6.197972       -0.388351       0.110000 
      6.229056       -0.393321       0.000000 
      6.259964       -0.399966       0.180000 
      6.290330       -0.369567       0.140000 
      6.321987       -0.348498       0.070000 
      6.352849       -0.352069       0.160000 
      6.384165       -0.331029       0.130000 
      6.414079       -0.365124       0.230000 
      6.444004       -0.469443       0.140000 
      6.475016       -0.515674       0.040000 
      6.506328       -0.476627       0.140000 
      6.537186       -0.391563       0.060000 
      6.568762       -0.310806       0.020000 
      6.600427       -0.308257       0.060000 
      6.631474       -0.357800       0.170000 
      6.662910       -0.400089       0.110000 
      6.694086       -0.386510       0.130000 
      6.724535       -0.367379       0.050000 
      6.755115       -0.356046       0.140000 
      6.785477       -0.403702       0.090000 
      6.816414       -0.477013       0.180000 
      6.848278       -0.443540       0.080000 
      6.878172       -0.339033       0.080000 
      6.908454       -0.308673       0.010000 
      6.938782       -0.334033       0.240000 
      6.970751       -0.359335       0.010000 
      7.002666       -0.351958       0.140000 
      7.033583       -0.318971       0.130000 
      7.064502       -0.299568       0.080000 
      7.096417       -0.389804       0.100000 
      7.128330       -0.466672       0.040000 
      7.160278       -0.414028       0.130000 
      7.191674       -0.345788       0.150000 
      7.223588       -0.379950       0.010000 
      7.255534       -0.467698       0.110000 
      7.287415       -0.566354       0.130000 
      7.319330       -0.575670       0.150000 
      7.349251       -0.464167       0.050000 
      7.381166       -0.348073       0.030000 
      7.412339       -0.336455       0.060000 
      7.443655       -0.394634       0.020000 
      7.475040       -0.404090       0.010000 
      7.505577       -0.378537       0.020000 
      7.536563       -0.392879       0.030000 
      7.567407       -0.424730       0.100000 
      7.598058       -0.488365       0.150000 
      7.628510       -0.544346       0.040000 
      7.659324       -0.535872       0.050000 
      7.689818       -0.504465       0.040000 
      7.720764       -0.440428       0.010000 
      7.751559       -0.379920       0.050000 
      7.782162       -0.374538       0.110000 
      7.813626       -0.408590       0.080000 
      7.844775       -0.498247       0.010000 
      7.876432       -0.534461       0.110000 
      7.907403       -0.488421       0.090000 
      7.938036       -0.500009       0.060000 
      7.968548       -0.539403       0.020000 
      7.999166       -0.505390       0.270000 
      8.030076       -0.428716       0.810000 
      8.061434       -0.317990       3.860000 
      8.092719       -0.231597       3.890000 
      8.123951       -0.272281       15.460000 
      8.154930       -0.351182       42.120000 
      8.186964       -0.396395       68.930000 
      8.218272       -0.453855       106.490000 
      8.249254       -0.462202       145.720000 
      8.280364       -0.401045       165.060000 
      8.311717       -0.358730       191.890000 
      8.342434       -0.383090       216.140000 
      8.372579       -0.387410       251.880000 
      8.403557       -0.395647       268.510000 
      8.434558       -0.408963       279.820000 
      8.465180       -0.416712       309.330000 
      8.496051       -0.436723       317.760000 
      8.527806       -0.525561       319.080000 
      8.558938       -0.610373       328.120000 
      8.589233       -0.442391       263.410000 
      8.619565       -0.015995       98.100000 
      8.650728       0.429101       5.820000 
      8.681878       0.853742       5.540000 
      8.711800       1.170663       5.720000 
      8.742839       1.448001       5.680000 
      8.774231       1.815607       5.640000 
      8.804718       2.124519       6.210000 
      8.836525       2.339931       5.800000 
      8.867595       2.624540       6.250000 
      8.898099       2.943329       5.860000 
      8.928979       3.129170       6.510000 
      8.959609       3.200551       5.850000 
      8.990547       3.147344       6.320000 
      9.021765       2.592701       5.730000 
      9.052888       1.092062       6.120000 
      9.084838       -0.437756       5.600000 
      9.115427       -0.670585       6.070000 
      9.146054       -0.490519       5.670000 
      9.178135       -0.879237       6.260000 
      9.209054       -1.457935       5.990000 
      9.240169       -1.820053       5.950000 
      9.270940       -2.077324       6.290000 
      9.302048       -2.248606       6.160000 
      9.333374       -2.204794       6.220000 
      9.365080       -2.045359       5.870000 
      9.396696       -1.961498       6.030000 
      9.428036       -1.952095       5.730000 
      9.458431       -1.918902       6.210000 
      9.488952       -1.899620       5.560000 
      9.519739       -1.905393       5.790000 
      9.549690       -1.888917       5.670000 
      9.580166       -1.872791       5.990000 
      9.610621       -1.901559       5.580000 
      9.640603       -2.062509       6.400000 
      9.672625       -2.374466       6.060000 
      9.704528       -2.639761       5.800000 
      9.735608       -2.749702       6.010000 
      9.766593       -2.787357       6.000000 
      9.797662       -2.804464       6.080000 
      9.828428       -2.788808       5.710000 
      9.859376       -2.770010       5.820000 
      9.890718       -2.765054       5.790000 
      9.922063       -2.764570       5.970000 
      9.952901       -2.762784       5.710000 
      9.983762       -2.741161       5.900000 
      10.014486       -2.643499       5.740000 
      10.045200       -2.473527       6.210000 
      10.076583       -2.332414       5.860000 
      10.107787       -2.239030       6.180000 
      10.138614       -2.156206       5.840000 
      10.169645       -2.051171       6.160000 
      10.200573       -1.998362       5.960000 
      10.232173       -2.043058       6.110000 
      10.262774       -2.097263       5.850000 
      10.294007       -2.022404       5.880000 
      10.325886       -1.889752       6.040000 
      10.356591       -1.828372       5.700000 
      10.388209       -1.815329       6.120000 
      10.419394       -1.822087       6.250000 
      10.450517       -1.854314       6.020000 
      10.481271       -1.928756       5.910000 
      10.512121       -1.970397       6.110000 
      10.543614       -1.965124       5.910000 
      10.575196       -2.030049       5.980000 
      10.606595       -2.138100       5.670000 
      10.637568       -2.159999       6.000000 
      10.669222       -2.090193       5.880000 
      10.700483       -2.009892       5.970000 
      10.732374       -1.997888       5.740000 
      10.762805       -2.014348       5.930000 
      10.794365       -2.038614       5.980000 
      10.825517       -2.047031       6.070000 
      10.856600       -1.998663       5.790000 
      10.887589       -1.900493       6.170000 
      10.918771       -1.835972       6.010000 
      10.948971       -1.835472       6.060000 
      10.980052       -1.829186       6.010000 
      11.010767       -1.794221       5.840000 
      11.042583       -1.770454       6.030000 
      11.073913       -1.765068       6.120000 
      11.105830       -1.764625       5.890000 
      11.136572       -1.764611       5.670000 
      11.167938       -1.764611       6.010000 
      11.199288       -1.764611       5.870000 
      11.230187       -1.764611       5.940000 
      11.261339       -1.764611       6.060000 
      11.292420       -1.764611       6.030000 
      11.323374       -1.764611       5.930000 
      11.354506       -1.764611       6.140000 
      11.386573       -1.764611       5.790000 
      11.417752       -1.764611       5.960000 
      11.448796       -1.764611       5.780000 
      11.479594       -1.764611       5.720000 
      11.510416       -1.764611       5.830000 
      11.541114       -1.764611       5.620000 
      11.572570       -1.764611       5.950000 
      11.604489       -1.764611       5.910000 
      11.634907       -1.764611       6.160000 
      11.666584       -1.764611       5.850000 
      11.697667       -1.764611       6.290000 
      11.728191       -1.764611       6.080000 
      11.759322       -1.764611       6.080000 
      11.789809       -1.764611       6.040000 
      11.820967       -1.764611       5.810000 
      11.852199       -1.764611       5.900000 
      11.883266       -1.764611       5.950000 
      11.914886       -1.764611       6.090000 
      11.946123       -1.764611       6.240000 
      11.976779       -1.764611       5.850000 
      12.008077       -1.764611       6.280000 
      12.038536       -1.764611       5.800000 
      12.069184       -1.764611       5.830000 
      12.100544       -1.764611       5.970000 
      12.131843       -1.764611       6.240000 
      12.162965       -1.764611       5.830000 
      12.193367       -1.764611       5.830000 
      12.224296       -1.764611       6.030000 
      12.256176       -1.764611       5.990000 
      12.287122       -1.764611       5.870000 
      12.317757       -1.764611       6.150000 
      12.349045       -1.764611       5.980000 
      12.379630       -1.764611       6.020000 
      12.411584       -1.764611       6.080000 
      12.443284       -1.764611       5.960000 
      12.474020       -1.764611       6.000000 
      12.505037       -1.764611       5.930000 
      12.534933       -1.764611       5.870000 
      12.566201       -1.764611       6.030000 
      12.598633       -1.764611       6.120000 
      12.629813       -1.764611       5.940000 
      12.660724       -1.764611       5.930000 
      12.692015       -1.764611       6.180000 
      12.722969       -1.764611       5.900000 
      12.754233       -1.764611       5.840000 
      12.786508       -1.764611       6.190000 
      12.817870       -1.764611       5.810000 
      12.849044       -1.764611       5.990000 
      12.880878       -1.764611       6.080000 
      12.912353       -1.764611       5.960000 
      12.943878       -1.764611       5.930000 
      12.974450       -1.764611       5.890000 
      13.006598       -1.764598       5.860000 
      13.037994       -1.764168       6.000000 
      13.069370       -1.759212       5.940000 
      13.100695       -1.740414       5.940000 
      13.130800       -1.724717       5.900000 
      13.161798       -1.740414       5.790000 
      13.193263       -1.759212       5.780000 
      13.224447       -1.764168       6.020000 
      13.255528       -1.764598       5.920000 
      13.287001       -1.764611       6.000000 
      13.316985       -1.764611       5.970000 
      13.347783       -1.764611       5.980000 
      13.379458       -1.764611       6.020000 
      13.409371       -1.764611       6.150000 
      13.439960       -1.764611       5.790000 
      13.471120       -1.764611       5.970000 
      13.502069       -1.764611       5.980000 
      13.533839       -1.764598       6.040000 
      13.565037       -1.764168       6.190000 
      13.595924       -1.759212       6.030000 
      13.627190       -1.740414       6.030000 
      13.658682       -1.724717       6.070000 
      13.689235       -1.740414       5.970000 
      13.720635       -1.759212       5.980000 
      13.751738       -1.764168       5.980000 
      13.782465       -1.764598       6.050000 
      13.813422       -1.764611       5.860000 
      13.845084       -1.764611       5.990000 
      13.876578       -1.764611       5.910000 
      13.922912       -1.764611       5.910000 
      13.953462       -1.764611       5.820000 
      13.984891       -1.764598       5.790000 
      14.014775       -1.764168       6.210000 
      14.046693       -1.759212       5.850000 
      14.077587       -1.740414       6.030000 
      14.108888       -1.724717       6.040000 
      14.139424       -1.740401       5.810000 
      14.171242       -1.758769       6.120000 
      14.202195       -1.758769       5.920000 
      14.233114       -1.740401       6.000000 
      14.265020       -1.724717       6.060000 
      14.296939       -1.740414       6.000000 
      14.328887       -1.759212       6.120000 
      14.360801       -1.764155       5.810000 
      14.392682       -1.764155       6.110000 
      14.423632       -1.759212       5.960000 
      14.454543       -1.740414       6.050000 
      14.486459       -1.724703       5.770000 
      14.518377       -1.739971       6.090000 
      14.548271       -1.753799       6.090000 
      14.578189       -1.739514       5.850000 
      14.609286       -1.718848       5.980000 
      14.640220       -1.710361       5.810000 
      14.671539       -1.689265       6.040000 
      14.703073       -1.670024       5.860000 
      14.734773       -1.665068       6.050000 
      14.766539       -1.665054       5.850000 
      14.797950       -1.669581       5.890000 
      14.828533       -1.683852       5.680000 
      14.860272       -1.685707       6.020000 
      14.891395       -1.673098       5.790000 
      14.922006       -1.685278       6.150000 
      14.953536       -1.678910       5.960000 
      14.984587       -1.651226       6.140000 
      15.015306       -1.654743       5.820000 
      15.045529       -1.704505       6.050000 
      15.075108       -1.722860       6.060000 
      15.105346       -1.688378       6.090000 
      15.137225       -1.646672       5.980000 
      15.168339       -1.630102       5.880000 
      15.199246       -1.658312       5.740000 
      15.231058       -1.663211       5.820000 
      15.261838       -1.588835       5.990000 
      15.293546       -1.512218       6.000000 
      15.325488       -1.507262       5.960000 
      15.356405       -1.564638       6.040000 
      15.387767       -1.622860       6.120000 
      15.418547       -1.628246       5.970000 
      15.449176       -1.594220       6.140000 
      15.480572       -1.571313       5.770000 
      15.511884       -1.575006       5.740000 
      15.543651       -1.603120       5.870000 
      15.574806       -1.607260       6.190000 
      15.605611       -1.587440       5.840000 
      15.636690       -1.635970       6.040000 
      15.668085       -1.662229       5.810000 
      15.700072       -1.619843       5.850000 
      15.730392       -1.579357       6.060000 
      15.761829       -1.585734       6.130000 
      15.793313       -1.578494       6.070000 
      15.823822       -1.546283       5.890000 
      15.854942       -1.536348       5.990000 
      15.885511       -1.592904       6.000000 
      15.917001       -1.647430       6.160000 
      15.948231       -1.584834       5.960000 
      15.978306       -1.499125       5.850000 
      16.010467       -1.518502       6.080000 
      16.042193       -1.546129       6.100000 
      16.073436       -1.530155       5.970000 
      16.104871       -1.474414       6.030000 
      16.136701       -1.456624       5.910000 
      16.166542       -1.483812       6.060000 
      16.197622       -1.497347       5.880000 
      16.228770       -1.447984       6.080000 
      16.259858       -1.352985       5.910000 
      16.290654       -1.306836       6.260000 
      16.322265       -1.382563       5.950000 
      16.352592       -1.433572       6.050000 
      16.383474       -1.329686       5.940000 
      16.414542       -1.266955       5.940000 
      16.445019       -1.357897       5.950000 
      16.476576       -1.442101       6.040000 
      16.506976       -1.460985       6.170000 
      16.537193       -1.441161       5.790000 
      16.568615       -1.345272       5.840000 
      16.600199       -1.195191       5.930000 
      16.630809       -1.131486       6.070000 
      16.661794       -1.127899       6.280000 
      16.693084       -1.103675       5.840000 
      16.724122       -1.127016       6.000000 
      16.754548       -1.184295       5.950000 
      16.785608       -1.233658       5.630000 
      16.816607       -1.257829       5.860000 
      16.847073       -1.252886       5.940000 
      16.876991       -1.209918       5.970000 
      16.908624       -1.149800       5.980000 
      16.940095       -1.127015       5.940000 
      16.972028       -1.138143       5.670000 
      17.003942       -1.150726       5.920000 
      17.035885       -1.124703       5.850000 
      17.066773       -1.129659       6.020000 
      17.096694       -1.174909       6.300000 
      17.127610       -1.177996       6.010000 
      17.159551       -1.149869       6.070000 
      17.191442       -1.138491       5.910000 
      17.221360       -1.130114       5.780000 
      17.253274       -1.080654       5.940000 
      17.283227       -1.006831       6.130000 
      17.313141       -0.904991       5.700000 
      17.343067       -0.863864       6.000000 
      17.374950       -0.901877       5.960000 
      17.405391       -0.988835       5.960000 
      17.436690       -1.073526       6.130000 
      17.467738       -1.100837       6.020000 
      17.498563       -1.079395       5.850000 
      17.529861       -1.019721       6.050000 
      17.560616       -0.980849       6.160000 
      17.592232       -0.984752       5.870000 
      17.623078       -0.985734       6.060000 
      17.653942       -0.973111       5.990000 
      17.685726       -0.985707       6.000000 
      17.717403       -0.983852       5.940000 
      17.747837       -0.969581       5.910000 
      17.779870       -0.965054       5.830000 
      17.809722       -0.965054       6.220000 
      17.840410       -0.969567       6.080000 
      17.871919       -0.983409       5.920000 
      17.903935       -0.980295       6.050000 
      17.934415       -0.948471       5.800000 
      17.965011       -0.940401       6.190000 
      17.996566       -0.935015       5.940000 
      18.027784       -0.918928       6.130000 
      18.058968       -0.917520       5.960000 
      18.090364       -0.935072       5.990000 
      18.121095       -1.007163       5.970000 
      18.152523       -1.054671       5.750000 
      18.183839       -0.996408       5.880000 
      18.214827       -0.950756       6.070000 
      18.246134       -0.930932       5.830000 
      18.278049       -0.899647       6.050000 
      18.308518       -0.894194       5.930000 
      18.339169       -0.899106       5.980000 
      18.370548       -0.858769       5.730000 
      18.402498       -0.800090       5.900000 
      18.433732       -0.771796       5.950000 
      18.465017       -0.775879       5.920000 
      18.496346       -0.813019       5.990000 
      18.526592       -0.844400       6.010000 
      18.557631       -0.813005       5.860000 
      18.588468       -0.775423       6.170000 
      18.619341       -0.765968       6.040000 
      18.650604       -0.770937       6.040000 
      18.697316       -0.800050       5.970000 
      18.728632       -0.858299       5.820000 
      18.759062       -0.892807       5.870000 
      18.790009       -0.858755       5.890000 
      18.822121       -0.805892       5.920000 
      18.854110       -0.800506       5.910000 
      18.884793       -0.829199       5.960000 
      18.916764       -0.829616       5.740000 
      18.948059       -0.805449       6.170000 
      18.978933       -0.824273       5.750000 
      19.009509       -0.869940       6.080000 
      19.040687       -0.863738       6.190000 
      19.072169       -0.848914       5.840000 
      19.103768       -0.862370       5.850000 
      19.135529       -0.872681       5.870000 
      19.166868       -0.904049       5.910000 
      19.197986       -0.899079       5.940000 
      19.228616       -0.848027       5.990000 
      19.259030       -0.816190       6.080000 
      19.290229       -0.789721       6.080000 
      19.320763       -0.770037       5.900000 
      19.351581       -0.765068       5.980000 
      19.383581       -0.765068       5.940000 
      19.414963       -0.770010       6.130000 
      19.445373       -0.788808       6.010000 
      19.476597       -0.804505       6.030000 
      19.507592       -0.788822       6.000000 
      19.538570       -0.770467       5.780000 
      19.570228       -0.770897       5.900000 
      19.601502       -0.794221       5.820000 
      19.632201       -0.828703       5.970000 
      19.663080       -0.828702       6.020000 
      19.694093       -0.794207       5.740000 
      19.725492       -0.770454       5.930000 
      19.756588       -0.765081       5.910000 
      19.788826       -0.765068       5.860000 
      19.820236       -0.770037       6.070000 
      19.849880       -0.789695       5.800000 
      19.880846       -0.815304       5.820000 
      19.911854       -0.837202       6.040000 
      19.942438       -0.849799       6.000000 
      19.973673       -0.813449       6.040000 
      20.004788       -0.775449       6.020000 
      20.035502       -0.766384       6.040000 
      20.066521       -0.775436       6.010000 
      20.097777       -0.813006       5.950000 
      20.129270       -0.844400       5.790000 
      20.160617       -0.813005       5.800000 
      20.192350       -0.775409       6.020000 
      20.222764       -0.765497       5.990000 
      20.254275       -0.764638       6.070000 
      20.286601       -0.764625       5.890000 
      20.317893       -0.765054       5.930000 
      20.348524       -0.770010       5.930000 
      20.379377       -0.788808       6.150000 
      20.411332       -0.804505       5.940000 
      20.442129       -0.788808       5.950000 
      20.472710       -0.770010       6.020000 
      20.504577       -0.765054       5.890000 
      20.535177       -0.764624       5.960000 
      20.566225       -0.764611       5.950000 
      20.597060       -0.764611       5.900000 
      20.628363       -0.764611       5.920000 
      20.659639       -0.764611       5.940000 
      20.690845       -0.764611       5.960000 
      20.722347       -0.764611       5.900000 
      20.753218       -0.764611       5.860000 
      20.784449       -0.764624       5.990000 
      20.830992       -0.765054       5.850000 
      20.862301       -0.770010       5.840000 
      20.893831       -0.788808       6.180000 
      20.939872       -0.804505       6.010000 
      20.970453       -0.788808       6.080000 
      21.001398       -0.770010       5.680000 
