Human trial picking the raspberry twin 

 time    ||     output     ||     loadcell

      0.000000       -798.173846       0.190000 
      0.016931       -798.173846       0.070000 
      0.031611       -798.173846       0.050000 
      0.062702       -798.173846       0.020000 
      0.078812       -798.173846       0.070000 
      0.093623       -798.173846       0.140000 
      0.108854       -798.173846       0.020000 
      0.123799       -798.173846       0.020000 
      0.140417       -798.173846       0.030000 
      0.155379       -798.173841       0.060000 
      0.170601       -798.172655       0.130000 
      0.185561       -798.065845       0.070000 
      0.201764       -794.528800       0.030000 
      0.217677       -751.439026       0.130000 
      0.232566       -558.326703       0.020000 
      0.248749       -239.944268       0.060000 
      0.264887       -46.818947       0.030000 
      0.279721       -3.673608       0.070000 
      0.296641       -0.098967       0.110000 
      0.312131       -0.006416       0.100000 
      0.328164       -0.048777       0.090000 
      0.343865       -0.086784       0.080000 
      0.359005       -0.089096       0.010000 
      0.374668       -0.058561       0.000000 
      0.389371       -0.059986       0.080000 
      0.405443       -0.087241       0.090000 
      0.421004       -0.083710       0.090000 
      0.436128       -0.033934       0.020000 
      0.450399       -0.015136       0.000000 
      0.465537       -0.044232       0.060000 
      0.482326       -0.062184       0.040000 
      0.497837       -0.044232       0.040000 
      0.513992       -0.015110       0.280000 
      0.529024       -0.033075       0.090000 
      0.544209       -0.073785       0.060000 
      0.559831       -0.049188       0.080000 
      0.575551       -0.022737       0.060000 
      0.591107       -0.059942       0.180000 
      0.607130       -0.058074       0.000000 
      0.622116       -0.018789       0.000000 
      0.637787       -0.023996       0.090000 
      0.654259       -0.040702       0.080000 
      0.669850       -0.030777       0.050000 
      0.684519       -0.041145       0.060000 
      0.701002       -0.029394       0.070000 
      0.714867       -0.042973       0.010000 
      0.729938       -0.097512       0.130000 
      0.745150       -0.078324       0.090000 
      0.760438       0.000561       0.010000 
      0.776496       0.003218       0.130000 
      0.793460       -0.063513       0.120000 
      0.808594       -0.107894       0.030000 
      0.824070       -0.102525       0.070000 
      0.839610       -0.098039       0.090000 
      0.855808       -0.090412       0.010000 
      0.870615       -0.063114       0.040000 
      0.886734       -0.073829       0.020000 
      0.901460       -0.084153       0.100000 
      0.917377       -0.052759       0.000000 
      0.932877       -0.036233       0.140000 
      0.946839       -0.053188       0.050000 
      0.962392       -0.089082       0.240000 
      0.979242       -0.091740       0.140000 
      0.993155       -0.067986       0.130000 
      1.009788       -0.025448       0.060000 
      1.024092       0.010889       0.120000 
      1.040870       -0.006650       0.020000 
      1.056008       -0.047347       0.110000 
      1.070750       -0.088666       0.060000 
      1.086366       -0.093056       0.190000 
      1.102108       -0.084183       0.120000 
      1.118950       -0.098026       0.180000 
      1.134689       -0.108363       0.100000 
      1.149905       -0.074272       0.070000 
      1.165931       -0.044316       0.110000 
      1.182045       -0.069329       0.070000 
      1.197881       -0.089552       0.060000 
      1.213469       -0.081885       0.050000 
      1.229033       -0.094482       0.050000 
      1.244541       -0.087684       0.020000 
      1.260536       -0.054614       0.040000 
      1.276641       -0.034391       0.080000 
      1.292103       -0.050115       0.020000 
      1.307518       -0.074285       0.020000 
      1.322982       -0.102968       0.070000 
      1.338675       -0.137047       0.080000 
      1.354440       -0.127578       0.130000 
      1.369687       -0.060443       0.030000 
      1.384211       -0.024066       0.070000 
      1.400943       -0.064899       0.010000 
      1.416460       -0.076026       0.040000 
      1.431412       -0.025005       0.120000 
      1.447553       0.024315       0.030000 
      1.463586       -0.010220       0.050000 
      1.477579       -0.084583       0.120000 
      1.493798       -0.121363       0.090000 
      1.508756       -0.143306       0.060000 
      1.524162       -0.143762       0.070000 
      1.538366       -0.127662       0.010000 
      1.555239       -0.120035       0.030000 
      1.570805       -0.104325       0.070000 
      1.585840       -0.108421       0.010000 
      1.601158       -0.133421       0.010000 
      1.617984       -0.119162       0.080000 
      1.631713       -0.088184       0.020000 
      1.647750       -0.100781       0.070000 
      1.663425       -0.117307       0.040000 
      1.679114       -0.119162       0.110000 
      1.694232       -0.104298       0.050000 
      1.708623       -0.108420       0.100000 
      1.724725       -0.133394       0.140000 
      1.739627       -0.118276       0.120000 
      1.755624       -0.077399       0.110000 
      1.772539       -0.052829       0.010000 
      1.788357       -0.042904       0.080000 
      1.803966       -0.094495       0.010000 
      1.819110       -0.127135       0.110000 
      1.834637       -0.097622       0.060000 
      1.850711       -0.061303       0.000000 
      1.866668       -0.064000       0.060000 
      1.882426       -0.113750       0.050000 
      1.898266       -0.132534       0.030000 
      1.914027       -0.103008       0.080000 
      1.928422       -0.080114       0.110000 
      1.944671       -0.079711       0.120000 
      1.959898       -0.098509       0.040000 
      1.975867       -0.119565       0.050000 
      1.990855       -0.127192       0.060000 
      2.006451       -0.137933       0.030000 
      2.022451       -0.114193       0.050000 
      2.038410       -0.064014       0.100000 
      2.054370       -0.061343       0.000000 
      2.069745       -0.098939       0.000000 
      2.083951       -0.142903       0.140000 
      2.100891       -0.162131       0.140000 
      2.116553       -0.143789       0.080000 
      2.132564       -0.109737       0.120000 
      2.147471       -0.109750       0.160000 
      2.161702       -0.144232       0.020000 
      2.178639       -0.167529       0.020000 
      2.193431       -0.167073       0.040000 
      2.209718       -0.137947       0.040000 
      2.224931       -0.074742       0.060000 
      2.240616       -0.021019       0.040000 
      2.256284       -0.034861       0.030000 
      2.270751       -0.089982       0.100000 
      2.287715       -0.121336       0.030000 
      2.303044       -0.137007       0.070000 
      2.318691       -0.107894       0.050000 
      2.333536       -0.029005       0.040000 
      2.348654       0.027389       0.060000 
      2.364130       0.010433       0.040000 
      2.379625       -0.065355       0.020000 
      2.394743       -0.116381       0.010000 
      2.409616       -0.142446       0.070000 
      2.425868       -0.138779       0.020000 
      2.440729       -0.108407       0.090000 
      2.455667       -0.098482       0.020000 
      2.470220       -0.090009       0.070000 
      2.487836       -0.058601       0.020000 
      2.502474       -0.060443       0.040000 
      2.516815       -0.093097       0.010000 
      2.533209       -0.113763       0.040000 
      2.548862       -0.103881       0.030000 
      2.564029       -0.109280       0.070000 
      2.578750       -0.143789       0.040000 
      2.594885       -0.162600       0.010000 
      2.610902       -0.149188       0.000000 
      2.625654       -0.133921       0.000000 
      2.641681       -0.149188       0.040000 
      2.657658       -0.162587       0.070000 
      2.673667       -0.143346       0.030000 
      2.689167       -0.103895       0.080000 
      2.705156       -0.080141       0.000000 
      2.721086       -0.079711       0.170000 
      2.735677       -0.098509       0.070000 
      2.751359       -0.119592       0.010000 
      2.767386       -0.128092       0.010000 
      2.782522       -0.149161       0.010000 
      2.798639       -0.167543       0.050000 
      2.814152       -0.162600       0.060000 
      2.829579       -0.125421       0.010000 
      2.845260       -0.093610       0.070000 
      2.860499       -0.120048       0.040000 
      2.876570       -0.138833       0.010000 
      2.892909       -0.132604       0.030000 
      2.908320       -0.143749       0.010000 
      2.922615       -0.137960       0.110000 
      2.939187       -0.098496       0.090000 
      2.955027       -0.060900       0.070000 
      2.969660       -0.059045       0.030000 
      2.985753       -0.094965       0.140000 
      3.000781       -0.117280       0.070000 
      3.017554       -0.124091       0.040000 
      3.033361       -0.122679       0.030000 
      3.048321       -0.119605       0.060000 
      3.064278       -0.104338       0.050000 
      3.080235       -0.109294       0.040000 
      3.097194       -0.143776       0.060000 
      3.111776       -0.162157       0.080000 
      3.127789       -0.143789       0.040000 
      3.144745       -0.109737       0.140000 
      3.158870       -0.109750       0.070000 
      3.173830       -0.144246       0.100000 
      3.189875       -0.167986       0.020000 
      3.205813       -0.172942       0.000000 
      3.220092       -0.168389       0.030000 
      3.236077       -0.148288       0.010000 
      3.253005       -0.116851       0.040000 
      3.283283       -0.065812       0.010000 
      3.300284       0.005033       0.010000 
      3.316151       0.003178       0.000000 
      3.330924       -0.069329       0.020000 
      3.346914       -0.137060       0.050000 
      3.362450       -0.161660       0.010000 
      3.377663       -0.143318       0.000000 
      3.394205       -0.103868       0.020000 
      3.409100       -0.079268       0.130000 
      3.424304       -0.069329       0.060000 
      3.440319       -0.054628       0.010000 
      3.455223       -0.053202       0.000000 
      3.470190       -0.071184       0.050000 
      3.486595       -0.082355       0.130000 
      3.500773       -0.119122       0.140000 
      3.516257       -0.137933       0.030000 
      3.533140       -0.122249       0.010000 
      3.548009       -0.100754       0.020000 
      3.563199       -0.082355       0.020000 
      3.577768       -0.089553       0.030000 
      3.593871       -0.068900       0.020000 
      3.608879       -0.039360       0.030000 
      3.624267       -0.055474       0.000000 
      3.639868       -0.092653       0.020000 
      3.655024       -0.113306       0.050000 
      3.670356       -0.098469       0.040000 
      3.684705       -0.084640       0.030000 
      3.701243       -0.098482       0.070000 
      3.716668       -0.113763       0.030000 
      3.731199       -0.098482       0.020000 
      3.747372       -0.084653       0.040000 
      3.762429       -0.098925       0.020000 
      3.778092       -0.119148       0.050000 
      3.793525       -0.122196       0.080000 
      3.808658       -0.117819       0.040000 
      3.824735       -0.082742       0.010000 
      3.840644       -0.012519       0.040000 
      3.856203       0.015345       0.080000 
      3.870783       -0.071184       0.000000 
      3.886781       -0.150903       0.010000 
      3.901536       -0.161257       0.010000 
      3.917494       -0.125394       0.010000 
      3.933664       -0.094053       0.030000 
      3.947917       -0.125434       0.050000 
      3.963731       -0.162601       0.040000 
      3.979919       -0.167556       0.000000 
      3.995065       -0.149618       0.040000 
      4.009650       -0.133947       0.020000 
      4.024779       -0.149631       0.010000 
      4.040965       -0.167986       0.100000 
      4.055422       -0.167543       0.040000 
      4.070976       -0.143776       0.030000 
      4.085612       -0.103908       0.060000 
      4.101544       -0.080154       0.050000 
      4.115312       -0.080141       0.050000 
      4.146259       -0.103465       0.010000 
      4.161602       -0.138376       0.040000 
      4.178098       -0.143319       0.040000 
      4.192314       -0.127205       0.080000 
      4.207963       -0.114636       0.020000 
      4.223200       -0.080154       0.300000 
      4.239552       -0.069400       0.020000 
      4.254780       -0.119592       0.120000 
      4.285501       -0.157188       0.060000 
      4.302005       -0.148302       0.030000 
      4.317848       -0.128508       0.250000 
      4.332672       -0.125004       0.100000 
      4.348990       -0.123149       0.290000 
      4.363983       -0.125005       0.280000 
      4.378694       -0.128535       0.260000 
      4.394735       -0.149201       0.120000 
      4.410972       -0.168429       0.050000 
      4.426836       -0.173385       0.190000 
      4.440923       -0.173385       0.210000 
      4.457740       -0.168442       0.460000 
      4.473035       -0.149631       0.290000 
      4.488832       -0.133478       0.580000 
      4.503474       -0.143359       0.200000 
      4.519732       -0.133448       0.370000 
      4.534804       -0.085110       0.060000 
      4.550076       -0.069843       0.200000 
      4.565777       -0.120048       0.180000 
      4.582990       -0.162587       0.080000 
      4.597801       -0.172485       0.220000 
      4.612811       -0.167959       0.180000 
      4.627150       -0.143802       0.230000 
      4.657701       -0.104351       0.050000 
      4.673856       -0.085554       0.170000 
      4.690875       -0.104351       0.110000 
      4.706108       -0.143802       0.070000 
      4.723183       -0.167973       0.010000 
      4.738790       -0.172942       0.180000 
      4.754121       -0.168429       0.050000 
      4.768557       -0.149645       0.100000 
      4.785009       -0.133948       0.120000 
      4.799338       -0.149631       0.240000 
      4.814783       -0.168000       0.080000 
      4.831270       -0.167999       0.040000 
      4.846328       -0.149618       0.060000 
      4.862849       -0.133504       0.050000 
      4.877047       -0.144219       0.190000 
      4.892602       -0.143359       0.070000 
      4.907960       -0.122706       0.030000 
      4.922835       -0.101237       0.050000 
      4.937679       -0.088654       0.030000 
      4.953354       -0.125004       0.020000 
      4.970119       -0.163017       0.080000 
      4.984686       -0.172512       0.110000 
      5.000781       -0.168416       0.320000 
      5.016215       -0.149631       0.110000 
      5.030561       -0.133491       0.160000 
      5.046854       -0.143803       0.190000 
      5.061228       -0.138846       0.120000 
      5.077541       -0.109294       0.330000 
      5.091947       -0.109294       0.060000 
      5.108496       -0.138846       0.240000 
      5.122840       -0.143802       0.020000 
      5.138662       -0.133478       0.280000 
      5.154578       -0.149188       0.020000 
      5.169464       -0.163030       0.180000 
      5.185154       -0.148758       0.120000 
      5.199564       -0.128535       0.290000 
      5.215552       -0.125434       0.130000 
      5.230849       -0.128105       0.320000 
      5.245813       -0.143803       0.160000 
      5.261796       -0.144232       0.260000 
      5.278992       -0.133491       0.080000 
      5.294232       -0.149188       0.100000 
      5.309734       -0.163043       0.080000 
      5.323848       -0.149188       0.090000 
      5.339707       -0.133491       0.220000 
      5.354062       -0.144219       0.160000 
      5.370030       -0.143359       0.230000 
      5.386858       -0.122706       0.170000 
      5.402111       -0.101224       0.130000 
      5.416621       -0.088211       0.150000 
      5.431988       -0.119605       0.200000 
      5.448304       -0.138833       0.050000 
      5.463362       -0.133061       0.110000 
      5.479029       -0.149618       0.060000 
      5.494363       -0.168442       0.070000 
      5.508952       -0.173399       0.140000 
      5.524170       -0.173829       0.040000 
      5.541037       -0.173842       0.150000 
      5.557319       -0.173842       0.030000 
      5.572127       -0.173842       0.110000 
      5.587666       -0.173842       0.170000 
      5.602986       -0.173842       0.190000 
      5.618670       -0.173842       0.090000 
      5.635037       -0.173842       0.140000 
      5.649846       -0.173842       0.140000 
      5.664812       -0.173842       0.120000 
      5.680742       -0.173828       0.040000 
      5.695711       -0.173385       0.030000 
      5.711421       -0.168000       0.040000 
      5.727552       -0.144246       0.060000 
      5.742376       -0.109751       0.050000 
      5.774070       -0.109751       0.010000 
      5.790985       -0.144246       0.040000 
      5.805969       -0.168000       0.050000 
      5.821986       -0.173385       0.030000 
      5.837486       -0.173828       0.100000 
      5.852645       -0.173842       0.080000 
      5.868565       -0.173842       0.070000 
      5.883368       -0.173842       0.010000 
      5.899094       -0.173841       0.000000 
      5.915032       -0.173802       0.080000 
      5.930500       -0.172512       0.060000 
      5.945993       -0.157645       0.050000 
      5.961739       -0.101251       0.020000 
      5.976956       -0.054159       0.010000 
      5.992895       -0.101251       0.000000 
      6.006831       -0.157645       0.050000 
      6.022237       -0.172512       0.040000 
      6.038027       -0.173788       0.140000 
      6.054058       -0.173398       0.160000 
      6.069251       -0.168429       0.150000 
      6.084506       -0.149202       0.060000 
      6.100251       -0.128549       0.050000 
      6.114738       -0.125448       0.040000 
      6.130001       -0.128549       0.070000 
      6.146940       -0.149202       0.030000 
      6.162476       -0.168429       0.010000 
      6.178500       -0.173398       0.080000 
      6.193737       -0.173802       0.070000 
      6.208663       -0.172955       0.050000 
      6.224979       -0.163044       0.080000 
      6.240151       -0.125448       0.060000 
      6.255175       -0.094053       0.190000 
      6.269164       -0.125448       0.150000 
      6.286156       -0.163044       0.110000 
      6.302105       -0.172956       0.080000 
      6.317150       -0.173815       0.120000 
      6.332627       -0.173842       0.100000 
      6.348050       -0.173842       0.170000 
      6.363771       -0.173828       0.090000 
      6.380098       -0.173385       0.240000 
      6.393822       -0.167999       0.200000 
      6.409850       -0.144232       0.130000 
      6.426175       -0.109294       0.080000 
      6.441187       -0.103908       0.060000 
      6.457355       -0.114636       0.010000 
      6.471260       -0.103465       0.080000 
      6.486906       -0.103895       0.090000 
      6.502303       -0.120022       0.000000 
      6.516519       -0.127649       0.030000 
      6.531755       -0.143346       0.020000 
      6.547684       -0.138833       0.050000 
      6.562620       -0.109307       0.010000 
      6.593989       -0.109737       0.020000 
      6.609985       -0.144245       0.010000 
      6.626273       -0.167986       0.120000 
      6.642214       -0.172942       0.040000 
      6.656981       -0.168416       0.070000 
      6.671275       -0.149201       0.090000 
      6.687446       -0.128549       0.000000 
      6.703427       -0.125448       0.020000 
      6.717896       -0.128548       0.100000 
      6.734210       -0.149188       0.080000 
      6.748914       -0.167986       0.140000 
      6.765210       -0.167999       0.040000 
      6.780905       -0.149631       0.090000 
      6.796087       -0.133948       0.020000 
      6.811094       -0.149645       0.070000 
      6.826523       -0.168443       0.030000 
      6.842824       -0.173399       0.080000 
      6.857657       -0.173829       0.040000 
      6.873399       -0.173842       0.130000 
      6.889294       -0.173842       0.190000 
      6.904482       -0.173815       0.010000 
      6.919329       -0.172956       0.120000 
      6.935048       -0.163044       0.070000 
      6.950532       -0.125448       0.050000 
      6.966921       -0.094053       0.030000 
      6.981325       -0.125448       0.120000 
      6.995728       -0.163044       0.020000 
      7.010938       -0.172956       0.040000 
      7.026345       -0.173815       0.040000 
      7.042479       -0.173828       0.060000 
      7.058029       -0.173399       0.040000 
      7.074114       -0.168443       0.030000 
      7.090051       -0.149645       0.050000 
      7.105239       -0.133934       0.060000 
      7.120926       -0.149202       0.080000 
      7.136584       -0.163044       0.130000 
      7.152114       -0.149202       0.060000 
      7.167514       -0.133934       0.050000 
      7.182938       -0.149645       0.010000 
      7.199441       -0.168443       0.020000 
      7.214962       -0.173399       0.100000 
      7.230808       -0.173829       0.090000 
      7.245771       -0.173842       0.150000 
      7.261050       -0.173842       0.090000 
      7.276490       -0.173842       0.120000 
      7.291589       -0.173842       0.000000 
      7.306496       -0.173828       0.010000 
      7.321306       -0.173385       0.090000 
      7.337284       -0.168000       0.040000 
      7.351676       -0.144246       0.000000 
      7.366971       -0.109750       0.160000 
      7.384004       -0.109737       0.170000 
      7.399680       -0.143803       0.010000 
      7.414855       -0.162601       0.020000 
      7.429203       -0.149188       0.120000 
      7.460053       -0.133934       0.010000 
      7.476668       -0.149645       0.100000 
      7.491281       -0.168443       0.030000 
      7.506544       -0.173399       0.060000 
      7.523231       -0.173829       0.090000 
      7.538485       -0.173842       0.110000 
      7.554343       -0.173842       0.130000 
      7.569215       -0.173842       0.170000 
      7.584608       -0.173842       0.120000 
      7.600577       -0.173842       0.120000 
      7.616258       -0.173842       0.050000 
      7.632000       -0.173842       0.020000 
      7.647996       -0.173842       0.030000 
      7.663973       -0.173842       0.070000 
      7.679968       -0.173842       0.020000 
      7.694993       -0.173842       0.020000 
      7.726082       -0.173842       0.050000 
      7.742502       -0.173842       0.100000 
      7.756337       -0.173829       0.030000 
      7.771655       -0.173399       0.060000 
      7.787992       -0.168443       0.050000 
      7.804263       -0.149645       0.120000 
      7.819217       -0.133948       0.020000 
      7.833999       -0.149645       0.030000 
      7.849936       -0.168443       0.060000 
      7.865132       -0.173399       0.020000 
      7.880086       -0.173829       0.010000 
      7.895541       -0.173842       0.030000 
      7.910950       -0.173842       0.070000 
      7.926312       -0.173842       0.130000 
      7.941545       -0.173842       0.010000 
      7.957492       -0.173842       0.220000 
      7.972289       -0.173842       0.170000 
      7.987887       -0.173842       0.180000 
      8.016828       -0.173842       0.070000 
      8.031939       -0.173842       0.040000 
      8.048850       -0.173842       0.090000 
      8.063957       -0.173842       0.040000 
      8.079798       -0.173829       0.200000 
      8.095185       -0.173399       0.060000 
      8.110840       -0.168443       0.150000 
      8.124808       -0.149645       0.020000 
      8.139969       -0.133948       0.180000 
      8.156723       -0.149645       0.140000 
      8.171804       -0.168443       0.070000 
      8.186945       -0.173399       0.050000 
      8.202091       -0.173829       0.280000 
      8.218684       -0.173842       0.710000 
      8.233765       -0.173829       0.570000 
      8.248843       -0.173399       0.180000 
      8.264237       -0.168443       0.250000 
      8.280284       -0.149645       0.350000 
      8.296202       -0.133934       0.780000 
      8.310170       -0.149202       1.810000 
      8.325542       -0.163044       4.200000 
      8.342115       -0.149202       5.920000 
      8.356137       -0.133934       8.190000 
      8.371454       -0.149645       13.890000 
      8.386851       -0.168443       17.290000 
      8.403523       -0.173399       24.000000 
      8.417851       -0.173815       27.070000 
      8.434281       -0.173399       33.690000 
      8.449910       -0.168443       36.970000 
      8.465504       -0.149645       40.510000 
      8.480687       -0.133947       48.640000 
      8.496676       -0.149604       52.980000 
      8.511953       -0.167059       64.950000 
      8.526726       -0.155375       72.060000 
      8.542634       -0.077813       79.690000 
      8.556623       0.066134       99.980000 
      8.572265       0.181278       112.990000 
      8.587986       0.254067       143.930000 
      8.604212       0.405965       160.460000 
      8.621273       0.645383       193.910000 
      8.637039       0.785611       209.890000 
      8.652327       0.798778       225.350000 
      8.667414       0.780784       256.810000 
      8.682403       0.777763       270.420000 
      8.697629       0.780865       282.190000 
      8.713457       0.801518       301.760000 
      8.728726       0.820746       311.770000 
      8.743056       0.825716       334.070000 
      8.758768       0.826226       343.870000 
      8.774064       0.828939       351.030000 
      8.789362       0.862677       358.240000 
      8.804764       1.024501       358.740000 
      8.821401       1.341977       355.980000 
      8.836795       1.635042       353.040000 
      8.851799       1.829038       349.860000 
      8.868726       2.097964       346.510000 
      8.884254       2.521756       348.670000 
      8.898732       2.941772       357.060000 
      8.914087       3.333354       351.940000 
      8.929814       3.651103       299.190000 
      8.945826       3.906932       254.440000 
      8.960967       4.239062       180.600000 
      8.976656       4.597722       16.420000 
      8.990891       4.783783       12.620000 
      9.006553       4.822934       5.330000 
      9.022681       4.826534       0.260000 
      9.037533       4.832511       1.200000 
      9.052382       4.863463       11.300000 
      9.068903       4.944543       9.660000 
      9.083941       5.088782       0.240000 
      9.099679       5.243705       1.980000 
      9.115242       5.161088       6.810000 
      9.130453       4.488418       7.350000 
      9.145423       2.922298       2.350000 
      9.160418       0.863134       3.090000 
      9.175899       -0.175885       7.470000 
      9.191910       0.172167       9.400000 
      9.206797       0.733391       2.780000 
      9.221787       0.972992       2.040000 
      9.237656       0.972774       4.790000 
      9.252364       0.832039       9.480000 
      9.268080       0.533633       7.020000 
      9.285129       0.074453       4.440000 
      9.300560       -0.391683       6.850000 
      9.314974       -0.832076       9.710000 
      9.331453       -1.132869       6.920000 
      9.348126       -1.386413       4.660000 
      9.363230       -1.728855       7.010000 
      9.378848       -2.002783       9.160000 
      9.395681       -2.128880       5.420000 
      9.409931       -2.166978       3.300000 
      9.425015       -2.173357       6.130000 
      9.439400       -2.173828       8.080000 
      9.455693       -2.173842       7.170000 
      9.470976       -2.173842       2.850000 
      9.485465       -2.173842       3.820000 
      9.500602       -2.173842       8.040000 
      9.516014       -2.173842       6.830000 
      9.531760       -2.173842       4.460000 
      9.548788       -2.173842       4.790000 
      9.564474       -2.173842       7.200000 
      9.579014       -2.173842       6.650000 
      9.595208       -2.173842       4.550000 
      9.611226       -2.173842       4.180000 
      9.627652       -2.173842       7.980000 
      9.643318       -2.173842       8.410000 
      9.658615       -2.173842       4.860000 
      9.674625       -2.173842       4.850000 
      9.690746       -2.173842       8.530000 
      9.705705       -2.173842       8.360000 
      9.722041       -2.173842       6.390000 
      9.736483       -2.173842       5.120000 
      9.751821       -2.173842       6.720000 
      9.768530       -2.173842       7.510000 
      9.784497       -2.173842       5.710000 
      9.799860       -2.173842       4.490000 
      9.814465       -2.173842       6.310000 
      9.830473       -2.173842       7.360000 
      9.845021       -2.173842       4.900000 
      9.861569       -2.173842       4.080000 
      9.877139       -2.173842       4.840000 
      9.892253       -2.173842       7.150000 
      9.907703       -2.173829       6.150000 
      9.923410       -2.173399       4.420000 
      9.937732       -2.168443       5.410000 
      9.954697       -2.149645       7.240000 
      9.969370       -2.133948       6.380000 
      9.986442       -2.149645       5.180000 
      10.001425       -2.168443       6.250000 
      10.016762       -2.173399       7.420000 
      10.032956       -2.173829       6.540000 
      10.049522       -2.173842       5.650000 
      10.064295       -2.173842       6.580000 
      10.079933       -2.173842       7.610000 
      10.095472       -2.173842       7.480000 
      10.111097       -2.173842       5.390000 
      10.126682       -2.173842       5.480000 
      10.141993       -2.173842       7.170000 
      10.157135       -2.173842       6.890000 
      10.173104       -2.173842       5.800000 
      10.186918       -2.173842       5.110000 
      10.203453       -2.173815       6.050000 
      10.217940       -2.172942       6.470000 
      10.234801       -2.162574       5.540000 
      10.250527       -2.119162       4.870000 
      10.265853       -2.059045       6.100000 
      10.280891       -2.036703       6.780000 
      10.296467       -2.053203       5.530000 
      10.312325       -2.089123       5.050000 
      10.327347       -2.093057       5.460000 
      10.342178       -2.083767       6.920000 
      10.358267       -2.093526       6.490000 
      10.373421       -2.095408       5.480000 
      10.389634       -2.088157       5.870000 
      10.405293       -2.123648       6.760000 
      10.419948       -2.146376       6.580000 
      10.436133       -2.094522       5.840000 
      10.453081       -2.024523       6.120000 
      10.468858       -2.036716       6.900000 
      10.482860       -2.088154       6.390000 
      10.498566       -2.118692       5.750000 
      10.513653       -2.127165       6.210000 
      10.529786       -2.137946       6.830000 
      10.545068       -2.114622       6.730000 
      10.559929       -2.068956       5.440000 
      10.575905       -2.079698       5.510000 
      10.592590       -2.109250       6.630000 
      10.606819       -2.103452       6.500000 
      10.622027       -2.108837       5.850000 
      10.636964       -2.138833       5.620000 
      10.651873       -2.143802       6.250000 
      10.668668       -2.133491       6.710000 
      10.684446       -2.149631       5.880000 
      10.699274       -2.168443       5.460000 
      10.714692       -2.173399       6.360000 
      10.730683       -2.173815       6.690000 
      10.746233       -2.173399       6.530000 
      10.760904       -2.168443       5.750000 
      10.777586       -2.149645       6.020000 
      10.793534       -2.133948       6.900000 
      10.809133       -2.149645       6.500000 
      10.825136       -2.168429       5.690000 
      10.840977       -2.172956       6.000000 
      10.856787       -2.168429       6.460000 
      10.872217       -2.149644       6.340000 
      10.887578       -2.133921       5.880000 
      10.903017       -2.148758       5.950000 
      10.919051       -2.157645       6.420000 
      10.934668       -2.125005       6.220000 
      10.949865       -2.094040       5.740000 
      10.965925       -2.125448       5.730000 
      10.980938       -2.163044       6.400000 
      10.996621       -2.172956       6.520000 
      11.010625       -2.173815       5.750000 
      11.026358       -2.173828       5.730000 
      11.043247       -2.173399       6.720000 
      11.073517       -2.168443       6.190000 
      11.091022       -2.149631       5.910000 
      11.106011       -2.133504       6.270000 
      11.122053       -2.144246       6.410000 
      11.137469       -2.144246       6.060000 
      11.153760       -2.133504       6.010000 
      11.169689       -2.149631       6.450000 
      11.185050       -2.168443       6.610000 
      11.199026       -2.173399       6.060000 
      11.214136       -2.173829       5.860000 
      11.230495       -2.173842       6.310000 
      11.245864       -2.173842       6.510000 
      11.261502       -2.173842       6.230000 
      11.275828       -2.173829       5.940000 
      11.291826       -2.173399       6.060000 
      11.307385       -2.168443       6.270000 
      11.323377       -2.149645       6.190000 
      11.339370       -2.133948       5.980000 
      11.355327       -2.149645       6.050000 
      11.369776       -2.168429       6.250000 
      11.385848       -2.172956       6.240000 
      11.400460       -2.168429       6.010000 
      11.415885       -2.149631       6.000000 
      11.432718       -2.133504       6.390000 
      11.447623       -2.144232       6.380000 
      11.464427       -2.143803       6.020000 
      11.479784       -2.128105       6.010000 
      11.494970       -2.125434       6.220000 
      11.510786       -2.128548       6.550000 
      11.526300       -2.149202       6.260000 
      11.541074       -2.168429       5.970000 
      11.557454       -2.173399       6.220000 
      11.572757       -2.173829       6.340000 
      11.587683       -2.173842       6.150000 
      11.601939       -2.173842       6.030000 
      11.616831       -2.173842       6.220000 
      11.633626       -2.173842       6.300000 
      11.648918       -2.173842       5.940000 
      11.664041       -2.173842       5.970000 
      11.680216       -2.173842       6.030000 
      11.694334       -2.173842       6.330000 
      11.709860       -2.173842       6.300000 
      11.726824       -2.173842       5.990000 
      11.742158       -2.173842       6.100000 
      11.756592       -2.173842       6.170000 
      11.772948       -2.173842       6.240000 
      11.788229       -2.173842       6.110000 
      11.804340       -2.173842       6.160000 
      11.818868       -2.173842       6.270000 
      11.834804       -2.173829       6.210000 
      11.851002       -2.173399       6.060000 
      11.866070       -2.168443       6.150000 
      11.882500       -2.149631       6.340000 
      11.897881       -2.133504       6.210000 
      11.914324       -2.144246       6.070000 
      11.928506       -2.144246       6.160000 
      11.945167       -2.133504       6.200000 
      11.959761       -2.149631       6.160000 
      11.975443       -2.168443       6.040000 
      11.991112       -2.173399       6.110000 
      12.006607       -2.173829       6.160000 
      12.020986       -2.173842       6.120000 
      12.036455       -2.173842       6.080000 
      12.053118       -2.173842       6.070000 
      12.067639       -2.173842       6.190000 
      12.082109       -2.173842       6.240000 
      12.098629       -2.173842       6.160000 
      12.114752       -2.173842       5.950000 
      12.130576       -2.173842       6.120000 
      12.145895       -2.173842       6.260000 
      12.160658       -2.173842       6.250000 
      12.176691       -2.173842       6.160000 
      12.191149       -2.173842       6.220000 
      12.207761       -2.173842       6.310000 
      12.223589       -2.173842       5.990000 
      12.240503       -2.173842       5.970000 
      12.254573       -2.173842       6.100000 
      12.268844       -2.173842       6.210000 
      12.284981       -2.173842       6.220000 
      12.299359       -2.173842       6.080000 
      12.314616       -2.173842       6.140000 
      12.330585       -2.173842       6.070000 
      12.346845       -2.173842       6.170000 
      12.360945       -2.173842       6.060000 
      12.377105       -2.173842       6.050000 
      12.392790       -2.173842       6.180000 
      12.407943       -2.173842       6.350000 
      12.422384       -2.173842       6.170000 
      12.439040       -2.173842       6.090000 
      12.454164       -2.173842       6.150000 
      12.469938       -2.173829       6.160000 
      12.485565       -2.173399       6.130000 
      12.500720       -2.168429       6.090000 
      12.516332       -2.149188       6.100000 
      12.530543       -2.128105       6.140000 
      12.546024       -2.120049       6.150000 
      12.562674       -2.104351       6.130000 
      12.579063       -2.109307       6.160000 
      12.593377       -2.144232       6.170000 
      12.609923       -2.167999       6.140000 
      12.625196       -2.173385       6.080000 
      12.641192       -2.173828       6.040000 
      12.655859       -2.173842       6.070000 
      12.671631       -2.173842       6.180000 
      12.702492       -2.173842       6.160000 
      12.719450       -2.173842       6.210000 
      12.734409       -2.173842       6.260000 
      12.751243       -2.173842       6.170000 
      12.767310       -2.173842       6.130000 
      12.797709       -2.173842       6.190000 
      12.813647       -2.173842       6.240000 
      12.828907       -2.173842       6.060000 
      12.843086       -2.173842       6.040000 
      12.859705       -2.173842       6.010000 
      12.875457       -2.173842       6.130000 
      12.891742       -2.173842       6.040000 
      12.907530       -2.173842       6.080000 
      12.923101       -2.173842       6.150000 
      12.938828       -2.173842       6.090000 
      12.953354       -2.173842       5.980000 
      12.968382       -2.173842       6.030000 
      12.982940       -2.173829       6.220000 
      13.013972       -2.173399       6.020000 
      13.029468       -2.168443       6.090000 
      13.045803       -2.149645       6.110000 
      13.061225       -2.133948       6.080000 
      13.076861       -2.149645       6.010000 
      13.091674       -2.168429       6.030000 
      13.106596       -2.172956       6.020000 
      13.122586       -2.168429       6.030000 
      13.137264       -2.149645       5.990000 
      13.152234       -2.133948       6.000000 
      13.167227       -2.149645       6.140000 
      13.182549       -2.168443       6.250000 
      13.199471       -2.173399       6.180000 
      13.215429       -2.173829       6.000000 
      13.230166       -2.173842       5.970000 
      13.246162       -2.173842       5.990000 
      13.260198       -2.173842       6.020000 
      13.277156       -2.173842       6.110000 
      13.292837       -2.173842       6.130000 
      13.307758       -2.173829       6.180000 
      13.323715       -2.173399       6.100000 
      13.339706       -2.168443       6.070000 
      13.355657       -2.149645       6.100000 
      13.371403       -2.133948       6.060000 
      13.387975       -2.149645       6.190000 
      13.403995       -2.168443       6.010000 
      13.418907       -2.173399       6.080000 
      13.433980       -2.173829       6.170000 
      13.450000       -2.173842       6.050000 
      13.465000       -2.173842       6.060000 
      13.480275       -2.173842       6.090000 
      13.495518       -2.173842       6.050000 
      13.510994       -2.173842       6.080000 
      13.527357       -2.173842       6.040000 
      13.542841       -2.173842       6.120000 
      13.571697       -2.173842       6.190000 
      13.589382       -2.173842       6.040000 
      13.602072       -2.173829       6.120000 
      13.619124       -2.173399       6.200000 
      13.634928       -2.168443       6.190000 
      13.665101       -2.149645       6.080000 
      13.681170       -2.133948       6.100000 
      13.696974       -2.149645       6.040000 
      13.712302       -2.168416       6.130000 
      13.727294       -2.172512       6.110000 
      13.743253       -2.163030       6.180000 
      13.757720       -2.125448       6.120000 
      13.773027       -2.094053       5.980000 
      13.789840       -2.125448       6.010000 
      13.804786       -2.163044       6.020000 
      13.821216       -2.172956       6.180000 
      13.835868       -2.173815       6.160000 
      13.849901       -2.173842       6.170000 
      13.866941       -2.173842       6.010000 
      13.882525       -2.173842       6.070000 
      13.896989       -2.173842       6.080000 
      13.913476       -2.173842       6.110000 
      13.928626       -2.173842       6.100000 
      13.943592       -2.173842       6.090000 
      13.958884       -2.173842       6.190000 
      13.973078       -2.173842       6.230000 
      13.989827       -2.173842       6.210000 
      14.005195       -2.173842       6.170000 
      14.019817       -2.173842       6.180000 
      14.036015       -2.173842       6.160000 
      14.050416       -2.173842       6.110000 
      14.066995       -2.173842       6.090000 
      14.082170       -2.173842       6.110000 
      14.098735       -2.173842       6.040000 
      14.113599       -2.173842       6.110000 
      14.129229       -2.173842       6.070000 
      14.144457       -2.173842       6.100000 
      14.160242       -2.173842       5.990000 
      14.176188       -2.173842       6.030000 
      14.191637       -2.173842       6.190000 
      14.206999       -2.173828       6.220000 
      14.222488       -2.173385       6.120000 
      14.237913       -2.168000       6.150000 
      14.253070       -2.144246       6.090000 
      14.269086       -2.109751       6.150000 
      14.283988       -2.109751       6.130000 
      14.299985       -2.144246       6.120000 
      14.316305       -2.167999       6.190000 
      14.330806       -2.173372       6.160000 
      14.345549       -2.173385       6.170000 
      14.361791       -2.168443       6.120000 
      14.377766       -2.149645       6.110000 
      14.393712       -2.133934       6.130000 
      14.408809       -2.149202       6.090000 
      14.423913       -2.163044       6.080000 
      14.440072       -2.149201       6.050000 
      14.471216       -2.133921       6.130000 
      14.487788       -2.149201       6.090000 
      14.503291       -2.163044       6.130000 
      14.518625       -2.149202       6.100000 
      14.533950       -2.133934       6.090000 
      14.549674       -2.149645       6.130000 
      14.565635       -2.168443       6.180000 
      14.580339       -2.173399       6.200000 
      14.596133       -2.173829       6.140000 
      14.611683       -2.173842       6.090000 
      14.627475       -2.173842       6.050000 
      14.643115       -2.173842       6.140000 
      14.673987       -2.173842       6.120000 
      14.690227       -2.173842       6.140000 
      14.704606       -2.173828       6.160000 
      14.719990       -2.173385       6.060000 
      14.735837       -2.168000       6.140000 
      14.751103       -2.144246       6.110000 
      14.767400       -2.109751       6.160000 
      14.782187       -2.109751       6.190000 
      14.799364       -2.144246       6.030000 
      14.814198       -2.168000       6.010000 
      14.828736       -2.173385       6.090000 
      14.845753       -2.173828       6.040000 
      14.860662       -2.173842       6.120000 
      14.876651       -2.173842       6.100000 
      14.891199       -2.173842       6.170000 
      14.906569       -2.173829       6.200000 
      14.922933       -2.173399       6.190000 
      14.938200       -2.168443       6.170000 
      14.954389       -2.149645       6.130000 
      14.969575       -2.133948       6.100000 
      14.984906       -2.149645       6.090000 
      15.000851       -2.168443       6.180000 
      15.016175       -2.173399       6.110000 
      15.031274       -2.173829       6.080000 
      15.046525       -2.173842       6.060000 
      15.062045       -2.173842       6.010000 
      15.077806       -2.173842       6.120000 
      15.107839       -2.173842       6.070000 
      15.124715       -2.173842       6.130000 
      15.139738       -2.173842       6.110000 
      15.155045       -2.173842       6.080000 
      15.170804       -2.173842       6.170000 
      15.186733       -2.173842       6.130000 
      15.202663       -2.173842       6.110000 
      15.217997       -2.173842       6.050000 
      15.233451       -2.173842       6.030000 
      15.249017       -2.173842       6.190000 
      15.264787       -2.173842       6.140000 
      15.279973       -2.173842       6.150000 
      15.295286       -2.173842       6.110000 
      15.325258       -2.173842       6.000000 
      15.341372       -2.173842       6.120000 
      15.356436       -2.173842       6.150000 
      15.372150       -2.173842       6.140000 
      15.388703       -2.173842       6.100000 
      15.404200       -2.173842       6.230000 
      15.419747       -2.173842       6.200000 
      15.434808       -2.173829       6.180000 
      15.449657       -2.173399       6.090000 
      15.466592       -2.168443       6.110000 
      15.481357       -2.149645       6.120000 
      15.498467       -2.133948       6.070000 
      15.514520       -2.149645       6.100000 
      15.530004       -2.168443       6.100000 
      15.545164       -2.173399       6.130000 
      15.560742       -2.173829       6.150000 
      15.576511       -2.173842       6.110000 
      15.592041       -2.173842       6.060000 
      15.607506       -2.173842       6.040000 
      15.622223       -2.173842       6.030000 
      15.637294       -2.173842       6.080000 
      15.652758       -2.173829       6.050000 
      15.667766       -2.173399       6.150000 
      15.683603       -2.168429       6.180000 
      15.714306       -2.149202       6.150000 
      15.730620       -2.128549       6.170000 
      15.744582       -2.125448       6.180000 
      15.761048       -2.128549       6.060000 
      15.777079       -2.149202       6.000000 
      15.792268       -2.168429       6.040000 
      15.807871       -2.173385       6.120000 
      15.823005       -2.173385       6.060000 
      15.839839       -2.168443       6.090000 
      15.854841       -2.149631       6.140000 
      15.869188       -2.133504       6.150000 
      15.885170       -2.144232       6.140000 
      15.900910       -2.143803       6.070000 
      15.916060       -2.128105       6.050000 
      15.931363       -2.125434       6.130000 
      15.947762       -2.128548       6.190000 
      15.963268       -2.149202       6.260000 
      15.977260       -2.168429       6.130000 
      15.993217       -2.173385       6.160000 
      16.009239       -2.173385       6.090000 
      16.024811       -2.168443       6.110000 
      16.040824       -2.149645       6.030000 
      16.055579       -2.133948       6.140000 
      16.071683       -2.149645       6.300000 
      16.086489       -2.168443       6.100000 
      16.102487       -2.173399       6.110000 
      16.116980       -2.173829       6.060000 
      16.133273       -2.173842       6.110000 
      16.148546       -2.173842       6.050000 
      16.179883       -2.173828       6.090000 
      16.196506       -2.173372       6.150000 
      16.211574       -2.167556       6.080000 
      16.227592       -2.138847       6.100000 
      16.243191       -2.085554       6.150000 
      16.272798       -2.069856       6.080000 
      16.289901       -2.120049       6.060000 
      16.304879       -2.162601       6.100000 
      16.320293       -2.172942       6.060000 
      16.336350       -2.173815       6.090000 
      16.351463       -2.173842       6.040000 
      16.367411       -2.173842       6.070000 
      16.382493       -2.173842       6.080000 
      16.398696       -2.173842       6.090000 
      16.414556       -2.173842       6.140000 
      16.429588       -2.173842       6.080000 
      16.444851       -2.173842       6.100000 
      16.460500       -2.173842       6.130000 
      16.475461       -2.173842       6.140000 
      16.491794       -2.173842       6.140000 
      16.506366       -2.173842       6.120000 
      16.523268       -2.173829       6.220000 
      16.539365       -2.173399       6.090000 
      16.555213       -2.168443       6.110000 
      16.571008       -2.149645       6.220000 
      16.586669       -2.133948       6.070000 
      16.601454       -2.149645       6.040000 
      16.616225       -2.168443       6.110000 
      16.631468       -2.173399       6.060000 
      16.647013       -2.173815       6.150000 
      16.677797       -2.173399       6.000000 
      16.694025       -2.168443       6.100000 
      16.711003       -2.149645       6.090000 
      16.726025       -2.133948       6.140000 
      16.742747       -2.149645       6.150000 
      16.757739       -2.168443       6.070000 
      16.773928       -2.173399       6.060000 
      16.787676       -2.173829       6.040000 
      16.802647       -2.173842       6.050000 
      16.817817       -2.173842       6.100000 
      16.834324       -2.173842       6.160000 
      16.848943       -2.173842       6.170000 
      16.865101       -2.173842       6.090000 
      16.881058       -2.173842       6.110000 
      16.895068       -2.173842       6.100000 
      16.925976       -2.173842       6.150000 
      16.942408       -2.173842       6.150000 
      16.956588       -2.173842       6.220000 
      16.972671       -2.173829       6.180000 
      16.988495       -2.173398       6.040000 
      17.003658       -2.168416       6.050000 
      17.019688       -2.148758       6.170000 
      17.035665       -2.123149       6.100000 
      17.051322       -2.101251       6.140000 
      17.067316       -2.088654       6.070000 
      17.082546       -2.125005       6.100000 
      17.097690       -2.163030       6.120000 
      17.113556       -2.172942       6.070000 
      17.128920       -2.173372       6.140000 
      17.144129       -2.168443       6.100000 
      17.159617       -2.149645       6.150000 
      17.175305       -2.133948       6.220000 
      17.205217       -2.149645       6.120000 
      17.220861       -2.168429       6.100000 
      17.237291       -2.172956       6.090000 
      17.253318       -2.168429       6.110000 
      17.268076       -2.149645       6.070000 
      17.283015       -2.133948       6.150000 
      17.298880       -2.149631       6.210000 
      17.313936       -2.168000       6.240000 
      17.329424       -2.168000       6.060000 
      17.345119       -2.149631       6.090000 
      17.361060       -2.133948       6.100000 
      17.377005       -2.149645       6.250000 
      17.391873       -2.168443       6.130000 
      17.437919       -2.173399       6.110000 
      17.454069       -2.173815       6.030000 
      17.468325       -2.173398       6.070000 
      17.483588       -2.168416       6.120000 
      17.499915       -2.148758       6.150000 
      17.514438       -2.123149       6.140000 
      17.529632       -2.101251       6.060000 
      17.545141       -2.088654       5.970000 
      17.562255       -2.125004       6.090000 
      17.576619       -2.163017       6.150000 
      17.592388       -2.172512       6.110000 
      17.609147       -2.168416       6.080000 
      17.625068       -2.149645       6.070000 
      17.641067       -2.133948       6.140000 
      17.657518       -2.149631       6.120000 
      17.672510       -2.168000       6.150000 
      17.688660       -2.168000       6.130000 
      17.703700       -2.149631       6.050000 
      17.719159       -2.133934       6.010000 
      17.734383       -2.149202       6.130000 
      17.750137       -2.163044       6.100000 
      17.765090       -2.149201       6.000000 
      17.779871       -2.133921       6.180000 
      17.796749       -2.149201       6.140000 
      17.811188       -2.163030       6.110000 
      17.827006       -2.148758       6.070000 
      17.841913       -2.128522       6.090000 
      17.858337       -2.125004       6.190000 
      17.873642       -2.123136       6.130000 
      17.889596       -2.124561       6.210000 
      17.905344       -2.123136       6.210000 
      17.921311       -2.124991       6.110000 
      17.937119       -2.128092       6.140000 
      17.951766       -2.143802       6.170000 
      17.966990       -2.144219       6.040000 
      17.983117       -2.133048       6.120000 
      17.998906       -2.143776       6.110000 
      18.013078       -2.138403       6.170000 
      18.029512       -2.103908       6.120000 
      18.043708       -2.085540       6.090000 
      18.060703       -2.104351       6.040000 
      18.076141       -2.143789       5.960000 
      18.092289       -2.167543       6.080000 
      18.107680       -2.167986       6.090000 
      18.123411       -2.149631       6.130000 
      18.139160       -2.133934       6.090000 
      18.154266       -2.149201       6.130000 
      18.169774       -2.163017       6.150000 
      18.184039       -2.148315       6.190000 
      18.199677       -2.123136       6.130000 
      18.216602       -2.101237       6.130000 
      18.231114       -2.088198       6.100000 
      18.261676       -2.119162       6.080000 
      18.276997       -2.133434       6.040000 
      18.293409       -2.108851       6.150000 
      18.307695       -2.109267       6.010000 
      18.324248       -2.138403       6.110000 
      18.340199       -2.138390       6.140000 
      18.354581       -2.108851       6.120000 
      18.370802       -2.104338       6.100000 
      18.385719       -2.120035       6.070000 
      18.400831       -2.127662       6.060000 
      18.416290       -2.143776       6.110000 
      18.430533       -2.143789       6.210000 
      18.445722       -2.128105       6.160000 
      18.461224       -2.125434       6.100000 
      18.477710       -2.128535       6.110000 
      18.493150       -2.148758       6.040000 
      18.509283       -2.163030       5.990000 
      18.524249       -2.149201       6.000000 
      18.539922       -2.133921       6.040000 
      18.554160       -2.149201       6.100000 
      18.571182       -2.163030       6.070000 
      18.586749       -2.148758       6.110000 
      18.601947       -2.128535       6.140000 
      18.616304       -2.125448       6.100000 
      18.632697       -2.128549       6.130000 
      18.662735       -2.149202       6.060000 
      18.679685       -2.168429       6.100000 
      18.694599       -2.173398       6.080000 
      18.709501       -2.173815       6.160000 
      18.724460       -2.173399       6.200000 
      18.739820       -2.168443       6.200000 
      18.756602       -2.149645       6.230000 
      18.771865       -2.133934       6.150000 
      18.787844       -2.149188       6.090000 
      18.804105       -2.162574       6.190000 
      18.818483       -2.142916       6.180000 
      18.834540       -2.098939       6.080000 
      18.850036       -2.061356       6.140000 
      18.864933       -2.064444       6.120000 
      18.880387       -2.119149       6.160000 
      18.896150       -2.156745       6.120000 
      18.911677       -2.143332       6.160000 
      18.926137       -2.109280       6.080000 
      18.942689       -2.104351       6.100000 
      18.973800       -2.120049       6.140000 
      18.989699       -2.128092       6.150000 
      19.005506       -2.148745       6.210000 
      19.021592       -2.163030       6.190000 
      19.036783       -2.149201       6.070000 
      19.052323       -2.133934       6.060000 
      19.067902       -2.149645       6.150000 
      19.082965       -2.168443       6.110000 
      19.099025       -2.173385       6.100000 
      19.128985       -2.173385       6.170000 
      19.144721       -2.168443       6.060000 
      19.162337       -2.149645       6.070000 
      19.176174       -2.133948       6.230000 
      19.191381       -2.149645       6.210000 
      19.208804       -2.168443       6.080000 
      19.222147       -2.173399       6.250000 
      19.239214       -2.173829       6.130000 
      19.254929       -2.173842       6.150000 
      19.269280       -2.173842       6.120000 
      19.286081       -2.173842       6.090000 
      19.300999       -2.173842       6.090000 
      19.316526       -2.173829       6.110000 
      19.330944       -2.173399       6.180000 
      19.346631       -2.168443       6.100000 
      19.361400       -2.149645       6.060000 
      19.377672       -2.133948       6.140000 
      19.393174       -2.149645       6.140000 
      19.408983       -2.168416       6.080000 
      19.424122       -2.172512       6.250000 
      19.439938       -2.163030       6.130000 
      19.455879       -2.125421       6.230000 
      19.471070       -2.093167       6.110000 
      19.486499       -2.114650       6.190000 
      19.502033       -2.114649       6.090000 
      19.531660       -2.093154       6.100000 
      19.562330       -2.124978       6.220000 
      19.578766       -2.157644       6.100000 
      19.594273       -2.148745       6.150000 
      19.610178       -2.133464       6.110000 
      19.625407       -2.143789       6.160000 
      19.641107       -2.138390       6.180000 
      19.656333       -2.103465       6.140000 
      19.671787       -2.080141       6.120000 
      19.687373       -2.080127       6.040000 
      19.702750       -2.103009       6.090000 
      19.717932       -2.132548       6.080000 
      19.732979       -2.114179       6.190000 
      19.748986       -2.068956       6.140000 
      19.764987       -2.080141       6.170000 
      19.781017       -2.114636       6.130000 
      19.811446       -2.127219       6.190000 
      19.826578       -2.143776       6.100000 
      19.841812       -2.144219       6.190000 
      19.856987       -2.133048       6.200000 
      19.872563       -2.143789       6.130000 
      19.889534       -2.138846       6.060000 
      19.904482       -2.109307       6.120000 
      19.919595       -2.109724       6.120000 
      19.935002       -2.143802       6.100000 
      19.950072       -2.162600       6.110000 
      19.965775       -2.149175       6.080000 
      19.981021       -2.133491       6.110000 
      19.996732       -2.144232       6.080000 
      20.011647       -2.143803       6.060000 
      20.028079       -2.128105       6.180000 
      20.043412       -2.125421       6.150000 
      20.058750       -2.128105       6.200000 
      20.074473       -2.143789       6.140000 
      20.090625       -2.143789       6.070000 
      20.105869       -2.128078       6.110000 
      20.122428       -2.124548       6.060000 
      20.138004       -2.117723       6.170000 
      20.153990       -2.099921       6.230000 
      20.169696       -2.077843       6.110000 
      20.184888       -2.076597       6.150000 
      20.199943       -2.082798       6.160000 
      20.214988       -2.119122       6.090000 
      20.231029       -2.137477       6.070000 
      20.246096       -2.116421       6.080000 
      20.261348       -2.071628       6.100000 
      20.275876       -2.024549       6.090000 
      20.291479       -2.060456       6.030000 
      20.307455       -2.127565       6.100000 
      20.322760       -2.136631       6.090000 
      20.338973       -2.098469       6.080000 
      20.353704       -2.061329       6.090000 
      20.368661       -2.064000       6.060000 
      20.383626       -2.113736       6.160000 
      20.399085       -2.132105       6.170000 
      20.414424       -2.098052       6.160000 
      20.428885       -2.061329       6.140000 
      20.445943       -2.064417       6.150000 
      20.461307       -2.118276       6.060000 
      20.476584       -2.146390       6.040000 
      20.491078       -2.100337       6.240000 
      20.507261       -2.053662       6.200000 
      20.522935       -2.094938       6.060000 
      20.539199       -2.121723       6.040000 
      20.553625       -2.072083       6.130000 
      20.570561       -2.004768       6.190000 
      20.585129       -1.961799       6.010000 
      20.601450       -1.964028       6.050000 
      20.617139       -2.014220       6.080000 
      20.632977       -2.038847       6.150000 
      20.648766       -2.038890       6.140000 
      20.663862       -2.079214       6.080000 
      20.679187       -2.132534       6.060000 
      20.695354       -2.137490       6.070000 
      20.709742       -2.103438       6.120000 
      20.724823       -2.080127       6.070000 
      20.740775       -2.079698       6.120000 
      20.756669       -2.098066       6.090000 
      20.772887       -2.114180       6.190000 
      20.789345       -2.103452       6.170000 
      20.803452       -2.103895       6.170000 
      20.819770       -2.120021       6.100000 
      20.834866       -2.127635       6.060000 
      20.849744       -2.142889       6.110000 
      20.865403       -2.132977       6.070000 
      20.881042       -2.079254       6.140000 
      20.896490       -2.039777       6.110000 
      20.911698       -2.049645       6.130000 
      20.928038       -2.062614       6.030000 
      20.943988       -2.043802       6.140000 
      20.959743       -2.009710       6.070000 
      20.975916       -2.008864       6.050000 
      20.990885       -2.033448       6.110000 
      21.004780       -2.019606       6.100000 
