Human trial picking the raspberry twin 

 time    ||     output compensated 

      0       -800.057143 
      0       -800.057143 
      0       -800.057143 
      0       -800.057143 
      0       -800.057143 
      0       -800.057143 
      0       -800.057143 
      0       -800.057143 
      0       -800.057143 
      0       -800.057138 
      0       -800.055949 
      0       -799.948898 
      0       -796.403836 
      0       -753.215589 
      0       -559.652864 
      0       -240.496369 
      0       -46.893337 
      0       -3.715831 
      0       -0.194923 
      1       -0.057460 
      1       -0.017223 
      1       -0.008744 
      1       -0.006446 
      1       -0.007858 
      1       -0.006419 
      1       -0.007858 
      1       -0.006419 
      1       -0.007858 
      1       -0.006419 
      1       -0.007858 
      1       -0.006419 
      1       -0.007858 
      1       -0.006420 
      1       -0.007871 
      1       -0.006876 
      2       -0.013687 
      2       -0.035586 
      2       -0.067007 
      2       -0.052169 
      2       -0.027613 
      2       -0.058011 
      2       -0.097033 
      2       -0.104646 
      2       -0.097006 
      2       -0.057138 
      2       -0.017244 
      2       -0.008744 
      2       -0.006446 
      3       -0.007858 
      3       -0.006419 
      3       -0.007858 
      3       -0.006446 
      3       -0.008744 
      3       -0.017218 
      3       -0.056252 
      3       -0.086235 
      3       -0.057138 
      3       -0.028016 
      3       -0.057138 
      3       -0.086221 
      3       -0.055809 
      3       -0.011818 
      3       0.015453 
      3       0.033448 
      3       0.016325 
      3       -0.001477 
      3       -0.013270 
      3       -0.036459 
      3       -0.077778 
      4       -0.099677 
      4       -0.096576 
      4       -0.057125 
      4       -0.017271 
      4       -0.009631 
      4       -0.017244 
      4       -0.056252 
      4       -0.086208 
      4       -0.056252 
      4       -0.017218 
      4       -0.008744 
      4       -0.006446 
      5       -0.007858 
      5       -0.006419 
      5       -0.007858 
      5       -0.006419 
      5       -0.007858 
      5       -0.006446 
      5       -0.008744 
      5       -0.017218 
      5       -0.056252 
      5       -0.086235 
      5       -0.057139 
      5       -0.028043 
      5       -0.058025 
      5       -0.097033 
      5       -0.104646 
      5       -0.097006 
      5       -0.057138 
      6       -0.017244 
      6       -0.008744 
      6       -0.006446 
      6       -0.007858 
      6       -0.006446 
      6       -0.008744 
      6       -0.017218 
      6       -0.056252 
      6       -0.086235 
      6       -0.057138 
      6       -0.028016 
      6       -0.057138 
      6       -0.086235 
      6       -0.056252 
      6       -0.017218 
      6       -0.008744 
      6       -0.006446 
      6       -0.007858 
      6       -0.006419 
      6       -0.007831 
      6       -0.005506 
      6       0.003881 
      6       0.054081 
      6       0.142701 
      6       0.250100 
      6       0.394921 
      6       0.574321 
      6       0.739882 
      6       0.887054 
      6       1.037664 
      6       1.199181 
      6       1.396386 
      6       1.620595 
      6       1.782844 
      6       1.851105 
      6       1.878098 
      6       1.955688 
      6       2.105521 
      6       2.315681 
      6       2.542148 
      6       2.697160 
      6       2.800883 
      6       2.849665 
      6       2.862815 
      7       2.872203 
      7       2.912191 
      7       2.954315 
      7       2.990281 
      7       3.119863 
      7       3.353388 
      7       3.570414 
      7       3.735918 
      7       3.895071 
      7       4.088439 
      7       4.355078 
      7       4.600383 
      7       4.720912 
      7       4.782420 
      7       4.806976 
      7       4.795813 
      7       4.632900 
      7       4.298032 
      7       3.960957 
      7       3.569448 
      7       2.808630 
      7       1.478174 
      7       0.050833 
      7       -0.362185 
      7       0.191045 
      7       0.459741 
      7       0.158929 
      7       -0.316785 
      7       -0.802912 
      7       -1.079459 
      7       -1.156329 
      7       -1.178341 
      7       -1.161380 
      7       -1.144882 
      7       -1.148426 
      7       -1.187957 
      7       -1.229974 
      7       -1.262836 
      7       -1.354585 
      7       -1.417414 
      7       -1.339398 
      8       -1.267364 
      8       -1.279781 
      8       -1.356561 
      8       -1.406148 
      8       -1.368192 
      8       -1.338100 
      8       -1.385205 
      8       -1.425056 
      8       -1.427328 
      8       -1.393706 
      8       -1.364281 
      8       -1.382557 
      8       -1.399825 
      8       -1.425761 
      8       -1.433664 
      8       -1.421563 
      8       -1.456200 
      8       -1.456589 
      8       -1.359068 
      8       -1.284086 
      8       -1.321831 
      8       -1.354375 
      8       -1.337984 
      8       -1.272788 
      8       -1.222802 
      8       -1.242832 
      8       -1.328905 
      8       -1.354861 
      8       -1.315046 
      8       -1.243276 
      8       -1.176193 
      8       -1.269785 
      8       -1.433870 
      8       -1.483944 
      8       -1.494938 
      8       -1.539026 
      8       -1.563951 
      8       -1.468690 
      8       -1.367169 
      8       -1.307824 
      8       -1.289587 
      8       -1.251333 
      8       -1.238499 
      8       -1.333322 
      8       -1.392579 
      8       -1.353505 
      8       -1.320489 
      8       -1.268315 
      8       -1.227798 
      8       -1.267903 
      8       -1.379678 
      8       -1.430151 
      8       -1.433944 
      8       -1.453049 
      8       -1.493509 
      8       -1.509606 
      9       -1.478642 
      9       -1.395393 
      9       -1.372871 
      9       -1.431673 
      9       -1.438261 
      9       -1.420476 
      9       -1.383143 
      9       -1.384205 
      9       -1.415451 
      9       -1.438388 
      9       -1.502037 
      9       -1.567387 
      9       -1.547759 
      9       -1.516365 
      9       -1.529791 
      9       -1.492125 
      9       -1.437516 
      9       -1.414994 
      9       -1.379222 
      9       -1.363472 
      9       -1.394437 
      9       -1.411406 
      9       -1.400279 
      9       -1.393524 
      9       -1.449089 
      9       -1.506465 
      9       -1.489125 
      9       -1.410415 
      9       -1.300435 
      9       -1.257762 
      9       -1.266438 
      9       -1.316320 
      9       -1.363059 
      9       -1.355608 
      9       -1.318179 
      9       -1.254308 
      9       -1.246793 
      9       -1.285592 
      9       -1.249340 
      9       -1.127627 
      9       -1.047625 
      9       -1.029129 
      9       -1.052098 
      9       -1.061997 
      9       -1.039398 
      9       -1.029898 
      9       -1.040484 
      9       -1.121936 
      9       -1.177650 
      9       -1.123390 
      9       -1.110788 
      9       -1.144465 
      9       -1.141952 
      10       -1.115392 
      10       -1.031057 
      10       -0.970591 
      10       -1.001283 
      10       -1.015564 
      10       -0.951376 
      10       -0.856610 
      10       -0.855222 
      10       -0.894923 
      10       -0.907818 
      10       -0.934167 
      10       -0.941242 
      10       -0.910163 
      10       -0.912547 
      10       -0.918988 
      10       -0.902260 
      10       -0.911865 
      10       -0.928933 
      10       -0.953794 
      10       -0.941572 
      10       -0.884259 
      10       -0.854119 
      10       -0.796244 
      10       -0.722760 
      10       -0.712272 
      10       -0.706585 
      10       -0.700305 
      10       -0.764876 
      10       -0.802684 
      10       -0.759452 
      10       -0.713461 
      10       -0.727425 
      10       -0.705271 
      10       -0.702469 
      10       -0.763992 
      10       -0.823020 
      10       -0.773488 
      10       -0.713418 
      10       -0.708476 
      10       -0.695166 
      10       -0.653213 
      10       -0.554304 
      10       -0.510268 
      10       -0.604902 
      10       -0.695559 
      10       -0.630927 
      10       -0.527512 
      10       -0.533705 
      10       -0.555884 
      10       -0.522835 
      10       -0.486938 
      10       -0.442626 
      10       -0.422660 
      10       -0.454806 
      10       -0.494616 
      10       -0.526413 
      10       -0.491919 
      11       -0.436407 
      11       -0.421999 
      11       -0.423398 
      11       -0.499599 
      11       -0.572953 
      11       -0.509913 
      11       -0.465937 
      11       -0.471775 
      11       -0.412009 
      11       -0.420219 
      11       -0.492587 
      11       -0.508490 
      11       -0.486832 
      11       -0.520120 
      11       -0.550906 
      11       -0.538059 
      11       -0.497559 
      11       -0.473955 
      11       -0.456802 
      11       -0.416105 
      11       -0.374373 
      11       -0.429104 
      11       -0.512340 
      11       -0.510691 
      11       -0.473376 
      11       -0.456513 
      11       -0.477416 
      11       -0.540787 
      11       -0.583133 
      11       -0.598620 
      11       -0.536525 
      11       -0.467571 
      11       -0.478980 
      11       -0.555816 
      11       -0.605819 
      11       -0.638225 
      11       -0.650225 
      11       -0.617999 
      11       -0.524825 
      11       -0.464707 
      11       -0.487167 
      11       -0.519033 
      11       -0.523230 
      11       -0.449164 
      11       -0.402163 
      11       -0.466469 
      11       -0.552210 
      11       -0.568136 
      11       -0.549425 
      11       -0.549888 
      11       -0.505142 
      11       -0.470187 
      11       -0.471833 
      12       -0.489120 
      12       -0.479131 
      12       -0.451839 
      12       -0.403344 
      12       -0.425073 
      12       -0.447408 
      12       -0.408757 
      12       -0.418977 
      12       -0.436302 
      12       -0.409560 
      12       -0.381744 
      12       -0.378977 
      12       -0.327569 
      12       -0.321800 
      12       -0.399162 
      12       -0.448955 
      12       -0.400906 
      12       -0.348643 
      12       -0.359708 
      12       -0.352603 
      12       -0.311831 
      12       -0.335763 
      12       -0.367394 
      12       -0.369625 
      12       -0.407495 
      12       -0.405256 
      12       -0.361283 
      12       -0.368291 
      12       -0.322850 
      12       -0.254513 
      12       -0.245624 
      12       -0.226404 
      12       -0.214344 
      12       -0.254357 
      12       -0.320140 
      12       -0.387926 
      12       -0.374238 
      12       -0.324461 
      12       -0.309567 
      12       -0.247516 
      12       -0.178520 
      12       -0.190851 
      12       -0.196081 
      12       -0.206976 
      12       -0.252378 
      12       -0.256046 
      12       -0.242470 
      12       -0.243939 
      12       -0.278855 
      12       -0.295045 
      12       -0.215380 
      12       -0.105457 
      12       -0.087039 
      12       -0.124400 
      12       -0.174084 
      13       -0.239453 
      13       -0.281760 
      13       -0.304366 
      13       -0.297706 
      13       -0.330768 
      13       -0.357968 
      13       -0.337175 
      13       -0.344372 
      13       -0.340059 
      13       -0.252736 
      13       -0.135436 
      13       -0.078881 
      13       -0.095990 
      13       -0.140568 
      13       -0.203133 
      13       -0.168624 
      13       -0.100486 
      13       -0.086985 
      13       -0.100788 
      13       -0.107331 
      13       -0.057817 
      13       -0.036996 
      13       -0.110094 
      13       -0.154367 
      13       -0.137683 
      13       -0.157218 
      13       -0.133840 
      13       -0.094461 
      13       -0.128505 
      13       -0.198190 
      13       -0.221522 
      13       -0.188253 
      13       -0.155742 
      13       -0.119622 
      13       -0.121044 
      13       -0.166015 
      13       -0.165575 
      13       -0.133017 
      13       -0.105374 
      13       -0.103087 
      13       -0.112624 
      13       -0.159899 
      13       -0.159121 
      13       -0.055092 
      13       0.016429 
      13       -0.025883 
      13       -0.094324 
      14       -0.102347 
      14       -0.123880 
      14       -0.162163 
      14       -0.121498 
      14       -0.103922 
      14       -0.127632 
      14       -0.132643 
      14       -0.123714 
      14       -0.083021 
      14       -0.043134 
      14       -0.039633 
      14       -0.060916 
      14       -0.101160 
      14       -0.121390 
      14       -0.111814 
      14       -0.049399 
      14       0.010021 
      14       -0.037069 
      14       -0.110314 
      14       -0.069745 
      14       -0.011398 
      14       -0.051161 
      14       -0.096802 
      14       -0.061232 
      14       0.014819 
      14       0.054127 
      14       0.024781 
      14       -0.014059 
      14       -0.021469 
      14       -0.014128 
      14       0.020163 
      14       0.036352 
      14       0.014721 
      14       0.030087 
      14       0.053233 
      14       0.011517 
      14       -0.079194 
      14       -0.173701 
      14       -0.189754 
      14       -0.101793 
      14       -0.027582 
      14       0.017508 
      14       0.015566 
      14       -0.031184 
      14       -0.037450 
      14       -0.030554 
      14       -0.048298 
      14       -0.087897 
      14       -0.104616 
      14       -0.091290 
      14       -0.068507 
      14       -0.060870 
      14       -0.038791 
      15       -0.030179 
      15       -0.056312 
      15       -0.075414 
      15       -0.060370 
      15       -0.116226 
      15       -0.177524 
      15       -0.157156 
      15       -0.136167 
      15       -0.187454 
      15       -0.204793 
      15       -0.156510 
      15       -0.195386 
      15       -0.212807 
      15       -0.137181 
      15       -0.027427 
      15       0.047331 
      15       0.019355 
      15       -0.038848 
      15       -0.013244 
      15       0.041060 
      15       0.056136 
      15       0.068032 
      15       0.037092 
      15       -0.035952 
      15       -0.085338 
      15       -0.103099 
      15       -0.135806 
      15       -0.134856 
      15       -0.041252 
      15       0.051442 
      15       0.051396 
      15       0.027834 
      15       0.056800 
      15       0.083773 
      15       0.038508 
      15       -0.057176 
      15       -0.120588 
      15       -0.102883 
      15       -0.043818 
      15       0.008585 
      15       -0.015959 
      15       -0.034753 
      15       0.030279 
      15       0.092163 
      15       0.104922 
      15       0.105270 
      15       0.086798 
      15       0.015489 
      15       -0.104602 
      15       -0.174822 
      15       -0.199469 
      15       -0.223948 
      15       -0.208032 
      15       -0.113683 
      16       -0.099225 
      16       -0.129696 
      16       -0.088491 
      16       -0.068974 
      16       -0.084644 
      16       -0.116659 
      16       -0.107489 
      16       -0.036277 
      16       0.004814 
      16       -0.001783 
      16       -0.018703 
      16       -0.011338 
      16       -0.031271 
      16       -0.056147 
      16       -0.030823 
      16       -0.014962 
      16       -0.036106 
      16       -0.020244 
      16       0.003019 
      16       -0.041812 
      16       -0.135442 
      16       -0.183752 
      16       -0.113614 
      16       -0.015755 
      16       0.021653 
      16       0.029482 
      16       0.028268 
      16       0.030274 
      16       0.038386 
      16       0.077497 
      16       0.116191 
      16       0.122593 
      16       0.113777 
      16       0.072319 
      16       0.022275 
      16       -0.024008 
      16       -0.062030 
      16       -0.047528 
      16       -0.026372 
      16       0.005588 
      16       0.042604 
      16       0.068942 
      16       0.069061 
      16       0.052431 
      16       -0.021326 
      16       -0.072080 
      16       -0.039497 
      16       -0.037309 
      16       -0.066233 
      16       -0.073560 
      16       -0.080392 
      17       -0.101268 
      17       -0.130498 
      17       -0.104252 
      17       -0.036333 
      17       -0.011016 
      17       -0.040710 
      17       -0.056598 
      17       -0.038407 
      17       0.006951 
      17       0.043502 
      17       0.050796 
      17       0.026195 
      17       -0.006341 
      17       -0.068026 
      17       -0.042817 
      17       0.051512 
      17       0.073280 
      17       0.067671 
      17       0.089564 
      17       0.077223 
      17       0.061311 
      17       0.073168 
      17       0.073270 
      17       0.071717 
      17       0.058941 
      17       0.077960 
      17       0.101918 
      17       0.070817 
      17       0.031478 
      17       0.023625 
      17       0.030927 
      17       0.069249 
      17       0.098651 
      17       0.073353 
      17       0.057917 
      17       0.088006 
      17       0.103461 
      17       0.085214 
      17       0.043868 
      17       0.020486 
      17       0.008606 
      17       -0.009092 
      17       -0.025540 
      17       -0.002975 
      17       0.038182 
      17       0.083188 
      17       0.099994 
      17       0.082672 
      17       0.051204 
      17       0.066245 
      17       0.099693 
      17       0.105383 
      17       0.091446 
      18       0.028384 
      18       -0.036144 
      18       -0.011445 
      18       0.038360 
      18       0.040224 
      18       0.061519 
      18       0.094655 
      18       0.091472 
      18       0.051093 
      18       0.003549 
      18       0.029275 
      18       0.058626 
      18       0.040840 
      18       0.052316 
      18       0.066933 
      18       0.053382 
      18       0.047546 
      18       0.034626 
      18       0.054727 
      18       0.088755 
      18       0.095830 
      18       0.096270 
      18       0.083658 
      18       0.041694 
      18       -0.014757 
      18       -0.016694 
      18       0.013950 
      18       0.036094 
      18       0.029020 
      18       0.049615 
      18       0.083269 
      18       0.085107 
      18       0.063388 
      18       0.030848 
      18       0.036241 
      18       0.031945 
      18       -0.001731 
      18       -0.010936 
      18       -0.030014 
      18       -0.026053 
      18       -0.003701 
      18       0.034980 
      19       0.050583 
      19       0.019036 
      19       -0.001996 
      19       0.000642 
      19       0.033084 
      19       0.033973 
      19       -0.048783 
      19       -0.102479 
      19       -0.060153 
      19       -0.019674 
      19       -0.007003 
      19       0.001907 
      19       0.036065 
      19       0.051258 
      19       0.020090 
      19       0.003116 
      19       0.014952 
      19       0.031328 
      19       0.014064 
      19       -0.002412 
      19       0.001094 
      19       0.039302 
      19       0.068552 
      19       0.038210 
      19       -0.000790 
      19       -0.008332 
      19       -0.001124 
      19       0.033038 
      19       0.049085 
      19       0.026914 
      19       0.037718 
      19       0.048413 
      19       0.026210 
      19       0.041049 
      19       0.060096 
      19       0.011641 
      19       -0.032834 
      19       0.012704 
      19       0.069406 
      19       0.077101 
      19       0.060420 
      19       0.042891 
      19       0.059400 
      19       0.075154 
      19       0.071333 
      19       0.036895 
      20       0.020999 
      20       0.051869 
      20       0.073017 
      20       0.078565 
      20       0.070610 
      20       0.037986 
      20       -0.036039 
      20       -0.075187 
      20       -0.049112 
      20       -0.031847 
      20       -0.038064 
      20       -0.030255 
      20       0.026481 
      20       0.066081 
      20       0.062376 
      20       0.005323 
      20       -0.041190 
      20       -0.010739 
      20       -0.014552 
      20       -0.071661 
      20       -0.060268 
      20       -0.019362 
      20       0.028863 
      20       0.059507 
      20       0.034627 
      20       0.019592 
      20       0.050503 
      20       0.071665 
      20       0.077252 
      20       0.070149 
      20       0.046943 
      20       0.005993 
      20       -0.011253 
      20       0.006046 
      20       0.046466 
      20       0.068519 
      20       0.074563 
      20       0.071556 
      20       0.057558 
      20       -0.000271 
      20       -0.045465 
      20       0.000186 
      20       0.057412 
      20       0.069295 
