

 time    ||    gripping force   ||   raspberry measurement 

      0       19.560000       -794.040541 
      0       18.720000       -794.040541 
      0       17.410000       -794.040541 
      0       16.980000       -794.040541 
      0       16.990000       -794.040541 
      0       17.020000       -794.040541 
      1       17.010000       -786.100135 
      1       17.030000       -778.239134 
      1       17.080000       -770.456742 
      1       17.050000       -762.752170 
      1       13.000000       -755.123480 
      1       12.620000       -747.467033 
      2       12.260000       -743.947716 
      2       12.040000       -701.073919 
      2       11.780000       -508.929936 
      2       11.880000       -192.149099 
      2       11.710000       -0.020813 
      3       11.660000       42.849883 
      3       10.980000       46.367345 
      3       10.920000       46.475045 
      3       11.020000       46.474787 
      4       11.080000       46.476204 
      4       11.120000       46.473906 
      4       11.130000       46.465432 
      4       11.150000       46.426398 
      4       11.090000       46.396442 
      4       11.160000       46.426398 
      5       11.190000       46.465432 
      6       11.420000       46.473906 
      6       11.490000       46.476204 
      6       11.510000       46.474791 
      6       11.720000       46.476204 
      7       14.440000       46.473906 
      7       15.040000       46.465432 
      7       16.090000       46.426398 
      7       16.710000       46.396442 
      7       16.780000       46.426398 
      8       16.800000       46.465432 
      9       18.520000       46.473905 
      9       18.540000       46.476177 
      9       18.510000       46.473905 
      9       18.480000       46.465405 
      10       18.870000       46.425511 
      10       18.910000       46.385644 
      11       18.940000       46.378004 
      11       18.930000       46.385644 
      11       19.040000       46.425511 
      11       19.010000       46.465379 
      12       18.940000       46.473019 
      12       19.010000       46.465405 
      12       18.970000       46.426397 
      12       19.040000       46.396415 
      12       18.990000       46.425512 
      12       19.020000       46.454647 
      12       18.990000       46.425955 
      12       19.000000       46.401814 
      13       18.980000       46.450595 
      13       18.940000       46.505326 
      13       18.990000       46.498103 
      13       18.950000       46.481603 
      13       19.240000       46.475235 
      13       19.890000       46.476257 
      13       19.870000       46.475235 
      14       19.850000       46.481643 
      14       19.750000       46.499432 
      14       19.760000       46.521524 
      14       19.730000       46.523186 
      15       20.120000       46.521537 
      15       20.110000       46.499889 
      15       20.130000       46.487472 
      15       20.140000       46.504375 
      15       20.120000       46.534479 
      15       20.300000       46.508857 
      15       20.260000       46.436766 
      16       20.310000       46.397288 
      16       20.250000       46.425538 
      17       20.180000       46.454634 
      17       20.210000       46.425511 
      18       20.220000       46.396415 
      18       20.200000       46.426424 
      18       20.170000       46.466305 
      18       20.230000       46.484274 
      18       20.150000       46.519629 
      18       20.200000       46.535352 
      18       20.190000       46.503958 
      18       20.220000       46.482059 
      18       20.230000       46.475248 
      18       20.190000       46.476244 
      19       20.120000       46.474792 
      19       20.160000       46.476230 
      19       20.190000       46.474792 
      19       20.200000       46.476230 
      19       20.190000       46.474792 
      19       20.200000       46.476244 
      19       20.200000       46.475248 
      19       20.180000       46.482059 
      19       20.180000       46.503958 
      19       20.200000       46.535352 
      19       20.200000       46.519655 
      19       20.200000       46.485160 
      19       20.140000       46.477103 
      20       20.250000       46.474805 
      20       20.210000       46.475774 
      20       20.120000       46.468936 
      20       20.160000       46.446178 
      21       20.160000       46.404885 
      21       20.100000       46.383429 
      21       20.150000       46.391903 
      21       20.170000       46.454691 
      21       20.190000       46.524528 
      21       20.180000       46.518769 
      21       20.170000       46.485133 
      21       20.190000       46.477103 
      22       20.150000       46.474818 
      22       20.140000       46.476204 
      22       20.180000       46.473906 
      22       20.070000       46.465432 
      22       20.110000       46.426398 
      22       20.150000       46.396442 
      23       20.080000       46.426397 
      23       20.130000       46.465405 
      23       20.150000       46.473019 
      23       20.150000       46.465379 
      23       20.170000       46.425511 
      23       20.160000       46.385644 
      23       20.180000       46.378004 
      23       20.180000       46.385644 
      24       20.180000       46.425511 
      24       20.090000       46.465405 
      24       20.140000       46.473905 
      24       20.120000       46.476203 
      24       20.130000       46.474778 
      24       20.150000       46.475787 
      25       20.220000       46.469393 
      25       20.120000       46.452033 
      25       20.130000       46.434898 
      25       20.210000       46.452033 
      25       20.140000       46.469393 
      25       20.140000       46.475787 
      26       20.140000       46.474778 
      26       20.140000       46.476203 
      27       20.140000       46.473906 
      27       20.170000       46.465432 
      27       20.170000       46.426398 
      27       20.140000       46.396442 
      27       20.160000       46.426398 
      27       20.150000       46.465432 
      27       20.160000       46.473906 
      27       20.180000       46.476204 
      27       20.130000       46.474792 
      27       20.100000       46.476230 
      27       20.160000       46.474792 
      28       20.120000       46.476257 
      28       20.130000       46.475678 
      28       20.150000       46.487029 
      28       20.140000       46.523186 
      28       20.220000       46.556019 
      28       20.160000       46.523186 
      28       20.190000       46.487029 
      28       20.210000       46.475678 
      28       20.150000       46.476257 
      28       20.130000       46.474792 
      28       20.160000       46.476230 
      29       20.140000       46.474792 
      29       20.210000       46.476230 
      29       20.180000       46.474792 
      29       20.180000       46.476244 
      29       20.090000       46.475248 
      30       20.140000       46.482059 
      30       20.160000       46.503958 
      30       20.140000       46.535339 
      30       20.130000       46.519199 
      31       20.160000       46.479331 
      31       20.160000       46.447937 
      31       20.090000       46.415696 
      31       20.190000       46.431367 
      32       20.110000       46.465835 
      32       20.120000       46.473046 
      32       20.140000       46.465835 
      32       20.140000       46.431340 
      32       20.160000       46.414783 
      32       20.140000       46.436266 
      32       20.090000       46.420569 
      33       20.160000       46.395985 
      33       20.120000       46.426384 
      33       20.120000       46.465432 
      33       20.100000       46.473905 
      33       20.110000       46.476177 
      33       20.150000       46.473919 
      33       20.200000       46.465862 
      34       20.130000       46.431367 
      34       20.140000       46.415656 
      34       20.090000       46.446608 
      34       20.070000       46.463134 
      34       20.120000       46.446608 
      34       20.150000       46.415656 
      34       20.150000       46.431367 
      34       20.130000       46.465862 
      34       20.110000       46.473919 
      34       20.110000       46.476177 
      35       20.150000       46.473905 
      35       20.150000       46.465432 
      35       20.060000       46.426398 
      35       20.090000       46.396442 
      35       20.110000       46.426397 
      35       20.090000       46.465406 
      36       20.110000       46.473032 
      36       20.080000       46.465835 
      36       20.110000       46.431340 
      36       20.140000       46.414797 
      37       20.130000       46.436696 
      37       20.140000       46.425538 
      37       20.110000       46.415240 
      37       20.100000       46.447924 
      37       20.130000       46.479331 
      37       20.180000       46.519199 
      37       20.100000       46.535339 
      38       20.060000       46.503958 
      38       20.090000       46.482059 
      38       20.070000       46.475248 
      38       20.090000       46.476244 
      38       20.210000       46.474792 
      39       20.120000       46.476230 
      39       20.180000       46.474792 
      39       20.190000       46.476230 
      39       20.130000       46.474792 
      39       20.160000       46.476230 
      39       20.130000       46.474792 
      39       20.080000       46.476230 
      39       20.130000       46.474792 
      39       20.050000       46.476230 
      40       20.120000       46.474792 
      40       20.080000       46.476230 
      40       20.160000       46.474792 
      40       20.120000       46.476204 
      40       20.140000       46.473905 
      40       20.110000       46.465405 
      40       20.130000       46.425511 
      40       20.120000       46.385644 
      40       20.060000       46.378004 
      41       20.110000       46.385644 
      41       20.130000       46.425511 
      41       20.090000       46.465405 
      41       20.170000       46.473905 
      41       20.130000       46.476204 
      41       20.080000       46.474792 
      42       20.120000       46.476230 
      42       20.100000       46.474792 
      42       20.110000       46.476257 
      42       20.120000       46.475678 
      42       20.130000       46.487029 
      43       20.120000       46.523186 
      43       20.100000       46.556032 
      43       20.120000       46.523629 
      43       20.060000       46.492441 
      43       20.130000       46.500319 
      43       20.140000       46.521550 
      43       20.100000       46.523186 
      44       20.090000       46.521497 
      44       20.150000       46.498546 
      44       20.120000       46.470845 
      44       20.100000       46.426841 
      44       20.100000       46.396455 
      45       20.110000       46.426398 
      45       20.100000       46.465432 
      45       20.060000       46.473906 
      45       20.090000       46.476204 
      45       20.090000       46.474792 
      46       20.150000       46.476230 
      46       20.080000       46.474792 
      46       20.050000       46.476230 
      46       20.120000       46.474792 
      46       20.060000       46.476230 
      46       20.090000       46.474792 
      47       20.110000       46.476230 
      47       20.120000       46.474778 
      47       20.130000       46.475774 
      47       20.060000       46.468963 
      48       20.060000       46.447064 
      48       20.160000       46.415670 
      48       20.100000       46.431367 
      48       20.080000       46.465862 
      48       20.090000       46.473919 
      48       20.100000       46.476204 
      48       20.120000       46.474792 
      49       20.090000       46.476230 
      49       20.160000       46.474792 
      50       20.080000       46.476230 
      50       20.140000       46.474792 
      50       20.130000       46.476230 
      51       20.060000       46.474792 
      51       20.070000       46.476230 
      51       20.110000       46.474792 
      51       20.100000       46.476231 
      51       20.090000       46.474819 
      52       20.120000       46.477103 
      52       20.100000       46.485160 
      52       20.090000       46.519655 
      52       20.090000       46.535326 
      53       20.100000       46.503072 
      53       20.140000       46.471261 
      53       20.080000       46.426854 
      53       20.140000       46.396455 
      54       20.130000       46.426398 
      54       20.100000       46.465446 
      55       20.110000       46.474349 
      55       20.100000       46.481603 
      56       20.110000       46.498988 
      56       20.120000       46.516098 
      56       20.020000       46.498103 
      57       20.080000       46.470831 
      57       20.020000       46.426841 
      57       20.140000       46.396455 
      57       20.130000       46.426398 
      57       20.140000       46.465432 
      58       20.110000       46.473906 
      58       20.090000       46.476204 
      58       20.060000       46.474791 
      58       20.110000       46.476204 
      58       20.080000       46.473906 
      58       20.150000       46.465432 
      59       20.120000       46.426398 
      59       20.120000       46.396455 
      59       20.100000       46.426841 
      59       20.070000       46.470831 
      59       20.060000       46.498103 
      59       20.110000       46.516098 
      59       20.080000       46.498989 
      59       20.150000       46.481629 
      59       20.100000       46.475235 
      59       20.070000       46.476244 
      60       20.080000       46.474792 
      60       20.120000       46.476204 
      60       20.130000       46.473906 
      60       20.070000       46.465432 
      60       20.120000       46.426397 
      60       20.080000       46.396415 
