

 time    ||    gripping force   ||   raspberry measurement 

      0       0.060000       -795.938710 
      0       0.100000       -795.938710 
      0       0.180000       -795.938710 
      0       0.060000       -795.938710 
      0       0.230000       -795.938710 
      0       0.170000       -795.938710 
      0       0.050000       -795.938710 
      0       0.260000       -795.938710 
      0       0.200000       -795.938710 
      0       0.070000       -795.938705 
      0       0.200000       -795.937524 
      1       0.240000       -787.872897 
      1       0.410000       -784.352224 
      1       0.230000       -741.461397 
      1       0.480000       -549.235797 
      1       0.270000       -232.308439 
      1       0.630000       -40.123192 
      1       0.530000       2.669979 
      1       0.450000       6.189407 
      1       3.070000       6.443501 
      1       17.980000       6.534813 
      1       52.490000       6.527278 
      1       65.310000       6.601225 
      1       64.290000       6.695768 
      2       63.860000       6.731692 
      2       63.320000       6.787270 
      2       62.760000       6.802399 
      2       62.500000       6.699519 
      2       62.340000       6.601240 
      2       62.140000       6.610306 
      2       61.390000       6.671613 
      2       61.500000       6.744758 
      3       60.810000       6.739870 
      3       60.830000       6.735942 
      4       60.170000       6.884437 
      4       60.120000       7.243389 
      5       60.010000       7.681826 
      5       60.050000       7.914801 
      5       59.950000       7.966175 
      5       59.950000       7.968752 
      5       59.910000       7.969881 
      5       59.520000       7.963488 
      6       59.790000       7.946129 
      6       59.800000       7.928993 
      6       59.770000       7.946129 
      6       59.830000       7.963488 
      6       59.800000       7.969883 
      6       59.820000       7.968861 
      6       59.720000       7.969883 
      6       59.680000       7.963488 
      7       59.730000       7.946129 
      7       59.640000       7.928993 
      7       59.620000       7.946129 
      7       59.650000       7.963488 
      7       59.680000       7.969883 
      7       59.620000       7.968874 
      7       59.580000       7.970326 
      7       59.580000       7.968887 
      7       59.610000       7.970286 
      8       59.590000       7.967558 
      8       59.540000       7.954128 
      8       59.550000       7.896283 
      8       59.400000       7.850187 
      8       59.480000       7.890467 
      8       59.620000       7.924962 
      8       59.630000       7.908436 
      8       59.440000       7.925422 
      9       59.540000       7.959957 
      9       59.570000       7.968014 
      9       59.360000       7.970299 
      9       59.300000       7.968887 
      9       59.560000       7.970326 
      10       59.390000       7.968887 
      10       59.280000       7.970326 
      10       59.490000       7.968887 
      10       59.400000       7.970326 
      10       59.430000       7.968887 
      10       59.490000       7.970326 
      10       59.190000       7.968887 
      11       59.580000       7.970326 
      11       59.130000       7.968874 
      11       59.300000       7.969883 
      11       59.100000       7.963488 
      11       59.230000       7.946129 
      11       59.480000       7.928980 
      11       59.190000       7.945686 
      11       59.320000       7.958089 
      12       59.330000       7.945685 
      12       59.190000       7.928966 
      12       59.120000       7.945685 
      12       59.260000       7.958089 
      12       59.330000       7.945686 
      12       59.150000       7.928980 
      12       59.310000       7.946129 
      13       59.120000       7.963488 
      13       59.090000       7.969883 
      13       59.160000       7.968874 
      13       59.310000       7.970326 
      13       59.150000       7.968887 
      13       59.280000       7.970326 
      13       59.130000       7.968887 
      14       59.150000       7.970326 
      14       59.170000       7.968887 
      14       59.160000       7.970326 
      14       59.110000       7.968887 
      14       59.190000       7.970326 
      14       59.100000       7.968887 
      15       59.110000       7.970326 
      15       59.140000       7.968914 
      15       59.180000       7.971212 
      15       59.240000       7.979672 
      15       58.980000       8.018277 
      15       59.090000       8.043277 
      15       59.180000       7.994523 
      15       59.090000       7.939791 
      15       59.110000       7.947015 
      16       59.190000       7.963515 
      16       58.900000       7.969883 
      16       59.030000       7.968874 
      16       59.100000       7.970326 
      16       59.000000       7.968887 
      16       59.240000       7.970326 
      16       59.160000       7.968887 
      16       58.950000       7.970299 
      16       59.060000       7.968014 
      16       59.010000       7.959958 
      17       59.070000       7.925462 
      17       59.000000       7.909765 
      17       59.090000       7.941160 
      17       59.070000       7.963058 
      17       59.050000       7.969869 
      18       59.030000       7.968874 
      18       59.010000       7.970326 
      18       59.030000       7.968887 
      19       59.030000       7.970326 
      19       59.020000       7.968887 
      19       59.070000       7.970326 
      19       58.950000       7.968887 
      20       59.010000       7.970326 
      20       59.010000       7.968887 
      20       58.990000       7.970299 
      20       59.040000       7.968014 
      20       58.990000       7.959944 
      21       58.920000       7.925006 
      21       59.140000       7.903936 
      21       59.180000       7.911993 
      22       59.000000       7.903936 
      22       59.150000       7.925006 
      22       58.930000       7.959944 
      22       58.930000       7.968001 
      22       59.090000       7.969843 
      22       59.140000       7.963058 
      23       59.220000       7.941160 
      23       58.950000       7.909765 
      23       59.270000       7.925462 
      23       59.010000       7.959957 
      23       59.020000       7.968001 
      23       59.050000       7.969856 
      23       59.220000       7.963488 
      23       58.980000       7.946129 
      24       59.030000       7.928993 
      24       58.970000       7.946102 
      24       59.190000       7.962615 
      24       59.120000       7.959514 
      24       59.120000       7.925449 
      24       59.130000       7.909752 
      24       59.050000       7.940703 
      24       59.040000       7.957229 
      24       59.160000       7.940703 
      25       59.050000       7.909752 
      25       59.090000       7.925449 
      25       59.060000       7.959514 
      25       59.110000       7.962615 
      25       59.010000       7.946102 
      25       59.080000       7.928980 
      25       59.040000       7.945686 
      25       59.120000       7.958089 
      26       59.160000       7.945686 
      26       59.020000       7.928980 
      26       58.930000       7.946129 
      26       59.210000       7.963488 
      26       59.050000       7.969883 
      26       59.060000       7.968874 
      26       58.960000       7.970326 
      27       59.050000       7.968887 
      27       59.070000       7.970299 
      27       58.860000       7.968001 
      27       58.980000       7.959528 
      27       59.070000       7.920493 
      27       59.120000       7.890537 
      27       59.190000       7.920480 
      27       59.030000       7.959084 
      28       59.180000       7.962588 
      28       58.860000       7.945646 
      28       58.940000       7.923164 
      28       59.170000       7.916963 
      28       59.290000       7.904366 
      28       59.120000       7.925006 
      28       59.090000       7.959501 
      29       59.100000       7.962615 
      29       58.960000       7.946102 
      29       59.250000       7.928966 
      29       59.020000       7.945242 
      29       59.050000       7.952677 
      29       59.150000       7.921045 
      30       59.080000       7.883687 
      30       59.110000       7.897734 
      30       59.220000       7.918195 
      30       59.150000       7.945242 
      30       59.150000       7.963462 
      31       59.140000       7.969882 
      31       59.160000       7.968874 
      31       59.120000       7.970326 
      31       59.140000       7.968887 
      31       59.150000       7.970326 
      31       59.190000       7.968887 
      32       59.190000       7.970326 
      32       59.140000       7.968887 
      32       59.200000       7.970326 
      32       59.210000       7.968887 
      32       59.200000       7.970326 
      32       59.280000       7.968887 
      32       59.210000       7.970326 
      32       59.240000       7.968887 
      32       59.290000       7.970326 
      32       59.240000       7.968887 
      32       59.230000       7.970326 
      32       59.290000       7.968887 
      32       59.240000       7.970326 
      33       59.280000       7.968887 
      33       59.230000       7.970326 
      33       59.200000       7.968874 
      33       59.330000       7.969869 
      33       59.380000       7.963032 
      33       59.400000       7.940287 
      33       59.370000       7.899397 
      34       59.490000       7.882037 
      34       59.260000       7.899397 
      34       59.460000       7.940286 
      34       59.290000       7.963005 
      34       59.530000       7.968983 
      34       59.220000       7.958062 
      34       59.390000       7.921488 
      34       59.410000       7.883700 
      34       59.260000       7.897735 
      34       59.330000       7.918195 
      34       59.390000       7.945242 
      35       59.250000       7.963461 
      35       59.590000       7.969856 
      35       59.420000       7.967988 
      35       59.300000       7.959527 
      35       59.280000       7.920480 
      35       59.270000       7.890094 
      35       59.340000       7.915094 
      35       59.430000       7.935291 
      35       59.280000       7.926790 
      36       59.530000       7.930321 
      36       59.320000       7.895410 
      36       59.380000       7.863599 
      36       59.380000       7.887783 
      36       59.440000       7.898510 
      36       59.380000       7.923677 
      36       59.450000       7.949132 
      37       59.370000       7.919606 
      37       59.440000       7.890054 
      37       59.420000       7.914637 
      37       59.420000       7.929488 
      37       59.390000       7.898497 
      37       59.420000       7.881567 
      37       59.420000       7.893984 
      37       59.410000       7.915646 
      37       59.450000       7.917738 
      38       59.440000       7.921475 
      38       59.360000       7.923581 
      38       59.390000       7.945685 
      38       59.420000       7.963475 
      38       59.350000       7.969883 
      38       59.410000       7.968874 
      38       59.400000       7.970299 
      38       59.390000       7.968014 
      38       59.420000       7.959931 
      39       59.340000       7.924562 
      39       59.480000       7.898497 
      39       59.390000       7.886480 
      39       59.510000       7.848275 
      39       59.390000       7.833187 
      39       59.380000       7.854090 
      39       59.440000       7.915646 
      39       59.400000       7.957619 
      39       59.400000       7.969426 
      39       59.440000       7.968861 
      39       59.340000       7.970326 
      39       59.470000       7.968887 
      40       59.380000       7.970326 
      40       59.410000       7.968874 
      40       59.440000       7.969883 
      40       59.340000       7.963475 
      40       59.460000       7.945686 
      40       59.370000       7.923594 
      40       59.400000       7.921932 
      40       59.380000       7.923581 
      40       59.410000       7.945242 
      40       59.340000       7.958076 
      40       59.410000       7.945685 
      40       59.290000       7.928979 
      40       59.490000       7.946089 
      41       59.370000       7.962172 
      41       59.500000       7.954115 
      41       59.390000       7.901252 
      41       59.400000       7.869871 
      41       59.410000       7.916936 
      41       59.430000       7.956786 
      41       59.400000       7.959058 
      41       59.360000       7.925436 
      42       59.350000       7.909765 
      42       59.370000       7.941159 
      42       59.440000       7.963045 
      42       59.370000       7.969426 
      42       59.420000       7.963475 
      42       59.330000       7.946129 
      42       59.300000       7.928993 
      42       59.370000       7.946129 
      42       59.430000       7.963488 
      42       59.440000       7.969883 
      43       59.320000       7.968874 
      43       59.380000       7.970326 
      43       59.480000       7.968887 
      43       59.430000       7.970299 
      43       59.330000       7.968014 
      43       59.440000       7.959944 
      43       59.360000       7.925006 
      44       59.340000       7.903936 
      44       59.470000       7.911993 
      44       59.320000       7.903936 
      44       59.340000       7.925006 
      44       59.480000       7.959944 
      45       59.430000       7.968014 
      45       59.290000       7.970299 
      45       59.400000       7.968874 
      45       59.370000       7.969869 
      45       59.500000       7.963058 
      45       59.320000       7.941133 
      45       59.440000       7.908879 
      45       59.330000       7.914651 
      46       59.420000       7.911107 
      46       59.410000       7.882397 
      46       59.370000       7.892739 
      46       59.370000       7.898967 
      46       59.340000       7.924576 
      46       59.380000       7.959904 
      46       59.270000       7.967141 
      46       59.380000       7.959931 
      46       59.410000       7.925462 
      46       59.390000       7.909765 
      47       59.330000       7.941159 
      47       59.380000       7.963032 
      47       59.330000       7.968970 
      47       59.390000       7.957646 
      47       59.330000       7.916962 
      47       59.380000       7.869871 
      47       59.290000       7.901265 
      47       59.400000       7.954559 
      47       59.300000       7.967571 
      47       59.440000       7.970259 
      48       59.310000       7.968000 
      48       59.520000       7.959501 
      48       59.300000       7.919607 
      48       59.500000       7.879739 
      48       59.530000       7.872099 
      48       59.560000       7.879739 
      48       59.260000       7.919594 
      48       59.460000       7.959058 
      48       59.170000       7.962588 
      48       59.350000       7.945659 
      48       59.430000       7.923594 
      49       59.200000       7.921905 
      49       59.620000       7.922721 
      49       59.180000       7.935290 
      49       59.450000       7.919150 
      49       59.350000       7.898067 
      49       59.030000       7.886910 
      49       59.210000       7.853674 
      49       59.370000       7.857384 
      49       59.320000       7.893971 
      50       59.470000       7.939400 
      50       59.200000       7.957619 
      50       59.410000       7.945672 
      50       59.440000       7.928980 
      50       59.310000       7.946129 
      50       59.100000       7.963488 
      50       59.470000       7.969856 
      50       59.310000       7.968001 
      50       59.470000       7.959944 
      50       59.240000       7.925006 
      50       59.380000       7.903936 
      51       59.350000       7.911980 
      51       59.360000       7.903493 
      51       59.340000       7.919593 
      51       59.390000       7.935290 
      51       59.360000       7.922264 
      51       59.350000       7.916049 
      51       59.420000       7.893541 
      51       59.350000       7.875752 
      51       59.380000       7.869774 
      51       59.430000       7.875738 
      52       59.340000       7.893085 
      52       59.370000       7.910220 
      52       59.400000       7.893111 
      52       59.420000       7.876611 
      52       59.330000       7.880129 
      52       59.380000       7.918733 
      52       59.350000       7.948676 
      52       59.350000       7.918733 
      52       59.400000       7.880129 
      52       59.310000       7.876611 
      52       59.330000       7.893111 
      52       59.360000       7.910221 
      53       59.330000       7.893111 
      53       59.390000       7.876612 
      53       59.320000       7.880156 
      53       59.300000       7.919620 
      53       59.340000       7.959501 
      53       59.390000       7.967987 
      53       59.260000       7.969856 
      53       59.380000       7.963461 
      53       59.290000       7.945229 
      53       59.370000       7.917738 
      53       59.370000       7.891879 
      53       59.300000       7.853674 
      54       59.350000       7.852428 
      54       59.400000       7.874757 
      54       59.290000       7.919177 
      54       59.350000       7.959488 
      54       59.250000       7.968000 
      54       59.240000       7.970272 
      54       59.110000       7.968014 
      54       59.480000       7.959944 
      55       60.800000       7.925019 
      55       61.060000       7.904366 
      55       61.090000       7.916936 
      55       61.080000       7.922278 
      55       61.050000       7.934874 
      55       60.980000       7.915080 
      55       60.950000       7.890067 
      55       60.990000       7.919607 
      55       61.080000       7.949132 
      55       60.920000       7.923677 
      55       61.030000       7.898510 
      55       60.980000       7.887783 
      56       60.990000       7.863599 
      56       60.980000       7.895410 
      56       60.930000       7.930348 
      56       60.880000       7.927677 
      56       60.990000       7.946089 
      56       60.940000       7.963488 
      56       60.870000       7.969883 
      56       60.920000       7.968861 
      57       60.960000       7.969869 
      57       60.890000       7.963032 
      57       60.930000       7.940287 
      57       60.920000       7.899397 
      57       60.950000       7.882037 
      57       60.930000       7.899397 
      58       60.990000       7.940287 
      58       60.940000       7.963032 
      58       60.870000       7.969869 
      58       60.900000       7.968861 
      58       60.820000       7.969883 
      58       61.010000       7.963488 
      58       60.950000       7.946129 
      58       60.930000       7.928993 
      58       60.940000       7.946102 
      58       60.910000       7.962602 
      58       60.990000       7.959058 
      59       61.040000       7.919593 
      59       61.010000       7.879712 
      59       60.770000       7.871213 
      59       60.970000       7.868914 
      59       60.600000       7.870326 
      59       61.310000       7.868914 
      59       61.010000       7.871213 
      59       61.060000       7.879712 
      59       61.130000       7.919606 
      59       60.720000       7.959461 
      60       60.900000       7.966671 
      60       60.830000       7.954062 
      60       61.060000       7.894980 
      60       60.820000       7.834876 
      60       61.040000       7.828674 
      60       60.970000       7.853674 
      60       60.870000       7.915633 
      60       60.980000       7.957619 
      60       60.910000       7.969399 
      60       60.940000       7.967987 
      61       60.950000       7.959930 
