Human trial picking the raspberry twin 

 time    ||     output     ||     loadcell

      0.000000       -792.009524       0.090000 
      0.030168       -792.009524       0.040000 
      0.061673       -792.009524       0.080000 
      0.093614       -792.009524       0.180000 
      0.124730       -792.009524       0.110000 
      0.155309       -792.009524       0.060000 
      0.187251       -792.009524       0.070000 
      0.217962       -792.009524       0.080000 
      0.248906       -792.009524       0.040000 
      0.280009       -792.009519       0.030000 
      0.311291       -792.008342       0.110000 
      0.343252       -791.902348       0.160000 
      0.373446       -788.392297       0.010000 
      0.404336       -745.630592       0.210000 
      0.435849       -553.979867       0.190000 
      0.467332       -237.979985       0.370000 
      0.497957       -46.307776       0.060000 
      0.529049       -3.578312       0.140000 
      0.560215       -0.105454       0.000000 
      0.591339       -0.004416       0.100000 
      0.621718       0.014699       0.160000 
      0.652863       0.030375       0.040000 
      0.684923       0.014678       0.150000 
      0.715727       -0.004120       0.170000 
      0.747120       -0.009063       0.110000 
      0.777971       -0.009063       0.150000 
      0.808637       -0.004120       0.140000 
      0.839498       0.014678       0.010000 
      0.870011       0.030388       0.180000 
      0.900901       0.015121       0.180000 
      0.932576       0.001279       0.040000 
      0.963528       0.015121       0.000000 
      0.994169       0.030388       0.040000 
      1.025406       0.014678       0.050000 
      1.057170       -0.004107       0.030000 
      1.088906       -0.008633       0.110000 
      1.120588       -0.004080       0.100000 
      1.151336       0.015564       0.000000 
      1.182625       0.041173       0.050000 
      1.213575       0.063072       0.330000 
      1.244865       0.075668       0.030000 
      1.275683       0.039318       0.200000 
      1.306981       0.001292       0.010000 
      1.337993       -0.008633       0.060000 
      1.367719       -0.009493       0.020000 
      1.399023       -0.009519       0.140000 
      1.430957       -0.009506       0.130000 
      1.462832       -0.009076       0.250000 
      1.494719       -0.004120       0.170000 
      1.525767       0.014678       0.120000 
      1.556981       0.030375       0.310000 
      1.588053       0.014678       0.080000 
      1.618948       -0.004120       0.140000 
      1.650153       -0.009063       0.280000 
      1.681329       -0.009063       0.300000 
      1.711620       -0.004107       0.050000 
      1.743079       0.015121       0.070000 
      1.774201       0.035787       0.050000 
      1.805331       0.039318       0.050000 
      1.836509       0.041186       0.310000 
      1.867938       0.039761       0.100000 
      1.898779       0.041186       0.270000 
      1.929900       0.039318       0.250000 
      1.960615       0.035801       0.340000 
      1.991279       0.015591       0.150000 
      2.022568       0.002178       0.040000 
      2.053926       0.025919       0.090000 
      2.085685       0.078796       0.100000 
      2.117028       0.094910       0.030000 
      2.147970       0.049700       0.300000 
      2.178925       0.026806       0.240000 
      2.210784       0.042099       0.250000 
      2.241997       0.063985       0.250000 
      2.273138       0.086466       0.160000 
      2.304789       0.087712       0.030000 
      2.335172       0.081080       0.050000 
      2.366311       0.039761       0.080000 
      2.397100       0.001319       0.280000 
      2.427799       -0.008190       0.090000 
      2.458987       -0.004094       0.090000 
      2.490861       0.014678       0.200000 
      2.520947       0.030375       0.050000 
      2.551408       0.014678       0.020000 
      2.582861       -0.004120       0.110000 
      2.613905       -0.009076       0.030000 
      2.643973       -0.009479       0.120000 
      2.673912       -0.008633       0.030000 
      2.704423       0.001279       0.060000 
      2.735329       0.038875       0.020000 
      2.766911       0.070282       0.030000 
      2.797146       0.039318       0.320000 
      2.828027       0.006705       0.240000 
      2.858898       0.016477       0.260000 
      2.890361       0.042086       0.060000 
      2.921009       0.073870       0.110000 
      2.951984       0.124062       0.160000 
      2.982718       0.119106       0.180000 
      3.013996       0.049686       0.120000 
      3.044237       0.002165       0.190000 
      3.075602       -0.008580       0.030000 
      3.106643       -0.008606       0.080000 
      3.138558       0.001279       0.190000 
      3.170533       0.038875       0.080000 
      3.202064       0.070269       0.180000 
      3.233839       0.038875       0.210000 
      3.265000       0.001292       0.070000 
      3.295797       -0.008163       0.150000 
      3.326922       -0.003194       0.000000 
      3.357256       0.025933       0.000000 
      3.388006       0.084625       0.100000 
      3.418935       0.124519       0.150000 
      3.450293       0.114234       0.050000 
      3.481511       0.096336       0.040000 
      3.528669       0.097195       0.290000 
      3.560680       0.125033       0.010000 
      3.592060       0.172954       0.190000 
      3.623120       0.165769       0.120000 
      3.654345       0.091410       0.140000 
      3.685607       0.090967       0.060000 
      3.716290       0.159914       0.110000 
      3.747897       0.142914       0.190000 
      3.778810       0.055542       0.140000 
      3.809689       0.008894       0.220000 
      3.841604       0.026402       0.130000 
      3.873519       0.078796       0.370000 
      3.905434       0.094466       0.070000 
      3.936349       0.044287       0.080000 
      3.967299       0.002205       0.160000 
      3.999212       -0.001891       0.060000 
      4.031125       0.030902       0.120000 
      4.063041       0.102980       0.140000 
      4.094953       0.134817       0.100000 
      4.126870       0.074313       0.140000 
      4.158783       0.036731       0.150000 
      4.190697       0.056371       0.200000 
      4.222612       0.060454       0.140000 
      4.253088       0.049673       0.090000 
      4.284011       0.060414       0.030000 
      4.314738       0.055028       0.160000 
      4.345857       0.020104       0.010000 
      4.377122       -0.003234       0.070000 
      4.407923       -0.003664       0.190000 
      4.438948       0.014705       0.130000 
      4.469883       0.030831       0.240000 
      4.501951       0.020520       0.260000 
      4.533355       0.025476       0.260000 
      4.565183       0.055015       0.190000 
      4.596868       0.054599       0.120000 
      4.628921       0.020533       0.190000 
      4.659796       0.002179       0.150000 
      4.690327       0.020990       0.110000 
      4.722070       0.060428       0.020000 
      4.752515       0.084168       0.150000 
      4.784212       0.084168       0.090000 
      4.815166       0.060454       0.040000 
      4.847280       0.021863       0.210000 
      4.877646       0.012534       0.230000 
      4.908975       0.063528       0.030000 
      4.939993       0.110177       0.010000 
      4.971784       0.063085       0.140000 
      5.002492       0.007148       0.160000 
      5.033935       -0.001905       0.180000 
      5.063852       0.025516       0.210000 
      5.095796       0.078769       0.010000 
      5.125687       0.094466       0.150000 
      5.157110       0.044301       0.140000 
      5.189053       0.002622       0.050000 
      5.218978       0.002622       0.090000 
      5.248893       0.044328       0.110000 
      5.280812       0.095379       0.070000 
      5.312726       0.090453       0.110000 
      5.344609       0.084668       0.050000 
      5.375556       0.124949       0.300000 
      5.406476       0.119160       0.050000 
      5.436392       0.050586       0.010000 
      5.468314       0.013433       0.060000 
      5.500295       0.046087       0.080000 
      5.531110       0.105748       0.170000 
      5.560986       0.133032       0.150000 
      5.591981       0.135760       0.010000 
      5.621955       0.120520       0.120000 
      5.669316       0.120533       0.070000 
      5.699960       0.136204       0.000000 
      5.730792       0.138445       0.020000 
      5.761132       0.130375       0.080000 
      5.792316       0.090950       0.210000 
      5.823235       0.056872       0.020000 
      5.854606       0.077082       0.100000 
      5.885351       0.128090       0.060000 
      5.916262       0.145629       0.150000 
      5.948158       0.098967       0.000000 
      5.978875       0.077068       0.100000 
      6.010262       0.085525       0.120000 
      6.041062       0.084665       0.040000 
      6.071588       0.066270       0.120000 
      6.101988       0.050573       0.160000 
      6.133975       0.065840       0.110000 
      6.165601       0.079682       0.160000 
      6.197548       0.065853       0.160000 
      6.228652       0.051003       0.160000 
      6.258601       0.071239       0.060000 
      6.289237       0.103906       0.120000 
      6.320404       0.106621       0.340000 
      6.351428       0.085568       0.020000 
      6.381902       0.120063       0.150000 
      6.413470       0.164870       0.020000 
      6.444215       0.133046       0.320000 
      6.476326       0.077082       0.070000 
      6.506770       0.051929       0.090000 
      6.538048       0.072153       0.060000 
      6.568510       0.114691       0.030000 
      6.600124       0.154558       0.160000 
      6.631021       0.159528       0.270000 
      6.661084       0.139331       0.120000 
      6.692379       0.117876       0.830000 
      6.722918       0.105279       1.160000 
      6.754901       0.141200       5.930000 
      6.785876       0.174283       23.370000 
      6.816155       0.165813       36.140000 
      6.847579       0.155085       63.480000 
      6.878626       0.180111       105.120000 
      6.909253       0.181511       141.800000 
      6.939136       0.152357       185.680000 
      6.969282       0.152371       215.100000 
      7.000938       0.116034       241.110000 
      7.032998       0.091049       262.330000 
      7.064941       0.138072       292.470000 
      7.095816       0.192818       316.770000 
      7.126409       0.274023       333.320000 
      7.157308       0.462271       350.100000 
      7.187941       0.718663       346.590000 
      7.218997       0.906093       351.820000 
      7.249868       0.978823       360.810000 
      7.280959       1.015677       289.260000 
      7.312470       1.145894       67.840000 
      7.344500       1.453824       6.550000 
      7.375019       1.829116       6.250000 
      7.407140       2.182035       5.660000 
      7.437823       2.577441       5.300000 
      7.469033       2.942045       6.830000 
      7.499593       3.311522       5.450000 
      7.531682       3.730682       6.640000 
      7.562826       4.032489       6.480000 
      7.592482       4.218192       7.160000 
      7.623562       4.329430       6.380000 
      7.653754       4.481643       6.120000 
      7.684372       4.717862       6.930000 
      7.715751       4.527068       5.970000 
      7.747835       3.148623       6.790000 
      7.778047       1.173457       5.720000 
      7.810035       0.438279       6.990000 
      7.839998       0.467706       5.920000 
      7.871274       0.067620       6.870000 
      7.902763       -0.602829       6.020000 
      7.933186       -1.033354       6.590000 
      7.964482       -1.198074       6.100000 
      7.995116       -1.194890       6.300000 
      8.027069       -1.141466       6.530000 
      8.057917       -1.102821       6.260000 
      8.089236       -1.144224       6.260000 
      8.119851       -1.294225       6.140000 
      8.150752       -1.475797       6.170000 
      8.182011       -1.538033       5.720000 
      8.213286       -1.448487       6.310000 
      8.244846       -1.317178       5.830000 
      8.276721       -1.287192       6.310000 
      8.308005       -1.344902       6.030000 
      8.338944       -1.366479       6.570000 
      8.369508       -1.322878       6.180000 
      8.400903       -1.247229       6.640000 
      8.432112       -1.202322       6.250000 
      8.463631       -1.210915       6.410000 
      8.494158       -1.148902       6.320000 
      8.526052       -1.071551       6.490000 
      8.557408       -1.089310       6.680000 
      8.588972       -1.130585       6.650000 
      8.620322       -1.092936       6.610000 
      8.652084       -1.074554       6.380000 
      8.682631       -1.096037       6.450000 
      8.713482       -1.082164       6.220000 
      8.744262       -1.060669       6.610000 
      8.776053       -1.040445       6.010000 
      8.805767       -1.044555       6.260000 
      8.836347       -1.074498       6.220000 
      8.867623       -1.079050       6.120000 
      8.898900       -1.064199       6.220000 
      8.930414       -1.066068       6.310000 
      8.960968       -1.083024       6.120000 
      8.991747       -1.100563       6.130000 
      9.022803       -1.087967       6.400000 
      9.053538       -1.084906       6.060000 
      9.085149       -1.081226       6.290000 
      9.116036       -1.079564       6.050000 
      9.146847       -1.128734       6.190000 
      9.177272       -1.164654       5.920000 
      9.209015       -1.135931       6.220000 
      9.240963       -1.106405       6.370000 
      9.272878       -1.065099       6.540000 
      9.304190       -1.049968       6.220000 
      9.335297       -1.074954       6.800000 
      9.366630       -1.079480       6.450000 
      9.397396       -1.068712       6.430000 
      9.428899       -1.079453       6.640000 
      9.459021       -1.074067       6.500000 
      9.489730       -1.039129       6.480000 
      9.520738       -1.015362       6.500000 
      9.551022       -1.010003       6.450000 
      9.581488       -1.010419       6.290000 
      9.611158       -1.020318       6.240000 
      9.642340       -1.057914       6.310000 
      9.674053       -1.089308       6.230000 
      9.704175       -1.057914       6.190000 
      9.736056       -1.020318       6.300000 
      9.767515       -1.010406       6.350000 
      9.797938       -1.009560       6.030000 
      9.829327       -1.009963       6.150000 
      9.860001       -1.014919       6.180000 
      9.891850       -1.033717       6.320000 
      9.923090       -1.049414       6.160000 
      9.954357       -1.033744       6.220000 
      9.985391       -1.015819       5.990000 
      10.031976       -1.021218       6.110000 
      10.063253       -1.063783       6.300000 
      10.094354       -1.119374       6.170000 
      10.125483       -1.128290       6.070000 
      10.156893       -1.119404       6.360000 
      10.188233       -1.128291       6.270000 
      10.218970       -1.119401       6.580000 
      10.248820       -1.064656       6.390000 
      10.294655       -1.031586       6.430000 
      10.326790       -1.059257       6.600000 
      10.357426       -1.094734       6.610000 
      10.387553       -1.082111       6.500000 
      10.417861       -1.060212       6.240000 
      10.447964       -1.034603       6.310000 
      10.478064       -1.014945       6.290000 
      10.509021       -1.009963       6.230000 
      10.540882       -1.009533       6.190000 
      10.572049       -1.009520       6.240000 
      10.603681       -1.009520       6.390000 
      10.633772       -1.009533       6.350000 
      10.663908       -1.009963       6.110000 
      10.695008       -1.014919       6.120000 
      10.726336       -1.033717       6.070000 
      10.757697       -1.049414       6.270000 
      10.788070       -1.033717       6.250000 
      10.818960       -1.014932       6.190000 
      10.850290       -1.010419       6.360000 
      10.880886       -1.015375       6.330000 
      10.912168       -1.039116       6.250000 
      10.943138       -1.073624       6.380000 
      11.005096       -1.074054       6.490000 
      11.036219       -1.044515       6.260000 
      11.067414       -1.039559       6.240000 
      11.098959       -1.049884       6.460000 
      11.130704       -1.034187       6.380000 
      11.162480       -1.020761       6.410000 
      11.193662       -1.039559       6.440000 
      11.224288       -1.073624       6.440000 
      11.256044       -1.073611       6.200000 
      11.287953       -1.039116       6.280000 
      11.318925       -1.015362       6.300000 
      11.348932       -1.009976       6.340000 
      11.379560       -1.009533       6.350000 
      11.410038       -1.009520       6.360000 
      11.441029       -1.009520       6.270000 
      11.472048       -1.009520       6.160000 
      11.502372       -1.009520       6.240000 
      11.533452       -1.009520       6.170000 
      11.564581       -1.009520       6.250000 
      11.596069       -1.009520       6.360000 
      11.627397       -1.009520       6.360000 
      11.658828       -1.009520       6.520000 
      11.690966       -1.009520       6.050000 
      11.722056       -1.009520       6.340000 
      11.753393       -1.009520       6.250000 
      11.784436       -1.009520       6.250000 
      11.815947       -1.009520       6.500000 
      11.847162       -1.009520       6.560000 
      11.879003       -1.009520       6.370000 
      11.910975       -1.009520       6.310000 
      11.942464       -1.009520       6.400000 
      11.972799       -1.009520       6.540000 
      12.004070       -1.009533       6.210000 
      12.035129       -1.009963       6.250000 
      12.067079       -1.014919       6.110000 
      12.097450       -1.033717       6.300000 
      12.128990       -1.049414       6.470000 
      12.160214       -1.033717       6.340000 
      12.190901       -1.014919       6.160000 
      12.223184       -1.009963       6.610000 
      12.253800       -1.009533       6.080000 
      12.285535       -1.009520       6.460000 
      12.317450       -1.009520       6.310000 
      12.348975       -1.009520       6.270000 
      12.380609       -1.009520       6.310000 
      12.411729       -1.009520       6.300000 
      12.442749       -1.009520       6.320000 
      12.473303       -1.009520       6.350000 
      12.505055       -1.009520       6.450000 
      12.534560       -1.009520       6.250000 
      12.565340       -1.009533       6.290000 
      12.596838       -1.009963       6.350000 
      12.628282       -1.014919       6.350000 
      12.659389       -1.033717       6.350000 
      12.690098       -1.049414       6.340000 
      12.720972       -1.033717       6.270000 
      12.751424       -1.014919       6.250000 
      12.782567       -1.009976       6.270000 
      12.813391       -1.009976       6.400000 
      12.843967       -1.014919       6.310000 
      12.874470       -1.033717       6.420000 
      12.905554       -1.049414       6.330000 
      12.936346       -1.033717       6.450000 
      12.966807       -1.014919       6.080000 
      12.997801       -1.009963       6.060000 
      13.029034       -1.009533       6.060000 
      13.060652       -1.009520       6.110000 
      13.092714       -1.009520       6.110000 
      13.123740       -1.009520       6.180000 
      13.154184       -1.009520       6.580000 
      13.185256       -1.009520       6.360000 
      13.215772       -1.009520       6.430000 
      13.247382       -1.009520       6.450000 
      13.278031       -1.009520       6.330000 
      13.309947       -1.009533       6.340000 
      13.340759       -1.009990       6.210000 
      13.371147       -1.015818       6.410000 
      13.402441       -1.044958       6.310000 
      13.433622       -1.103207       6.040000 
      13.463518       -1.137702       6.320000 
      13.494893       -1.103207       6.210000 
      13.525086       -1.044958       6.150000 
      13.555835       -1.015818       6.440000 
      13.586086       -1.009990       6.450000 
      13.617115       -1.009533       6.280000 
      13.648203       -1.009520       6.440000 
      13.679191       -1.009520       6.500000 
      13.710140       -1.009520       6.340000 
      13.740978       -1.009520       6.200000 
      13.773077       -1.009520       6.400000 
      13.803962       -1.009520       6.480000 
      13.833880       -1.009520       6.320000 
      13.864798       -1.009520       6.380000 
      13.896715       -1.009520       6.440000 
      13.928629       -1.009520       6.550000 
      13.960543       -1.009520       6.320000 
      13.990463       -1.009520       6.380000 
      14.021988       -1.009520       6.310000 
      14.053871       -1.009520       6.220000 
      14.085784       -1.009520       6.440000 
      14.117136       -1.009520       5.880000 
      14.149050       -1.009520       6.520000 
      14.178969       -1.009520       6.300000 
      14.210940       -1.009520       6.490000 
      14.241824       -1.009520       6.160000 
      14.272879       -1.009533       6.240000 
      14.304959       -1.009963       6.260000 
      14.336753       -1.014919       6.180000 
      14.368109       -1.033717       6.530000 
      14.399342       -1.049414       6.100000 
      14.431328       -1.033717       6.170000 
      14.461880       -1.014919       6.320000 
      14.493143       -1.009963       6.380000 
      14.524633       -1.009533       6.480000 
      14.554950       -1.009520       6.400000 
      14.585952       -1.009520       6.110000 
      14.616349       -1.009520       6.310000 
      14.647092       -1.009520       6.520000 
      14.677546       -1.009520       6.290000 
      14.708291       -1.009533       6.270000 
      14.739228       -1.009963       6.170000 
      14.770027       -1.014919       6.290000 
      14.800654       -1.033717       6.310000 
      14.831815       -1.049414       6.190000 
      14.862592       -1.033717       6.340000 
      14.894062       -1.014919       6.170000 
      14.924798       -1.009963       6.490000 
      14.956686       -1.009533       6.240000 
      14.987066       -1.009520       6.320000 
      15.018595       -1.009520       6.250000 
      15.048517       -1.009520       6.390000 
      15.080405       -1.009520       6.290000 
      15.112255       -1.009520       6.170000 
      15.160161       -1.009520       6.240000 
      15.192075       -1.009520       6.270000 
      15.223531       -1.009520       6.440000 
      15.255474       -1.009520       6.360000 
      15.287386       -1.009520       6.490000 
      15.318746       -1.009520       6.210000 
      15.350662       -1.009520       6.310000 
      15.382603       -1.009520       6.160000 
      15.413037       -1.009520       6.310000 
      15.442958       -1.009520       6.360000 
      15.474332       -1.009520       6.370000 
      15.505658       -1.009520       6.350000 
      15.536060       -1.009520       6.140000 
      15.566578       -1.009520       6.190000 
      15.597395       -1.009520       6.230000 
      15.627730       -1.009533       6.370000 
      15.657959       -1.009963       6.320000 
      15.689861       -1.014919       6.440000 
      15.720482       -1.033717       6.270000 
      15.750894       -1.049414       6.390000 
      15.782412       -1.033717       6.500000 
      15.812753       -1.014919       6.260000 
      15.843307       -1.009963       6.160000 
      15.874144       -1.009533       6.410000 
      15.904503       -1.009520       6.300000 
      15.936028       -1.009520       6.330000 
      15.966938       -1.009520       6.330000 
      15.997903       -1.009520       6.350000 
      16.028932       -1.009520       6.320000 
      16.060269       -1.009520       6.240000 
      16.091258       -1.009520       6.110000 
      16.122575       -1.009520       6.180000 
      16.153416       -1.009520       6.200000 
      16.184282       -1.009520       6.240000 
      16.216230       -1.009520       6.460000 
      16.247546       -1.009520       6.330000 
      16.278978       -1.009520       6.270000 
      16.310257       -1.009520       6.550000 
      16.342171       -1.009520       6.300000 
      16.373345       -1.009520       6.200000 
      16.404240       -1.009520       6.350000 
      16.435973       -1.009520       6.320000 
      16.467909       -1.009520       6.350000 
      16.498951       -1.009520       6.310000 
      16.530897       -1.009520       6.210000 
      16.561287       -1.009533       6.370000 
      16.591838       -1.009963       6.260000 
      16.623096       -1.014919       6.260000 
      16.654034       -1.033717       6.090000 
      16.684911       -1.049414       6.190000 
      16.715634       -1.033717       6.380000 
      16.745710       -1.014919       6.220000 
      16.775862       -1.009963       6.150000 
      16.807051       -1.009533       6.330000 
      16.839023       -1.009520       6.280000 
      16.870421       -1.009520       6.310000 
      16.900953       -1.009520       6.160000 
      16.947961       -1.009520       6.470000 
      16.978970       -1.009520       6.390000 
      17.010078       -1.009520       6.220000 
      17.040936       -1.009520       6.410000 
      17.072655       -1.009520       6.410000 
      17.104447       -1.009520       6.260000 
      17.135391       -1.009520       6.300000 
      17.166273       -1.009520       6.230000 
      17.197071       -1.009520       6.170000 
      17.227979       -1.009520       6.310000 
      17.260047       -1.009520       6.130000 
      17.291234       -1.009520       6.220000 
      17.321900       -1.009520       6.310000 
      17.353768       -1.009520       5.980000 
      17.384696       -1.009520       6.460000 
      17.415852       -1.009520       6.080000 
      17.446589       -1.009520       6.250000 
      17.477443       -1.009520       6.320000 
      17.508629       -1.009520       6.330000 
      17.539818       -1.009520       6.370000 
      17.571755       -1.009520       6.290000 
      17.602018       -1.009520       6.300000 
      17.633231       -1.009520       6.330000 
      17.664701       -1.009520       6.280000 
      17.695937       -1.009520       6.400000 
      17.727163       -1.009520       6.410000 
      17.757179       -1.009520       6.190000 
      17.787637       -1.009520       6.110000 
      17.818567       -1.009520       6.290000 
      17.849936       -1.009520       6.240000 
      17.881073       -1.009520       6.140000 
      17.911760       -1.009520       6.250000 
      17.941768       -1.009520       6.130000 
      17.973117       -1.009520       6.350000 
      18.004253       -1.009520       6.520000 
      18.035368       -1.009520       6.540000 
      18.065971       -1.009520       6.370000 
      18.097308       -1.009520       6.140000 
      18.129052       -1.009520       6.300000 
      18.161034       -1.009520       6.220000 
      18.191723       -1.009520       6.220000 
      18.222819       -1.009520       6.140000 
      18.254912       -1.009520       6.310000 
      18.287053       -1.009520       6.490000 
      18.317955       -1.009520       6.570000 
      18.348424       -1.009520       6.350000 
      18.379332       -1.009520       6.140000 
      18.409866       -1.009520       6.490000 
      18.441782       -1.009520       6.130000 
      18.473681       -1.009520       6.130000 
      18.503770       -1.009520       6.520000 
      18.534311       -1.009520       6.290000 
      18.565594       -1.009520       6.240000 
      18.596164       -1.009520       6.210000 
      18.628019       -1.009520       6.380000 
      18.659102       -1.009520       6.220000 
      18.689939       -1.009520       6.220000 
      18.721198       -1.009520       6.490000 
      18.752488       -1.009520       6.510000 
      18.782815       -1.009520       6.380000 
      18.814940       -1.009520       6.260000 
      18.845389       -1.009533       6.230000 
      18.876851       -1.009963       6.120000 
      18.907747       -1.014919       6.360000 
      18.938934       -1.033717       6.320000 
      18.970543       -1.049414       6.440000 
      19.017406       -1.033717       6.190000 
      19.047943       -1.014919       6.290000 
      19.078686       -1.009963       6.420000 
      19.109054       -1.009533       6.320000 
      19.140086       -1.009520       6.470000 
      19.170407       -1.009520       6.310000 
      19.200644       -1.009520       6.380000 
      19.232038       -1.009520       6.290000 
      19.263295       -1.009520       6.460000 
      19.294978       -1.009520       6.080000 
      19.325851       -1.009520       6.050000 
      19.355727       -1.009520       6.330000 
      19.387643       -1.009520       6.260000 
      19.419065       -1.009520       6.220000 
      19.449844       -1.009520       6.370000 
      19.480000       -1.009520       6.340000 
      19.510909       -1.009520       6.340000 
      19.543006       -1.009520       6.370000 
      19.574378       -1.009520       6.320000 
      19.606031       -1.009520       6.520000 
      19.637095       -1.009520       6.430000 
      19.667432       -1.009520       6.350000 
      19.697953       -1.009520       6.620000 
      19.729121       -1.009520       6.160000 
      19.759830       -1.009520       6.120000 
      19.790145       -1.009520       6.420000 
      19.820960       -1.009520       6.160000 
      19.851874       -1.009520       6.350000 
      19.883603       -1.009520       6.560000 
      19.914474       -1.009520       6.150000 
      19.945003       -1.009520       6.340000 
      19.975730       -1.009520       6.440000 
      20.006380       -1.009520       6.250000 
      20.037210       -1.009520       6.160000 
      20.067874       -1.009520       6.170000 
      20.099078       -1.009520       6.310000 
      20.130954       -1.009520       6.420000 
      20.162192       -1.009520       6.540000 
      20.193047       -1.009520       6.390000 
      20.224499       -1.009520       6.260000 
      20.255203       -1.009520       6.190000 
      20.286153       -1.009520       6.310000 
      20.317606       -1.009520       6.540000 
      20.348989       -1.009520       6.130000 
      20.380887       -1.009520       6.330000 
      20.411992       -1.009520       6.320000 
      20.443772       -1.009520       6.170000 
      20.504287       -1.009520       6.340000 
      20.534569       -1.009520       6.340000 
      20.565578       -1.009520       6.160000 
      20.596758       -1.009520       6.140000 
      20.627468       -1.009520       6.400000 
      20.658907       -1.009520       6.260000 
      20.689648       -1.009520       6.170000 
      20.720212       -1.009520       6.300000 
      20.750910       -1.009520       6.290000 
      20.781456       -1.009520       6.090000 
      20.812918       -1.009520       6.400000 
      20.844195       -1.009520       6.370000 
      20.874773       -1.009520       6.130000 
      20.906785       -1.009520       6.310000 
      20.937440       -1.009520       6.460000 
      20.967778       -1.009520       6.360000 
      20.999017       -1.009520       6.420000 
      21.029869       -1.009520       6.110000 
