

 time    ||    gripping force   ||   raspberry measurement 

      1       107.320000       -788.013600 
      1       107.350000       -780.133464 
      1       107.340000       -772.332129 
      1       107.400000       -764.608808 
      1       107.340000       -756.962720 
      2       107.410000       -749.393093 
      2       107.330000       -741.899162 
      2       107.340000       -734.480170 
      2       107.390000       -727.135369 
      3       107.390000       -719.864010 
      3       107.380000       -712.664199 
      3       107.420000       -705.432106 
      3       107.420000       -701.904784 
      4       107.280000       -658.932918 
      4       107.360000       -466.342603 
      5       107.360000       -148.795719 
      5       107.300000       43.842504 
      5       107.340000       86.834581 
      6       107.380000       90.330925 
      7       107.320000       90.415555 
      7       107.320000       90.409954 
      7       107.350000       90.411814 
      7       107.370000       90.420274 
      8       107.400000       90.459308 
      8       107.370000       90.489264 
      8       107.430000       90.459308 
      8       107.380000       90.420300 
      9       107.390000       90.412686 
      9       107.280000       90.420300 
      10       107.470000       90.459308 
      10       107.330000       90.489264 
      10       107.390000       90.459308 
      10       107.370000       90.420273 
      11       107.380000       90.411800 
      11       107.350000       90.409502 
      12       107.420000       90.410914 
      12       107.430000       90.409475 
      13       107.370000       90.410914 
      13       107.360000       90.409475 
      13       107.470000       90.410914 
      13       107.360000       90.409475 
      13       107.320000       90.410914 
      14       107.340000       90.409475 
      14       107.410000       90.410914 
      14       107.380000       90.409475 
      14       107.420000       90.410914 
      14       107.420000       90.409475 
      15       107.390000       90.410914 
      15       107.360000       90.409475 
      15       107.430000       90.410914 
      15       107.350000       90.409475 
      15       107.360000       90.410914 
      16       107.340000       90.409475 
      16       107.370000       90.410914 
      16       107.400000       90.409502 
      16       107.420000       90.411800 
      16       107.320000       90.420300 
      17       107.280000       90.460194 
      17       107.350000       90.500089 
      18       107.320000       90.508589 
      18       107.340000       90.510887 
      19       107.350000       90.509475 
      19       107.380000       90.510887 
      19       107.370000       90.508589 
      19       107.430000       90.500089 
      20       107.360000       90.460195 
      20       107.430000       90.420327 
      20       107.240000       90.412687 
      20       107.510000       90.420327 
      21       107.190000       90.460194 
      21       107.540000       90.500062 
      21       107.250000       90.507702 
      21       107.270000       90.500062 
      21       107.520000       90.460194 
      22       107.220000       90.420300 
      22       107.510000       90.411800 
      22       107.410000       90.409502 
      22       107.330000       90.410914 
      22       107.480000       90.409475 
      22       107.240000       90.410914 
      22       107.430000       90.409502 
      23       107.370000       90.411787 
      23       107.410000       90.419844 
      23       107.380000       90.454365 
      23       107.410000       90.470922 
      24       107.380000       90.449440 
      25       107.270000       90.465137 
      25       107.400000       90.489720 
      26       107.370000       90.459335 
      26       107.310000       90.420730 
      26       107.420000       90.417629 
      26       107.390000       90.438668 
      26       107.360000       90.470036 
      26       107.370000       90.454339 
      27       107.310000       90.419844 
      28       107.320000       90.411800 
      28       107.280000       90.409959 
      28       107.370000       90.416770 
      29       107.280000       90.439528 
      29       107.320000       90.480834 
      30       107.290000       90.502733 
      30       107.330000       90.499632 
      30       107.260000       90.460181 
      30       107.300000       90.420300 
      30       107.310000       90.411800 
      30       107.350000       90.409502 
      30       107.290000       90.410914 
      30       107.440000       90.409475 
      31       107.430000       90.410914 
      31       107.260000       90.409475 
      31       107.280000       90.410914 
      31       107.380000       90.409502 
      31       107.380000       90.411800 
      31       107.330000       90.420300 
      34       107.380000       90.460194 
      34       107.320000       90.500089 
      34       107.310000       90.508588 
      34       107.320000       90.510860 
      35       107.340000       90.508589 
      35       107.370000       90.500115 
      35       107.330000       90.461081 
      35       107.340000       90.431098 
      35       107.390000       90.460194 
      35       107.370000       90.489290 
      36       107.370000       90.459308 
      36       107.370000       90.420273 
      36       107.330000       90.411800 
      36       107.380000       90.409502 
      36       107.320000       90.410914 
      36       107.330000       90.409475 
      37       107.320000       90.410914 
      37       107.330000       90.409475 
      37       107.310000       90.410914 
      37       107.350000       90.409502 
      38       107.330000       90.411800 
      38       107.370000       90.420300 
      38       107.300000       90.460194 
      38       107.440000       90.500062 
      39       107.360000       90.507702 
      39       107.370000       90.500089 
      40       107.390000       90.461081 
      40       107.360000       90.431098 
      42       107.280000       90.460194 
      42       107.430000       90.489290 
      42       107.330000       90.459308 
      42       107.230000       90.420273 
      43       107.350000       90.411800 
      43       107.330000       90.409529 
      44       107.300000       90.411800 
      44       107.370000       90.420273 
      44       107.290000       90.459308 
      44       107.250000       90.489264 
      44       107.330000       90.459308 
      45       107.340000       90.420300 
      45       107.250000       90.412686 
      45       107.360000       90.420300 
      45       107.260000       90.459308 
      45       107.340000       90.489264 
      46       107.260000       90.459308 
      46       107.300000       90.420273 
      46       107.290000       90.411800 
      46       107.280000       90.409502 
      47       107.330000       90.410914 
      47       107.360000       90.409502 
      47       107.280000       90.411800 
      47       107.320000       90.420273 
      47       107.340000       90.459308 
      47       107.320000       90.489264 
      48       107.310000       90.459308 
      48       107.340000       90.420273 
      48       107.280000       90.411800 
      48       107.320000       90.409502 
      49       107.290000       90.410914 
      49       107.290000       90.409475 
      50       107.250000       90.410927 
      50       107.300000       90.409932 
      50       107.280000       90.416769 
      50       107.330000       90.439515 
      50       107.310000       90.480404 
      50       107.280000       90.497764 
      51       107.230000       90.480404 
      51       107.330000       90.439515 
      51       107.320000       90.416769 
      52       107.290000       90.409932 
      52       107.330000       90.410927 
      52       107.310000       90.409475 
      52       107.270000       90.410914 
      53       107.290000       90.409475 
      53       107.300000       90.410914 
      53       107.290000       90.409475 
      54       107.360000       90.410914 
      54       107.260000       90.409475 
      54       107.300000       90.410887 
      54       107.240000       90.408602 
      54       107.240000       90.400532 
      55       107.340000       90.365607 
      55       107.300000       90.344981 
      55       107.290000       90.358437 
      55       107.320000       90.374550 
      56       107.310000       90.434654 
      56       107.280000       90.483851 
      56       107.310000       90.458864 
      57       107.310000       90.420260 
      57       107.380000       90.411800 
      57       107.280000       90.409529 
      58       107.350000       90.411801 
      58       107.310000       90.420300 
      58       107.390000       90.460194 
      58       107.330000       90.500062 
      58       107.380000       90.507702 
      59       107.340000       90.500062 
      60       107.310000       90.460194 
      60       107.380000       90.420300 
      60       107.390000       90.411800 
      60       107.300000       90.409502 
      60       107.370000       90.410914 
      60       107.350000       90.409502 
