

 time    ||    gripping force   ||   raspberry measurement 

      0       0.050000       -795.925926 
      0       0.010000       -795.925926 
      0       3.340000       -795.925926 
      0       0.070000       -795.925926 
      0       0.280000       -795.925926 
      0       0.050000       -795.925926 
      0       0.170000       -795.925926 
      0       0.050000       -795.925926 
      0       0.090000       -795.925926 
      0       0.100000       -795.925921 
      0       0.170000       -795.924739 
      0       0.450000       -795.818344 
      1       0.130000       -792.295038 
      1       0.390000       -749.372650 
      1       0.210000       -557.010893 
      1       0.240000       -239.871008 
      1       0.260000       -47.524948 
      1       0.280000       -4.605660 
      1       2.000000       -1.084210 
      1       34.010000       -0.976416 
      1       56.510000       -0.977532 
      2       62.000000       -0.986027 
      2       61.860000       -1.025908 
      3       61.100000       -1.065359 
      3       61.030000       -1.068487 
      3       61.030000       -1.047434 
      3       60.870000       -1.015624 
      3       60.920000       -1.025962 
      3       60.780000       -1.037563 
      3       60.690000       -1.021035 
      3       60.580000       -1.060808 
      3       60.650000       -1.121700 
      3       60.490000       -1.070976 
      3       60.530000       -0.827554 
      4       60.350000       -0.427778 
      5       60.070000       -0.112234 
      5       60.130000       0.002138 
      5       60.030000       0.023319 
      5       59.960000       0.023317 
      5       59.950000       0.024797 
      5       59.900000       0.023346 
      6       59.770000       0.024354 
      6       59.860000       0.017960 
      6       59.730000       0.000600 
      6       59.910000       -0.016548 
      6       59.730000       0.000157 
      6       59.870000       0.012548 
      6       59.630000       -0.000286 
      6       59.750000       -0.021948 
      7       59.590000       -0.023597 
      7       59.730000       -0.021934 
      7       59.590000       0.000157 
      7       59.640000       0.017947 
      7       59.580000       0.024354 
      7       59.510000       0.023319 
      7       59.570000       0.023911 
      8       59.470000       0.012548 
      8       59.420000       -0.024040 
      8       59.510000       -0.061828 
      8       59.270000       -0.047794 
      8       59.510000       -0.027347 
      8       59.340000       -0.000729 
      9       59.670000       0.012534 
      9       59.720000       0.000157 
      10       59.550000       -0.016549 
      10       59.590000       0.000574 
      10       59.650000       0.017087 
      10       59.530000       0.013986 
      10       59.700000       -0.020079 
      10       59.520000       -0.035763 
      10       59.590000       -0.004369 
      11       59.620000       0.017530 
      11       59.590000       0.024341 
      11       59.570000       0.023346 
      11       59.560000       0.024797 
      11       59.530000       0.023359 
      11       59.490000       0.024797 
      12       59.500000       0.023346 
      12       59.480000       0.024341 
      12       59.450000       0.017530 
      12       59.440000       -0.004382 
      13       59.420000       -0.036206 
      13       59.400000       -0.025478 
      13       59.390000       -0.010211 
      13       59.430000       -0.022807 
      13       59.430000       -0.023623 
      13       59.360000       -0.021934 
      13       59.370000       0.000157 
      14       59.410000       0.017947 
      14       59.390000       0.024354 
      14       59.340000       0.023346 
      14       59.340000       0.024797 
      14       59.330000       0.023359 
      14       59.320000       0.024798 
      14       59.320000       0.023359 
      14       59.340000       0.024798 
      14       59.310000       0.023359 
      15       59.310000       0.024758 
      15       59.300000       0.022043 
      15       59.240000       0.009030 
      15       59.300000       -0.044263 
      16       59.310000       -0.075657 
      16       59.200000       -0.028566 
      16       59.220000       0.012131 
      17       59.270000       0.023898 
      17       59.190000       0.023332 
      17       59.240000       0.024797 
      17       59.270000       0.023346 
      17       59.220000       0.024341 
      17       59.170000       0.017530 
      17       59.240000       -0.004369 
      18       59.210000       -0.035763 
      18       59.160000       -0.020066 
      18       59.220000       0.014429 
      18       59.250000       0.022486 
      18       59.170000       0.024771 
      18       59.210000       0.023359 
      18       59.130000       0.024549 
      19       59.200000       0.022867 
      19       59.130000       0.023637 
      19       59.130000       0.017070 
      19       59.080000       -0.000287 
      19       59.180000       -0.017248 
      19       59.090000       -0.000111 
      19       59.160000       0.017076 
      19       59.180000       0.023235 
      19       59.190000       0.022004 
      20       59.150000       0.023221 
      20       59.190000       0.021565 
      20       59.160000       0.022774 
      20       59.090000       0.021122 
      20       59.080000       0.022335 
      20       59.160000       0.020687 
      21       59.120000       0.021905 
      21       59.110000       0.020262 
      21       59.090000       0.021483 
      21       59.190000       0.019844 
      21       59.080000       0.021070 
      21       59.150000       0.019435 
      22       59.090000       0.020665 
      22       59.020000       0.019034 
      22       59.020000       0.020268 
      22       59.160000       0.018641 
      22       59.050000       0.019879 
      22       59.100000       0.018256 
      22       59.110000       0.019497 
      22       59.060000       0.017878 
      23       59.100000       0.019123 
      23       59.070000       0.017508 
      23       59.080000       0.018757 
      23       58.960000       0.017146 
      23       59.000000       0.018398 
      24       59.090000       0.016790 
      24       59.040000       0.018046 
      24       59.030000       0.016442 
      24       59.000000       0.017701 
      24       59.080000       0.016100 
      24       59.020000       0.017363 
      24       59.010000       0.015766 
      25       58.980000       0.017032 
      25       58.980000       0.015438 
      25       59.050000       0.016707 
      25       59.070000       0.015116 
      26       58.980000       0.016389 
      26       59.140000       0.014801 
      26       59.070000       0.016077 
      26       59.270000       0.014492 
      27       58.960000       0.015771 
      27       59.320000       0.014190 
      28       59.170000       0.015472 
      28       59.150000       0.013893 
      28       58.980000       0.015178 
      28       59.230000       0.013602 
      28       59.050000       0.014890 
      29       59.260000       0.013318 
      29       59.140000       0.014608 
      29       59.150000       0.013038 
      29       59.150000       0.014332 
      29       59.130000       0.012765 
      29       59.250000       0.014061 
      29       59.160000       0.012496 
      30       59.110000       0.013795 
      30       59.070000       0.012233 
      30       59.060000       0.013535 
      30       59.250000       0.011976 
      30       59.270000       0.013280 
      30       59.120000       0.011723 
      30       59.400000       0.013030 
      30       59.170000       0.011476 
      31       59.310000       0.012785 
      31       59.110000       0.011233 
      31       58.900000       0.012545 
      31       59.190000       0.010982 
      31       59.010000       0.011871 
      31       59.260000       0.005408 
      32       59.190000       -0.012257 
      32       59.240000       -0.034005 
      32       59.040000       -0.035311 
      32       59.260000       -0.033312 
      32       59.060000       -0.011108 
      32       59.210000       0.006614 
      33       59.060000       0.012892 
      33       59.280000       0.011764 
      33       59.220000       0.013084 
      33       59.110000       0.011529 
      33       59.040000       0.012838 
      33       59.340000       0.011285 
      33       59.130000       0.012597 
      34       58.980000       0.011047 
      34       59.320000       0.012360 
      34       59.160000       0.010812 
      35       59.220000       0.012128 
      35       59.210000       0.010583 
      35       59.200000       0.011901 
      35       59.260000       0.010358 
      35       59.390000       0.011679 
      35       59.230000       0.010138 
      35       59.270000       0.011460 
      35       59.240000       0.009922 
      35       59.230000       0.011247 
      36       59.200000       0.009710 
      36       59.260000       0.011037 
      36       59.280000       0.009489 
      36       59.200000       0.010393 
      36       59.280000       0.003959 
      36       59.250000       -0.013267 
      36       59.230000       -0.030112 
      37       59.140000       -0.013285 
      37       59.240000       -0.001285 
      37       59.170000       -0.018059 
      37       59.190000       -0.048972 
      37       59.300000       -0.038248 
      37       59.220000       -0.026819 
      38       59.290000       -0.048231 
      38       59.210000       -0.031370 
      39       59.060000       0.003120 
      39       59.250000       0.011065 
      39       59.130000       0.013216 
      39       59.170000       0.011673 
      39       59.470000       0.012555 
      39       59.100000       0.006099 
      39       59.410000       -0.011148 
      39       59.160000       -0.028000 
      39       59.040000       -0.010756 
      40       59.120000       0.006537 
      40       59.230000       0.012802 
      40       59.250000       0.011676 
      40       59.210000       0.012996 
      40       59.380000       0.011429 
      40       59.250000       0.012313 
      40       59.380000       0.005860 
      40       59.220000       -0.011385 
      41       59.310000       -0.028235 
      41       59.170000       -0.011015 
      41       59.250000       0.005443 
      41       59.230000       0.002319 
      41       59.250000       -0.031429 
      41       59.540000       -0.046642 
      42       59.210000       -0.015095 
      42       59.310000       0.006736 
      42       59.160000       0.013412 
      42       59.330000       0.012292 
      43       59.590000       0.013606 
      43       59.520000       0.012046 
      43       59.700000       0.013350 
      43       59.440000       0.011792 
      43       59.580000       0.013098 
      44       59.810000       0.011543 
      44       59.760000       0.012852 
      44       59.570000       0.011299 
      44       59.820000       0.012610 
      45       59.750000       0.011060 
      45       59.730000       0.012374 
      45       59.740000       0.010826 
      45       59.680000       0.012115 
      45       59.800000       0.009732 
      45       59.800000       0.001645 
      45       59.580000       -0.032947 
      46       59.800000       -0.053064 
      46       59.760000       -0.040063 
      46       59.660000       -0.033522 
      46       59.680000       -0.010904 
      46       59.760000       0.006829 
      46       59.650000       0.013105 
      46       59.700000       0.011975 
      46       59.850000       0.013293 
      46       59.700000       0.011736 
      46       59.690000       0.013042 
      47       59.740000       0.011488 
      47       59.670000       0.012797 
      47       59.840000       0.011245 
      47       59.620000       0.012557 
      48       59.620000       0.011007 
      48       59.670000       0.012321 
      48       59.660000       0.010774 
      48       59.730000       0.012090 
      48       59.730000       0.010545 
      48       59.850000       0.011837 
      48       59.740000       0.009457 
      48       59.740000       0.001386 
      48       59.680000       -0.032778 
      48       59.720000       -0.047990 
      49       59.770000       -0.016430 
      49       59.790000       0.005414 
      49       59.730000       0.012103 
      49       59.700000       0.010996 
      49       59.710000       0.012324 
      49       59.790000       0.010777 
      49       59.640000       0.012093 
      49       59.630000       0.010548 
      49       59.740000       0.011866 
      50       59.580000       0.010324 
      50       59.740000       0.011644 
      50       59.640000       0.010091 
      50       59.800000       0.010988 
      50       59.560000       0.004535 
      50       59.450000       -0.013135 
      50       59.580000       -0.035287 
      50       59.890000       -0.041074 
      50       59.500000       -0.053133 
      50       59.590000       -0.032169 
      50       59.640000       0.002303 
      51       59.740000       0.005363 
      51       59.910000       -0.011038 
      51       59.780000       -0.027866 
      51       59.630000       -0.010623 
      51       59.840000       0.006656 
      51       59.640000       0.012494 
      51       59.780000       0.006465 
      51       59.670000       -0.010773 
      51       59.690000       -0.027629 
      51       59.680000       -0.010389 
      52       59.710000       0.006901 
      52       59.750000       0.013162 
      52       59.570000       0.012032 
      52       59.540000       0.013323 
      52       59.590000       0.010928 
      52       59.810000       0.002829 
      52       59.530000       -0.031775 
      52       59.760000       -0.051904 
      53       59.850000       -0.038914 
      53       59.650000       -0.032386 
      53       59.720000       -0.009779 
      53       59.630000       0.007930 
      53       59.640000       0.013769 
      53       59.670000       0.007713 
      54       59.760000       -0.009962 
      54       59.670000       -0.031746 
      54       59.700000       -0.033513 
      54       59.720000       -0.036877 
      54       59.520000       -0.038580 
      54       59.650000       -0.059652 
      54       59.660000       -0.071748 
      54       59.750000       -0.058338 
      54       59.790000       -0.036297 
      54       59.580000       -0.033876 
      54       59.960000       -0.030263 
      54       59.760000       -0.032796 
      54       59.790000       -0.029619 
      55       59.920000       -0.032158 
      55       59.690000       -0.028563 
      55       59.650000       -0.026206 
      55       59.710000       -0.004060 
      55       59.520000       0.013592 
      55       59.770000       0.019800 
      55       59.790000       0.018603 
      55       59.900000       0.019854 
      55       59.670000       0.018232 
      55       59.640000       0.019474 
      55       59.750000       0.017855 
      56       59.680000       0.019061 
      56       59.650000       0.016183 
      56       59.730000       0.003138 
      56       59.730000       -0.049653 
      56       59.630000       -0.080250 
      56       59.770000       -0.033266 
      56       59.730000       0.002038 
      56       59.670000       -0.009437 
      56       59.770000       -0.039559 
      57       59.690000       -0.023597 
      57       59.680000       0.010789 
      57       59.870000       0.018658 
      57       59.670000       0.020733 
      57       59.820000       0.019115 
      57       59.790000       0.019922 
      57       59.610000       0.013379 
      57       59.600000       -0.004406 
      57       59.730000       -0.027496 
      58       59.780000       -0.043173 
      58       59.660000       -0.092432 
      58       59.930000       -0.102141 
      58       59.750000       -0.035464 
      58       59.730000       0.010100 
      58       59.610000       0.022074 
      58       59.610000       0.021306 
      59       59.830000       0.022544 
      59       59.730000       0.020894 
      59       59.960000       0.022083 
      59       59.520000       0.019600 
      59       59.860000       0.011415 
      59       59.670000       -0.023275 
      60       59.680000       -0.043488 
      60       59.820000       -0.030583 
      60       59.840000       -0.024138 
      60       59.640000       -0.001613 
      60       59.810000       0.016027 
      60       59.800000       0.022211 
      60       59.690000       0.020990 
      60       59.990000       0.022217 
      60       59.600000       0.020571 
      60       59.710000       0.021790 
      60       59.820000       0.020147 
