

 time    ||    gripping force   ||   raspberry measurement 

      0       179.960000       -798.015789 
      0       179.970000       -798.015789 
      0       87.750000       -798.015789 
      0       20.180000       -798.015789 
      0       10.970000       -798.015789 
      0       14.010000       -798.015789 
      0       75.680000       -798.015789 
      0       207.440000       -798.015789 
      0       288.330000       -798.015789 
      0       280.870000       -798.015785 
      0       200.920000       -798.014598 
      0       121.960000       -797.907788 
      1       108.210000       -794.370761 
      1       112.290000       -751.281847 
      1       145.740000       -558.188796 
      1       204.210000       -240.002334 
      1       226.930000       -47.720011 
      1       219.950000       -6.063013 
      1       186.050000       -3.544210 
      1       151.270000       -3.494458 
      1       149.040000       -2.715513 
      1       162.540000       -1.191892 
      1       177.710000       0.666356 
      1       190.730000       1.721818 
      2       174.130000       1.203048 
      2       173.070000       -0.225532 
      2       179.980000       -1.352570 
      2       182.160000       -1.636094 
      2       179.880000       -1.218610 
      2       180.120000       -0.347595 
      3       180.250000       0.490235 
      3       180.270000       0.825545 
      3       180.220000       0.579229 
      3       180.190000       -0.047207 
      4       180.150000       -0.597769 
      4       180.210000       -0.676771 
      4       180.380000       -0.362704 
      4       180.410000       -0.087689 
      5       180.280000       -0.031579 
      5       180.350000       -0.056714 
      5       180.280000       -0.064208 
      5       180.270000       -0.066478 
      5       180.280000       -0.065066 
      6       180.250000       -0.066504 
      6       180.240000       -0.065066 
      6       180.240000       -0.066504 
      6       180.180000       -0.065066 
      6       180.280000       -0.066504 
      6       180.230000       -0.065066 
      6       180.230000       -0.066478 
      6       180.170000       -0.064180 
      6       180.180000       -0.055706 
      7       180.210000       -0.016672 
      7       180.150000       0.013271 
      7       180.190000       -0.017115 
      7       180.060000       -0.061079 
      7       180.120000       -0.087490 
      7       180.090000       -0.095574 
      7       180.160000       -0.040869 
      7       180.130000       0.007885 
      8       180.100000       -0.017115 
      8       180.150000       -0.055720 
      8       180.090000       -0.064180 
      8       180.050000       -0.066478 
      9       180.070000       -0.065066 
      9       180.020000       -0.066504 
      9       180.090000       -0.065066 
      9       180.010000       -0.066504 
      9       180.010000       -0.065066 
      9       180.020000       -0.066518 
      9       180.020000       -0.065522 
      10       179.980000       -0.072333 
      10       180.020000       -0.094232 
      10       179.960000       -0.125627 
      11       179.990000       -0.109929 
      11       179.980000       -0.075434 
      11       179.950000       -0.067378 
      12       179.940000       -0.065093 
      12       179.950000       -0.066505 
      12       179.910000       -0.065066 
      12       180.030000       -0.066504 
      12       180.000000       -0.065066 
      12       179.970000       -0.066504 
      13       180.350000       -0.065066 
      14       180.300000       -0.066504 
      14       180.330000       -0.065066 
      14       180.330000       -0.066504 
      15       180.300000       -0.065066 
      15       180.270000       -0.066504 
      15       180.340000       -0.065066 
      15       180.280000       -0.066504 
      16       180.280000       -0.065066 
      16       180.230000       -0.066504 
      16       180.240000       -0.065066 
      16       180.310000       -0.066504 
      16       180.280000       -0.065066 
      16       180.320000       -0.066478 
      17       180.270000       -0.064180 
      17       180.220000       -0.055706 
      17       180.260000       -0.016672 
      17       180.260000       0.013311 
      18       179.840000       -0.015786 
      19       179.810000       -0.044908 
      19       179.820000       -0.015786 
      19       179.820000       0.013311 
      19       179.810000       -0.016672 
      19       179.760000       -0.055706 
      19       179.810000       -0.064180 
      19       179.820000       -0.066478 
      20       179.740000       -0.065066 
      20       179.750000       -0.066504 
      20       180.130000       -0.065066 
      20       180.040000       -0.066504 
      20       179.830000       -0.065066 
      21       179.640000       -0.066504 
      21       180.130000       -0.065066 
      21       180.100000       -0.066504 
      21       180.090000       -0.064415 
      21       180.040000       -0.065195 
      22       179.690000       -0.063119 
      22       179.950000       -0.063912 
      22       180.090000       -0.061849 
      22       180.030000       -0.062654 
      22       179.840000       -0.060604 
      22       179.740000       -0.061422 
      22       180.070000       -0.059384 
      22       179.830000       -0.060214 
      23       180.110000       -0.058188 
      23       179.800000       -0.059030 
      23       179.710000       -0.057015 
      23       179.660000       -0.057869 
      23       180.060000       -0.055867 
      23       179.970000       -0.056732 
      23       179.910000       -0.054741 
      23       179.880000       -0.055617 
      24       179.850000       -0.053637 
      24       179.850000       -0.054525 
      24       179.880000       -0.052555 
      24       179.870000       -0.053454 
      24       179.870000       -0.051495 
      25       179.810000       -0.052404 
      25       180.020000       -0.050457 
      26       180.130000       -0.051389 
      26       180.170000       -0.049890 
      26       180.150000       -0.056134 
      26       180.140000       -0.077252 
      27       180.100000       -0.107560 
      27       180.090000       -0.090944 
      27       180.110000       -0.055885 
      27       180.140000       -0.047350 
      27       180.070000       -0.044614 
      27       180.120000       -0.045566 
      28       180.110000       -0.043686 
      28       180.120000       -0.044686 
      28       180.100000       -0.043241 
      29       180.180000       -0.049139 
      29       180.110000       -0.065834 
      29       180.120000       -0.082139 
      29       180.080000       -0.064354 
      29       180.100000       -0.046524 
      29       180.090000       -0.039729 
      29       180.110000       -0.040330 
      30       180.110000       -0.038489 
      30       180.120000       -0.039528 
      30       180.100000       -0.037709 
      30       180.100000       -0.038756 
      30       180.100000       -0.036945 
      30       180.150000       -0.037999 
      30       180.120000       -0.036195 
      30       180.060000       -0.037257 
      31       180.070000       -0.035461 
      31       180.110000       -0.036530 
      31       180.110000       -0.034740 
      31       180.060000       -0.035791 
      31       180.050000       -0.033158 
      31       180.140000       -0.024438 
      32       180.040000       0.014451 
      32       180.120000       0.043963 
      32       180.080000       0.013867 
      32       180.070000       -0.024889 
      33       180.010000       -0.032178 
      33       180.020000       -0.024319 
      33       180.050000       0.014542 
      33       180.030000       0.044053 
      33       180.070000       0.013956 
      33       180.010000       -0.024828 
      33       180.030000       -0.032968 
      33       180.020000       -0.034913 
      34       180.030000       -0.033166 
      34       180.060000       -0.034259 
      35       180.010000       -0.032492 
      35       179.930000       -0.033592 
      35       180.060000       -0.031832 
      35       179.980000       -0.032937 
      35       180.040000       -0.031184 
      35       179.990000       -0.032296 
      35       180.010000       -0.030549 
      35       179.980000       -0.031668 
      36       179.990000       -0.029927 
      36       180.000000       -0.031052 
      36       180.010000       -0.029317 
      37       179.980000       -0.030448 
      37       180.050000       -0.028720 
      37       180.000000       -0.029870 
      37       179.900000       -0.028572 
      37       179.980000       -0.034617 
      37       180.020000       -0.051457 
      38       180.070000       -0.067906 
      38       180.030000       -0.050263 
      39       179.970000       -0.032575 
      39       179.950000       -0.025945 
      39       179.990000       -0.027522 
      39       179.980000       -0.035210 
      40       179.910000       -0.069008 
      40       179.920000       -0.083858 
      40       179.960000       -0.051939 
      40       179.960000       -0.029740 
      40       180.010000       -0.022699 
      40       179.970000       -0.023458 
      41       179.940000       -0.021786 
      41       179.910000       -0.023005 
      41       179.950000       -0.021777 
      41       179.960000       -0.027889 
      42       179.920000       -0.044796 
      42       180.010000       -0.061313 
      43       179.890000       -0.043735 
      43       179.910000       -0.026112 
      43       179.940000       -0.019521 
      43       179.940000       -0.020324 
      43       179.870000       -0.018684 
      43       179.980000       -0.019921 
      43       179.910000       -0.018297 
      43       179.930000       -0.019538 
      43       179.900000       -0.017919 
      43       179.950000       -0.019164 
      44       179.870000       -0.017548 
      44       179.940000       -0.018797 
      46       179.860000       -0.017185 
      46       179.890000       -0.018437 
      46       179.960000       -0.016828 
      46       179.870000       -0.018084 
      46       179.900000       -0.016479 
      46       179.860000       -0.017739 
      46       179.890000       -0.016137 
      46       179.890000       -0.017400 
      47       179.910000       -0.015802 
      47       179.890000       -0.017068 
      47       179.880000       -0.015473 
      47       179.860000       -0.016743 
      47       179.840000       -0.015177 
      47       179.870000       -0.017301 
      48       179.850000       -0.025516 
      48       179.870000       -0.063905 
      49       179.870000       -0.092923 
      49       180.010000       -0.062337 
      49       179.950000       -0.023070 
      49       179.900000       -0.014450 
      50       179.960000       -0.012031 
      50       180.250000       -0.013308 
      50       180.270000       -0.011750 
      50       180.220000       -0.013031 
      50       180.130000       -0.010625 
      50       180.130000       -0.002130 
      51       180.080000       0.036535 
      51       180.080000       0.065826 
      51       180.030000       0.035511 
      52       180.020000       -0.003488 
      52       180.030000       -0.011842 
      52       180.020000       -0.013998 
      52       180.080000       -0.012461 
      52       180.100000       -0.013760 
      52       180.070000       -0.012199 
      52       180.080000       -0.013501 
      52       180.080000       -0.011942 
      52       180.090000       -0.013246 
      53       180.060000       -0.011690 
      53       180.060000       -0.012997 
      53       180.100000       -0.011443 
      53       180.060000       -0.012752 
      54       180.050000       -0.011201 
      54       180.000000       -0.012513 
      54       180.020000       -0.010964 
      54       180.010000       -0.012278 
      55       180.020000       -0.010731 
      55       180.050000       -0.012048 
      55       180.020000       -0.010504 
      55       180.110000       -0.011823 
      55       180.010000       -0.010280 
      55       180.050000       -0.011602 
      55       180.020000       -0.010062 
      55       180.030000       -0.011385 
      56       180.000000       -0.009847 
      56       180.010000       -0.011173 
      56       180.000000       -0.009637 
      56       180.000000       -0.010964 
      56       180.030000       -0.009431 
      56       180.020000       -0.010761 
      56       179.980000       -0.009229 
      57       180.020000       -0.010561 
      57       180.030000       -0.009031 
      57       180.010000       -0.010365 
      57       180.040000       -0.008837 
      58       180.050000       -0.010173 
      58       179.990000       -0.008647 
      58       179.980000       -0.009998 
      58       179.980000       -0.008899 
      58       180.030000       -0.015141 
      59       180.040000       -0.032175 
      59       179.980000       -0.048818 
      59       180.030000       -0.031365 
      59       180.000000       -0.013866 
      59       180.050000       -0.007397 
      59       180.010000       -0.008334 
      60       179.990000       -0.007240 
      60       180.030000       -0.013511 
      60       180.020000       -0.031000 
      60       179.990000       -0.052960 
      60       180.010000       -0.058131 
      60       180.010000       -0.064701 
      60       179.960000       -0.020504 
      61       179.960000       0.043933 
