

 time    ||    gripping force   ||   raspberry measurement 

      0       0.050000       -794.043478 
      0       0.010000       -794.043478 
      0       0.000000       -794.043478 
      0       0.200000       -794.043478 
      0       0.120000       -794.043478 
      0       0.090000       -794.043478 
      0       0.130000       -794.043478 
      0       0.100000       -794.043478 
      0       0.060000       -794.043478 
      0       0.220000       -794.043473 
      0       0.070000       -794.042295 
      0       0.210000       -793.936248 
      0       0.210000       -790.424439 
      0       0.110000       -747.641593 
      0       0.150000       -555.899894 
      1       0.160000       -239.769105 
      1       0.120000       -48.052100 
      1       0.020000       -5.301465 
      1       0.170000       -1.716178 
      1       0.010000       -1.517377 
      1       0.030000       -1.565519 
      1       0.070000       -1.674754 
      1       0.000000       -1.662727 
      1       0.060000       -1.552461 
      1       0.110000       -1.536804 
      1       0.040000       -1.579338 
      1       0.150000       -1.591426 
      1       0.080000       -1.592837 
      1       0.180000       -1.576987 
      1       0.220000       -1.526572 
      2       0.180000       -1.492353 
      2       0.270000       -1.544029 
      2       0.380000       -1.601321 
      2       0.350000       -1.688741 
      2       0.230000       -1.757774 
      2       0.200000       -1.782814 
      2       0.270000       -1.770854 
      2       0.350000       -1.681072 
      2       0.340000       -1.643696 
      2       0.530000       -1.674358 
      3       2.160000       -1.750781 
      3       7.920000       -1.840638 
      3       17.010000       -1.920521 
      3       41.640000       -1.907815 
      3       51.780000       -1.775255 
      3       60.230000       -1.568531 
      3       67.010000       -1.366924 
      3       81.600000       -1.241343 
      3       103.690000       -1.202360 
      3       121.070000       -1.204937 
      3       129.340000       -1.253426 
      4       126.600000       -1.321837 
      4       126.210000       -1.333590 
      4       122.750000       -1.304825 
      4       119.190000       -1.298017 
      4       111.860000       -1.217310 
      5       110.880000       -1.031636 
      5       110.320000       -0.720563 
      5       107.340000       -0.338521 
      5       105.080000       -0.096924 
      5       104.030000       0.077389 
      5       103.850000       0.386639 
      5       103.640000       0.883477 
      5       101.580000       1.384555 
      5       99.380000       1.728008 
      5       97.330000       1.876017 
      5       94.800000       1.903427 
      6       93.890000       1.905821 
      6       85.680000       1.888722 
      6       84.140000       1.823788 
      7       78.040000       1.735473 
      7       77.680000       1.726500 
      7       73.050000       1.702635 
      8       69.560000       1.604507 
      8       68.430000       1.560085 
      8       68.100000       1.509318 
      8       68.000000       1.326500 
      8       67.960000       1.128844 
      8       68.060000       1.070037 
      8       68.020000       1.067765 
      8       67.900000       1.034128 
      8       59.230000       1.002250 
      8       59.800000       0.956982 
      9       60.010000       0.916618 
      9       60.010000       0.907179 
      9       60.080000       0.892805 
      9       60.090000       0.831359 
      9       60.190000       0.697860 
      9       60.220000       0.613492 
      9       60.260000       0.634184 
      9       60.290000       0.655982 
      9       60.290000       0.609003 
      9       60.360000       0.490556 
      9       60.330000       0.471366 
      10       60.370000       0.479239 
      10       60.300000       0.338569 
      10       60.460000       0.138685 
      10       60.350000       0.030573 
      10       60.450000       0.014498 
      10       60.370000       0.030059 
      10       60.440000       0.047167 
      10       60.370000       0.030917 
      10       60.530000       0.024316 
      10       60.420000       0.065012 
      10       60.470000       0.130472 
      11       60.540000       0.114762 
      11       60.510000       0.045811 
      11       60.450000       0.015290 
      11       60.510000       0.022487 
      11       60.400000       0.079864 
      11       60.460000       0.125933 
      11       60.430000       0.085235 
      11       60.560000       0.046201 
      12       60.490000       0.048469 
      12       60.470000       0.030044 
      12       60.450000       0.012618 
      12       60.510000       0.005377 
      12       60.490000       -0.003110 
      12       60.500000       -0.037605 
      12       60.520000       -0.052859 
      12       60.550000       -0.016092 
      12       60.450000       0.029144 
      12       60.510000       0.065911 
      13       60.440000       0.050657 
      13       60.440000       0.016202 
      13       60.430000       0.008992 
      13       60.500000       0.016215 
      13       60.450000       0.051127 
      13       60.430000       0.072196 
      13       60.430000       0.064139 
      13       60.360000       0.072196 
      14       60.330000       0.051127 
      14       60.320000       0.016189 
      14       60.250000       0.008118 
      14       60.240000       0.005833 
      14       60.240000       0.007246 
      14       60.250000       0.005834 
      14       60.220000       0.008051 
      14       60.230000       0.016385 
      15       60.220000       0.055716 
      15       60.170000       0.094628 
      15       60.200000       0.101272 
      15       60.160000       0.093547 
      16       60.170000       0.062955 
      16       60.140000       0.060050 
      16       60.220000       0.082128 
      16       60.140000       0.048390 
      16       60.090000       0.017403 
      16       60.170000       0.029096 
      16       60.150000       0.059034 
      16       60.110000       0.042878 
      16       60.150000       0.008324 
      17       60.110000       0.001103 
      17       60.140000       0.008230 
      17       60.120000       0.042272 
      17       60.110000       0.057389 
      17       60.090000       0.025761 
      17       60.070000       0.004675 
      17       60.120000       0.007698 
      17       60.110000       0.045826 
      17       60.140000       0.075011 
      17       60.140000       0.044605 
      18       60.150000       0.005515 
      18       60.070000       -0.002929 
      18       60.130000       -0.005175 
      18       60.090000       -0.003725 
      18       60.120000       -0.005086 
      18       60.100000       -0.002773 
      18       60.150000       0.005231 
      18       60.120000       0.039329 
      18       60.140000       0.054476 
      18       60.090000       0.022850 
      19       60.080000       0.000942 
      19       60.070000       -0.005784 
      19       60.100000       -0.003889 
      19       60.090000       0.004525 
      19       60.050000       0.043124 
      19       60.060000       0.072349 
      19       60.080000       0.041982 
      19       60.030000       0.003344 
      19       60.130000       -0.000172 
      19       60.090000       0.016165 
      19       60.140000       0.032941 
      19       60.030000       0.015647 
      20       60.140000       -0.001695 
      20       60.040000       -0.008009 
      20       60.110000       -0.006930 
      20       60.090000       -0.008298 
      20       60.130000       -0.006791 
      20       60.100000       -0.008147 
      20       60.080000       -0.006642 
      20       60.150000       -0.007999 
      21       60.070000       -0.006495 
      21       60.060000       -0.007854 
      21       60.080000       -0.006352 
      21       60.080000       -0.007712 
      21       60.130000       -0.006211 
      21       60.020000       -0.007573 
      21       60.070000       -0.006060 
      21       60.040000       -0.006985 
      21       60.060000       -0.000185 
      21       60.080000       0.021058 
      22       60.050000       0.046609 
      22       60.080000       0.007499 
      22       60.090000       -0.056383 
      22       60.070000       -0.049679 
      22       60.090000       -0.015870 
      22       60.070000       -0.007761 
      22       60.100000       -0.005422 
      22       60.000000       -0.006739 
      22       60.060000       -0.004410 
      23       60.070000       0.003611 
      23       60.080000       0.037725 
      23       60.070000       0.052888 
      23       60.040000       0.021278 
      23       60.010000       -0.000614 
      23       60.060000       -0.007351 
      24       60.020000       -0.006279 
      24       59.980000       -0.007228 
      24       60.030000       -0.000812 
      24       60.040000       0.016808 
      24       60.040000       0.038510 
      24       60.050000       0.039771 
      24       60.020000       0.037727 
      25       60.030000       0.015480 
      25       59.970000       -0.002287 
      25       60.040000       -0.008607 
      25       60.010000       -0.007523 
      25       60.030000       -0.008885 
      25       60.120000       -0.007372 
      25       60.010000       -0.008722 
      25       59.970000       -0.007211 
      26       60.010000       -0.008537 
      26       60.000000       -0.006189 
      26       60.050000       0.001849 
      26       60.000000       0.035981 
      26       60.040000       0.051174 
      26       60.030000       0.020008 
      26       60.010000       0.003047 
      27       60.050000       0.015309 
      27       59.990000       0.036588 
      27       60.070000       0.037855 
      27       60.000000       0.035830 
      28       59.970000       0.013602 
      28       60.010000       -0.004146 
      28       60.040000       -0.010448 
      28       60.010000       -0.009345 
      29       60.030000       -0.010689 
      29       60.030000       -0.009158 
      30       60.040000       -0.010490 
      30       60.020000       -0.008961 
      30       60.040000       -0.010296 
      30       60.040000       -0.008769 
      30       59.970000       -0.010106 
      30       60.120000       -0.008607 
      30       60.020000       -0.010796 
      30       59.970000       -0.019076 
      30       60.080000       -0.057530 
      30       60.030000       -0.086637 
      31       60.060000       -0.056965 
      31       59.950000       -0.027564 
      31       60.070000       -0.056120 
      31       60.000000       -0.084364 
      31       59.970000       -0.053838 
      31       60.040000       -0.014655 
      32       60.060000       -0.006120 
      32       60.010000       -0.003784 
      32       60.070000       -0.005144 
      32       60.070000       -0.003668 
      32       60.020000       -0.005055 
      32       59.990000       -0.003581 
      32       60.050000       -0.004969 
      33       60.090000       -0.003495 
      33       59.930000       -0.004884 
      33       59.910000       -0.003412 
      33       59.960000       -0.004802 
      33       60.060000       -0.003356 
      33       59.980000       -0.005584 
      34       59.980000       -0.013505 
      34       59.970000       -0.047520 
      34       60.000000       -0.062585 
      34       59.960000       -0.030879 
      35       59.980000       -0.008890 
      35       60.030000       -0.002058 
      35       59.970000       -0.003023 
      35       59.990000       -0.001556 
      35       60.000000       -0.002964 
      35       59.990000       -0.001510 
      36       60.000000       -0.002919 
      36       60.000000       -0.001466 
      36       60.010000       -0.002875 
      36       60.000000       -0.001423 
      36       59.940000       -0.002832 
      36       60.020000       -0.001380 
      36       59.990000       -0.002804 
      37       60.000000       -0.001790 
      37       59.960000       -0.008515 
      37       60.050000       -0.030110 
      37       59.930000       -0.060889 
      38       60.000000       -0.044740 
      38       59.950000       -0.010129 
      38       60.070000       -0.001626 
      38       60.010000       0.005559 
      38       60.000000       0.022715 
      38       60.020000       0.039452 
      39       59.970000       0.022094 
      39       60.050000       0.004687 
      39       59.910000       -0.001691 
      39       60.040000       -0.000675 
      40       59.940000       -0.002105 
      40       60.000000       -0.000661 
      40       60.080000       -0.002078 
      40       60.020000       -0.000633 
      40       59.960000       -0.002051 
      40       60.040000       -0.000606 
      41       60.010000       -0.002024 
      41       60.030000       -0.000580 
      41       59.990000       -0.001998 
      41       60.020000       -0.000554 
      41       60.050000       -0.001973 
      41       59.940000       -0.000555 
      41       59.900000       -0.002812 
      42       60.000000       -0.010760 
      42       59.890000       -0.044802 
      42       59.930000       -0.059895 
      42       60.080000       -0.028215 
      42       59.860000       -0.006253 
      42       59.970000       0.000552 
      42       59.970000       -0.000439 
      42       60.010000       0.001003 
      42       59.930000       -0.000431 
      42       60.140000       0.000997 
      42       59.860000       -0.000437 
      42       60.000000       0.000992 
      43       60.040000       -0.000442 
      43       60.020000       0.000986 
      44       60.030000       -0.000448 
      44       59.970000       0.000994 
      44       59.960000       -0.000015 
      44       60.040000       0.006316 
      45       60.000000       0.023439 
      45       59.980000       0.040169 
      45       60.010000       0.022829 
      45       60.010000       0.006266 
      45       60.040000       0.009686 
      45       59.930000       0.047807 
      45       59.970000       0.076972 
      45       59.960000       0.046546 
      45       59.960000       0.007437 
      46       59.970000       -0.001026 
      46       59.900000       -0.003291 
      46       59.970000       -0.001860 
      46       59.980000       -0.003266 
      46       59.950000       -0.001809 
      46       59.950000       -0.003215 
      46       59.960000       -0.001759 
      47       59.970000       -0.003165 
      47       59.960000       -0.001697 
      47       59.930000       -0.002678 
      47       59.940000       0.003679 
      47       59.980000       0.020828 
      47       59.980000       0.037584 
      47       59.980000       0.020244 
      47       59.950000       0.002856 
      48       59.960000       -0.003503 
      48       60.000000       -0.002470 
      48       59.940000       -0.003882 
      48       59.930000       -0.002420 
      48       59.860000       -0.003819 
      48       59.910000       -0.002357 
      48       59.900000       -0.003758 
      49       59.910000       -0.002322 
      49       59.980000       -0.004574 
      49       59.930000       -0.012917 
      49       59.880000       -0.051432 
      49       59.880000       -0.080574 
      49       59.890000       -0.050112 
      49       59.870000       -0.010954 
      49       59.850000       -0.002043 
      50       59.900000       0.004720 
      50       59.980000       0.016566 
      50       59.940000       0.010261 
      50       59.940000       -0.036462 
      51       59.940000       -0.039180 
      51       59.930000       -0.009970 
      52       59.910000       -0.007226 
      52       59.890000       -0.023502 
      52       59.930000       -0.039780 
      52       59.900000       -0.017511 
      52       59.860000       0.018460 
      53       59.890000       0.040146 
      53       59.870000       0.023206 
      53       59.890000       0.005801 
      53       59.940000       -0.000587 
      53       59.930000       0.000417 
      53       59.860000       -0.001024 
      54       59.890000       0.000383 
      54       59.870000       -0.001895 
      54       59.870000       -0.010265 
      54       59.960000       -0.048806 
      54       59.870000       -0.077975 
      54       59.920000       -0.047539 
      55       59.850000       -0.008419 
      55       59.850000       0.000053 
      55       59.850000       0.002302 
      55       59.870000       0.000043 
      56       59.920000       -0.007933 
      56       59.860000       -0.042004 
      56       59.930000       -0.057124 
      56       59.780000       -0.025473 
      56       59.920000       -0.003538 
      56       59.860000       0.003240 
      56       59.810000       0.002222 
      57       59.900000       0.003637 
      57       59.850000       0.002177 
      58       59.870000       0.003553 
      58       59.810000       0.001255 
      58       59.880000       -0.006734 
      59       59.850000       -0.040816 
      59       59.840000       -0.055948 
      59       59.950000       -0.024309 
      59       59.820000       -0.002386 
      59       59.820000       0.004355 
      60       59.840000       0.002475 
      60       59.820000       -0.005926 
      60       59.900000       -0.044510 
      60       59.820000       -0.073722 
      60       59.830000       -0.043328 
      60       59.860000       -0.004251 
      60       59.910000       0.004180 
      60       59.870000       0.006387 
      61       59.780000       0.004075 
