

 time    ||    gripping force   ||   raspberry measurement 

      0       90.370000       -793.808000 
      0       90.370000       -793.808000 
      0       83.930000       -793.808000 
      0       68.370000       -793.808000 
      0       57.040000       -793.808000 
      0       33.310000       -793.808000 
      0       28.430000       -793.808000 
      0       23.670000       -793.808000 
      0       21.310000       -793.808000 
      0       19.490000       -793.807995 
      0       17.700000       -793.806815 
      0       13.750000       -793.700567 
      0       12.560000       -790.182136 
      1       10.560000       -747.319179 
      1       9.880000       -555.224960 
      1       10.580000       -238.541478 
      1       10.360000       -46.551704 
      1       14.890000       -3.900278 
      1       50.910000       -0.648567 
      1       64.320000       -0.749365 
      1       67.900000       -0.839742 
      1       71.170000       -0.855865 
      2       72.810000       -0.858674 
      2       74.430000       -0.857276 
      2       76.110000       -0.858715 
      2       76.090000       -0.857277 
      2       75.710000       -0.858715 
      2       75.720000       -0.857303 
      2       76.940000       -0.859588 
      2       76.900000       -0.867618 
      3       76.800000       -0.901253 
      3       76.730000       -0.906985 
      3       76.670000       -0.836249 
      3       76.700000       -0.762246 
      3       76.700000       -0.700839 
      3       77.880000       -0.628248 
      3       80.140000       -0.619707 
      3       81.050000       -0.648763 
      3       81.910000       -0.655087 
      3       83.080000       -0.642451 
      3       82.940000       -0.583342 
      4       82.900000       -0.522392 
      4       82.790000       -0.506682 
      4       82.700000       -0.498182 
      4       82.640000       -0.537646 
      4       82.620000       -0.589557 
      4       82.590000       -0.596798 
      4       82.610000       -0.636678 
      4       83.450000       -0.677362 
      4       83.930000       -0.629949 
      4       83.970000       -0.555907 
      4       83.880000       -0.469886 
      4       83.870000       -0.347502 
      5       83.870000       -0.277169 
      5       83.820000       -0.269445 
      5       83.800000       -0.307150 
      5       83.790000       -0.337119 
      5       83.680000       -0.308868 
      5       83.830000       -0.289201 
      5       85.640000       -0.350118 
      5       88.820000       -0.382328 
      5       90.060000       -0.272588 
      5       89.980000       -0.198225 
      5       89.900000       -0.236677 
      6       89.860000       -0.232744 
      6       89.700000       -0.233620 
      6       89.670000       -0.311596 
      6       89.660000       -0.404744 
      6       89.570000       -0.484225 
      6       89.550000       -0.464278 
      6       89.590000       -0.326477 
      6       89.520000       -0.232211 
      6       89.420000       -0.285167 
      6       89.390000       -0.269746 
      7       89.350000       -0.152500 
      7       89.350000       -0.075220 
      7       89.390000       -0.059641 
      7       89.320000       -0.051488 
      7       89.290000       -0.029549 
      7       89.300000       0.001872 
      7       89.290000       -0.012965 
      7       89.220000       -0.037548 
      7       89.240000       -0.007982 
      7       89.260000       0.022013 
      7       89.230000       0.002803 
      8       89.220000       0.011303 
      8       89.180000       0.072706 
      8       89.150000       0.081193 
      8       89.150000       0.061578 
      8       89.130000       0.087438 
      8       89.140000       0.106815 
      8       89.160000       0.088820 
      8       89.120000       0.059280 
      8       89.150000       0.006816 
      8       89.090000       0.003259 
      8       89.090000       0.032342 
      8       89.260000       0.034610 
      9       89.560000       0.013974 
      9       89.650000       -0.012465 
      9       89.580000       0.021171 
      9       89.540000       0.061451 
      9       89.530000       0.016215 
      9       89.590000       -0.031719 
      9       89.530000       -0.007539 
      9       89.540000       0.021571 
      9       89.480000       -0.003013 
      9       89.520000       -0.017421 
      10       89.560000       0.018929 
      10       90.200000       0.058767 
      10       90.120000       0.071363 
      10       90.080000       0.017074 
      10       90.090000       -0.031693 
      10       90.080000       -0.007553 
      10       90.050000       0.021114 
      10       90.040000       -0.008882 
      10       90.040000       -0.047890 
      10       90.010000       -0.055504 
      10       90.050000       -0.047890 
      11       90.000000       -0.008868 
      11       90.070000       0.021557 
      11       90.050000       -0.002153 
      11       89.980000       -0.007482 
      11       90.020000       0.057425 
      11       90.020000       0.101429 
      11       90.010000       0.094648 
      11       89.970000       0.094262 
      11       90.020000       0.095078 
      11       89.990000       0.105321 
      11       89.980000       0.074408 
      12       90.010000       0.006362 
      12       89.980000       -0.018655 
      12       90.020000       0.011787 
      12       89.950000       0.033748 
      12       89.910000       0.045060 
      12       89.960000       0.062234 
      12       89.920000       0.078602 
      12       89.950000       0.061251 
      12       89.980000       0.047521 
      12       89.950000       0.049938 
      12       89.950000       0.033677 
      12       89.930000       0.004331 
      12       89.930000       0.039028 
      13       89.930000       0.076653 
      13       89.860000       0.092438 
      13       89.890000       0.049239 
      13       89.950000       -0.010153 
      13       89.890000       0.018767 
      13       89.930000       0.077080 
      13       89.890000       0.056852 
      13       89.910000       0.030535 
      13       89.870000       0.067476 
      13       89.840000       0.069033 
      13       89.840000       0.039073 
      14       89.870000       0.031105 
      14       89.870000       0.027720 
      14       89.840000       0.019853 
      14       89.840000       -0.010002 
      14       89.840000       -0.011326 
      14       89.820000       0.021279 
      14       89.840000       0.025369 
      14       89.850000       0.025719 
      15       89.850000       0.007125 
      15       89.830000       0.010714 
      15       89.840000       0.031822 
      15       89.860000       0.059497 
      15       89.840000       0.028221 
      15       89.770000       -0.067360 
      15       89.760000       -0.079130 
      15       89.790000       -0.033130 
      15       89.780000       -0.007911 
      15       89.820000       0.047165 
      15       89.740000       0.071508 
      15       89.770000       0.007851 
      16       89.800000       -0.039217 
      16       89.830000       0.009468 
      16       89.830000       0.086635 
      16       89.790000       0.112755 
      16       89.740000       0.095305 
      16       89.760000       0.054336 
      16       89.830000       0.036594 
      16       89.760000       0.052563 
      16       89.810000       0.082679 
      16       89.760000       0.066299 
      16       89.820000       0.031472 
      16       89.780000       0.022756 
      17       89.800000       0.015360 
      17       89.820000       -0.002032 
      17       89.780000       -0.019828 
      17       89.730000       -0.012504 
      17       89.770000       -0.033290 
      17       89.780000       -0.068371 
      17       89.700000       -0.084639 
      17       89.780000       -0.113462 
      17       89.760000       -0.104763 
      17       89.750000       -0.042115 
      18       89.720000       -0.023878 
      18       89.700000       -0.009906 
      18       89.780000       0.037704 
      18       89.710000       0.043919 
      18       89.720000       0.036519 
      18       89.750000       0.048859 
      18       89.860000       0.064484 
      18       90.000000       0.041543 
      18       90.480000       0.000837 
      18       90.520000       -0.035158 
      18       90.520000       -0.019691 
      19       90.480000       0.014643 
      19       90.550000       0.022498 
      19       90.490000       0.025360 
      19       90.520000       0.032683 
      19       90.450000       0.061601 
      19       90.450000       0.057915 
      19       90.470000       0.010715 
      20       90.450000       0.004468 
      20       90.450000       0.016291 
      20       90.450000       0.021993 
      20       90.450000       0.019924 
      20       90.380000       0.011761 
      20       90.450000       -0.022506 
      20       90.490000       -0.037822 
      20       90.420000       -0.006389 
      20       90.490000       0.014517 
      20       90.500000       0.011740 
      20       90.390000       -0.021238 
      20       90.410000       -0.026740 
      20       90.470000       0.041828 
      21       90.470000       0.094144 
      21       90.430000       0.067987 
      21       90.490000       0.018438 
      21       90.520000       -0.037181 
      21       90.440000       -0.108235 
      21       90.500000       -0.115554 
      21       90.510000       -0.084304 
      21       90.480000       -0.060779 
      21       90.500000       0.002827 
      21       90.520000       0.067044 
      21       90.470000       0.041224 
      22       90.560000       -0.017401 
      22       90.500000       -0.041538 
      22       90.520000       -0.032777 
      22       90.550000       0.033767 
      22       90.520000       0.046559 
      22       90.480000       -0.006077 
      22       90.470000       -0.012333 
      22       90.490000       0.024198 
      22       90.560000       -0.002682 
      22       90.490000       -0.032325 
      22       90.510000       -0.014803 
      22       90.490000       -0.026578 
      22       90.460000       -0.042730 
      23       90.540000       -0.044113 
      23       90.470000       -0.093349 
      23       90.500000       -0.116753 
      23       90.520000       -0.051340 
      23       90.480000       0.011347 
      23       90.480000       0.024928 
      23       90.470000       0.026528 
      23       90.490000       0.014626 
      23       90.480000       -0.026647 
      23       90.480000       -0.082375 
      23       90.480000       -0.082373 
      23       90.530000       -0.036818 
      23       90.480000       0.035481 
      23       90.480000       0.041704 
      24       90.410000       -0.055832 
      24       90.490000       -0.108446 
      24       90.470000       -0.058673 
      24       90.480000       -0.033584 
      24       90.470000       -0.050635 
      24       90.440000       -0.016773 
      24       90.460000       0.013911 
      24       90.480000       0.001892 
      24       90.480000       -0.028795 
      24       90.480000       -0.018259 
      24       90.480000       -0.007030 
      24       90.440000       -0.028666 
      24       90.460000       -0.012852 
      25       90.450000       0.011653 
      25       90.450000       -0.017282 
      25       90.480000       -0.041021 
      25       90.490000       0.007681 
      25       90.440000       0.061763 
      25       90.490000       0.053156 
      25       90.490000       0.026889 
      25       90.420000       -0.012397 
      25       90.440000       -0.027813 
      25       90.460000       0.008413 
      26       90.410000       0.047780 
      26       90.430000       0.060185 
      26       90.430000       0.010345 
      26       90.460000       -0.023470 
      26       90.480000       0.007845 
      26       90.420000       0.047617 
      26       90.430000       0.068973 
      26       90.470000       0.046438 
      26       90.460000       0.005684 
      26       90.420000       -0.030798 
      26       90.460000       -0.020694 
      26       90.450000       -0.009454 
      27       90.430000       -0.031066 
      27       90.430000       -0.015215 
      27       90.420000       0.009713 
      27       90.410000       -0.015134 
      27       90.420000       -0.029698 
      27       90.390000       0.001280 
      27       90.400000       0.018067 
      27       90.460000       0.006858 
      27       90.440000       -0.000336 
      27       90.430000       0.049397 
      28       90.410000       0.083904 
      28       90.390000       0.066704 
      28       90.390000       0.082016 
      28       90.430000       0.105985 
      28       90.420000       0.080136 
      28       90.410000       0.063343 
      28       90.440000       0.078671 
      28       90.400000       0.038828 
      28       90.390000       -0.020088 
      29       90.410000       0.008918 
      29       90.370000       0.066479 
      29       90.410000       0.036570 
      29       90.370000       -0.025927 
      29       90.380000       -0.010153 
      29       90.390000       0.054311 
      29       90.380000       0.059908 
      29       90.350000       -0.035561 
      29       90.420000       -0.081787 
      29       90.350000       0.005968 
      29       90.380000       0.055573 
      29       90.370000       0.059102 
      30       90.420000       0.081893 
      30       90.370000       0.069203 
      30       90.350000       0.047626 
      30       90.400000       0.031610 
      30       90.410000       -0.016151 
      30       90.380000       -0.018647 
      30       90.360000       0.016101 
      30       90.460000       0.046569 
      30       90.390000       0.077171 
      30       90.360000       0.051510 
      30       90.360000       -0.015043 
      30       90.370000       -0.030432 
      31       90.370000       0.032841 
      31       90.410000       0.071143 
      31       90.400000       0.045095 
      31       90.420000       0.028283 
      31       90.370000       0.039043 
      31       90.390000       0.045778 
      31       90.370000       -0.004383 
      31       90.360000       -0.038490 
      31       90.370000       -0.011958 
      31       90.350000       0.008539 
      31       90.350000       0.004507 
      32       90.400000       -0.043956 
      32       90.390000       -0.114435 
      32       90.360000       -0.123512 
      32       90.380000       -0.030873 
      32       90.370000       0.061665 
      32       90.350000       0.060666 
      32       90.380000       0.027186 
      32       90.350000       0.018552 
      32       90.370000       0.011225 
      32       90.310000       -0.005262 
      32       90.370000       -0.012760 
      33       90.300000       0.037483 
      33       90.350000       0.076125 
      33       90.310000       0.066537 
      33       90.330000       0.045877 
      33       90.370000       -0.027337 
      33       90.340000       -0.067379 
      33       90.370000       0.012229 
      33       90.380000       0.083476 
      33       90.310000       0.068104 
      33       90.360000       0.048239 
      33       90.360000       0.054509 
      34       90.310000       0.031243 
      34       90.380000       -0.004918 
      34       90.410000       -0.027578 
      34       90.310000       -0.020203 
      34       90.360000       -0.036831 
      34       90.320000       -0.061789 
      34       90.350000       -0.084645 
      34       90.380000       -0.098913 
      34       90.300000       -0.007340 
      35       90.320000       0.078658 
      35       90.310000       0.062947 
      35       90.340000       0.024924 
      35       90.350000       0.015474 
      35       90.320000       0.003219 
      35       90.330000       -0.033061 
      35       90.360000       -0.070115 
      35       90.340000       -0.054668 
      35       90.300000       -0.024053 
      35       90.320000       0.040158 
      36       90.330000       0.088022 
      36       90.360000       0.052566 
      36       90.310000       -0.024674 
      36       90.320000       -0.078629 
      36       90.360000       -0.105705 
      36       90.300000       -0.122024 
      36       90.280000       -0.097670 
      36       90.320000       -0.045714 
      36       90.310000       0.038640 
      36       90.310000       0.102103 
      36       90.290000       0.113978 
      37       90.350000       0.104862 
      37       90.340000       0.054519 
      37       90.290000       -0.023580 
      37       90.370000       -0.072252 
      37       90.340000       -0.075863 
      37       90.280000       -0.057932 
      37       90.350000       -0.030150 
      37       90.330000       -0.003810 
      37       90.330000       0.039370 
      38       90.320000       0.063288 
      38       90.310000       0.069381 
      38       90.260000       0.001634 
      38       90.290000       -0.101245 
      38       90.350000       -0.108222 
      38       90.310000       -0.041115 
      39       90.300000       0.007288 
      39       90.330000       0.011109 
      39       90.260000       -0.010642 
      39       90.290000       -0.051003 
      39       90.290000       -0.068104 
      39       90.270000       -0.055144 
      39       90.330000       -0.032748 
      39       90.270000       -0.026294 
      39       90.290000       -0.013561 
      39       90.310000       -0.033845 
      39       90.270000       -0.067219 
      40       90.320000       -0.064311 
      40       90.290000       -0.024215 
      40       90.300000       0.022647 
      40       90.300000       -0.007809 
      40       90.290000       -0.050678 
      40       90.290000       -0.025820 
      40       90.320000       0.003296 
      40       90.240000       -0.020250 
      41       90.260000       -0.025337 
      41       90.260000       0.038736 
      41       90.260000       0.076568 
      41       90.320000       0.045108 
      41       90.240000       0.003942 
      41       90.290000       -0.028580 
      41       90.260000       -0.053043 
      41       90.330000       -0.075218 
      41       90.250000       -0.015402 
      41       90.270000       0.066743 
      41       90.240000       0.055043 
      41       90.290000       -0.015588 
      41       90.290000       -0.053611 
      42       90.240000       -0.014856 
      42       90.300000       0.056663 
      42       90.320000       0.082300 
      42       90.240000       0.061087 
      42       90.230000       0.076893 
      42       90.270000       0.110275 
      42       90.280000       0.116310 
      42       90.250000       0.108009 
      42       90.270000       0.072752 
      42       90.250000       0.054782 
      42       90.260000       0.065663 
      43       90.320000       0.011395 
      43       90.300000       -0.053976 
      43       90.230000       -0.030358 
      43       90.280000       0.004078 
      43       90.260000       0.006260 
      43       90.280000       -0.022621 
      43       90.270000       -0.024218 
      43       90.280000       0.003596 
      43       90.330000       -0.011159 
      43       90.310000       -0.030491 
      43       90.280000       -0.047537 
      43       90.300000       -0.031508 
      44       90.200000       -0.010334 
      44       90.210000       0.000854 
      44       90.290000       0.035027 
      44       90.250000       0.045748 
      44       90.270000       0.065737 
      44       90.260000       0.076113 
      44       90.250000       0.043021 
      44       90.240000       0.011498 
      44       90.230000       -0.028126 
      44       90.220000       -0.045100 
      45       90.240000       -0.028301 
      45       90.200000       -0.062168 
      45       90.260000       -0.101424 
      45       90.230000       -0.054748 
      45       90.260000       0.003918 
      45       90.240000       0.027013 
      45       90.240000       0.067501 
      45       90.230000       0.105935 
      46       90.270000       0.108358 
      46       90.260000       0.090062 
      46       90.260000       0.061534 
      46       90.200000       0.029999 
      46       90.240000       -0.031228 
      46       90.340000       -0.061805 
      46       90.180000       -0.024992 
      46       90.270000       0.053930 
      46       90.300000       0.089161 
      47       90.250000       0.052486 
      47       90.270000       -0.027164 
      47       90.260000       -0.068871 
      47       90.240000       -0.066566 
      47       90.210000       -0.067586 
      47       90.240000       -0.090027 
      47       90.260000       -0.057608 
      47       90.220000       -0.022443 
      47       90.250000       -0.024837 
      48       90.240000       -0.005522 
      48       90.210000       0.021158 
      48       90.220000       0.060003 
      48       90.210000       0.075369 
      48       90.220000       0.043548 
      48       90.200000       0.021433 
      48       90.210000       0.014502 
      48       90.250000       0.016194 
      48       90.190000       0.024434 
      48       90.250000       0.063684 
      49       90.260000       0.102517 
      49       90.210000       0.109068 
      49       90.240000       0.100839 
      49       90.220000       0.065268 
      49       90.200000       0.043691 
      49       90.190000       0.049076 
      49       90.240000       0.015200 
      49       90.220000       -0.067794 
      50       90.230000       -0.156848 
      50       90.250000       -0.133396 
      50       90.220000       -0.022634 
      50       90.230000       0.070425 
      50       90.230000       0.102489 
      50       90.190000       0.099285 
      50       90.270000       0.059262 
      50       90.160000       0.019214 
      50       90.200000       0.011459 
      50       90.170000       0.018908 
      51       90.150000       0.058174 
      51       90.160000       0.096649 
      51       90.150000       0.098779 
      51       90.240000       0.076949 
      51       90.240000       0.044687 
      51       90.190000       0.054435 
      51       90.230000       0.064086 
      51       90.200000       0.031952 
      51       90.220000       0.010778 
      51       90.210000       0.013327 
      52       90.230000       0.046892 
      52       90.180000       0.061525 
      52       90.170000       0.024949 
      52       90.200000       -0.014739 
      52       90.200000       -0.027036 
      52       90.180000       0.027831 
      52       90.210000       0.085619 
      52       90.220000       0.097233 
      52       90.210000       0.089122 
      52       90.210000       0.048775 
      52       90.220000       0.008819 
      52       90.160000       0.001140 
      53       90.180000       0.007828 
      53       90.240000       0.036968 
      53       90.220000       0.033541 
      53       90.210000       -0.012976 
      53       90.190000       -0.013641 
      53       90.230000       0.022317 
      53       90.180000       0.067442 
      53       90.160000       0.088434 
      53       90.190000       0.079587 
      54       90.170000       0.021124 
      54       90.190000       -0.034109 
      54       90.200000       -0.026642 
      54       90.190000       -0.010015 
      54       90.240000       -0.002760 
      54       90.190000       0.006069 
      54       90.180000       0.044240 
      54       90.220000       0.068574 
      54       90.190000       0.020473 
      54       90.190000       -0.024104 
      54       90.180000       0.020483 
      54       90.190000       0.066842 
      54       90.180000       0.031585 
      54       90.210000       -0.044183 
      55       90.200000       -0.083609 
      55       90.130000       -0.058436 
      55       90.220000       -0.032524 
      55       90.130000       -0.016234 
      55       90.170000       0.031839 
      55       90.210000       0.039961 
      55       90.180000       0.034234 
      55       90.210000       0.064559 
      55       90.170000       0.070901 
      56       90.220000       0.021079 
      56       90.190000       -0.027576 
      56       90.160000       0.011357 
      56       90.180000       0.032897 
      56       90.190000       0.030869 
      56       90.180000       0.052241 
      56       90.170000       0.025992 
      56       90.150000       -0.040345 
      56       90.190000       -0.055894 
      56       90.190000       0.003166 
      57       90.190000       0.028487 
      57       90.150000       0.010855 
      57       90.200000       0.044541 
      57       90.150000       0.079930 
      57       90.140000       0.090316 
      57       90.210000       0.087137 
      57       90.200000       0.068051 
      57       90.240000       -0.009757 
      57       90.170000       -0.084729 
      57       90.190000       -0.075345 
      58       90.130000       -0.041457 
      58       90.180000       -0.016523 
      58       90.150000       -0.019989 
      58       90.170000       0.016650 
      58       90.220000       0.051073 
      58       90.160000       0.043024 
      58       90.180000       0.042185 
      58       90.100000       0.042598 
      58       90.120000       0.054230 
      58       90.160000       0.034052 
      59       90.140000       0.008111 
      59       90.150000       0.027887 
      59       90.170000       0.024551 
      59       90.150000       -0.012502 
      59       90.170000       0.019541 
      59       90.170000       0.071707 
      59       90.160000       0.078965 
      59       90.170000       0.062187 
      59       90.160000       0.042486 
      59       90.160000       0.033617 
      59       90.230000       -0.053247 
      59       90.110000       -0.171144 
      60       90.140000       -0.161868 
      60       90.170000       -0.075163 
      60       90.170000       -0.015756 
      60       90.180000       0.017171 
      60       90.150000       0.048996 
      60       90.180000       0.033844 
      60       90.110000       0.009155 
      60       90.160000       0.037882 
      60       90.130000       0.061415 
      60       90.140000       0.012508 
      61       90.150000       -0.041775 
