

 time    ||    gripping force   ||   raspberry measurement 

      0       0.140000       -795.026316 
      0       0.130000       -795.026316 
      0       0.840000       -795.026316 
      0       0.280000       -795.026316 
      0       0.110000       -795.026316 
      0       0.170000       -795.026316 
      0       0.010000       -795.026316 
      0       0.020000       -795.026316 
      1       0.070000       -787.076053 
      1       0.040000       -779.205287 
      1       0.060000       -771.412066 
      1       0.210000       -763.592747 
      1       0.310000       -760.073872 
      1       0.170000       -717.205475 
      1       0.290000       -525.085662 
      2       10.980000       -208.343859 
      2       40.080000       -16.229832 
      2       54.010000       26.673920 
      2       65.940000       30.232272 
      2       78.110000       30.347020 
      2       79.580000       30.350499 
      2       80.210000       30.349118 
      2       79.540000       30.351417 
      2       79.090000       30.359890 
      2       78.200000       30.398898 
      2       78.090000       30.427995 
      3       76.900000       30.388168 
      3       76.820000       30.312961 
      3       76.860000       30.292394 
      3       76.570000       30.431982 
      3       76.420000       30.763611 
      4       76.210000       31.167571 
      4       76.210000       31.554422 
      4       76.130000       31.935484 
      4       76.150000       32.173536 
      4       76.070000       32.239581 
      4       75.820000       32.249965 
      4       75.910000       32.249064 
      4       75.720000       32.250074 
      5       75.670000       32.243263 
      5       75.640000       32.221351 
      5       75.700000       32.189513 
      5       75.490000       32.199798 
      5       75.580000       32.209680 
      5       75.470000       32.173329 
      5       75.460000       32.137978 
      5       75.520000       32.138377 
      5       75.410000       32.180057 
      5       75.440000       32.163930 
      5       75.370000       32.114180 
      5       75.080000       32.108852 
      5       75.070000       32.133878 
      6       74.380000       32.195838 
      6       72.960000       32.237823 
      6       72.830000       32.249603 
      6       73.050000       32.248152 
      6       72.890000       32.238832 
      6       72.460000       32.189443 
      6       71.970000       32.116492 
      6       71.210000       32.090857 
      6       71.450000       32.121391 
      6       71.220000       32.143290 
      6       71.220000       32.150960 
      6       71.450000       32.159863 
      7       71.270000       32.198481 
      7       70.940000       32.223455 
      7       70.530000       32.173841 
      7       70.170000       32.109171 
      7       70.120000       32.077926 
      7       70.120000       32.052703 
      7       70.250000       32.048330 
      7       70.110000       32.039237 
      7       70.130000       32.079697 
      7       69.330000       32.123938 
      7       69.190000       32.099381 
      7       68.760000       32.070675 
      7       68.630000       32.099784 
      8       68.750000       32.127994 
      8       68.580000       32.087254 
      8       68.730000       32.001128 
      8       68.650000       31.928191 
      8       68.650000       31.939774 
      8       67.080000       32.008365 
      8       66.420000       32.037894 
      8       66.590000       32.102954 
      8       66.560000       32.157936 
      8       66.550000       32.092639 
      8       66.650000       31.995356 
      8       66.570000       31.958602 
      8       66.610000       31.960360 
      9       66.530000       31.998025 
      9       66.570000       32.017156 
      9       66.520000       31.938389 
      9       66.630000       31.815041 
      9       66.580000       31.744371 
      9       66.580000       31.735691 
      9       66.560000       31.783326 
      9       66.520000       31.850877 
      9       66.570000       31.919494 
      9       66.570000       31.893902 
      9       66.520000       31.847859 
      9       66.450000       31.857592 
      9       65.890000       31.829460 
      9       65.770000       31.813684 
      9       65.340000       31.836121 
      10       65.250000       31.810039 
      10       65.240000       31.742031 
      10       65.240000       31.645979 
      10       65.180000       31.627330 
      10       65.270000       31.684944 
      10       65.140000       31.714689 
      10       65.210000       31.709184 
      10       65.310000       31.737535 
      10       65.250000       31.797069 
      10       65.180000       31.849560 
      10       65.230000       31.823941 
      10       64.810000       31.793126 
      10       64.620000       31.799754 
      10       64.470000       31.741089 
      11       64.250000       31.666273 
      11       64.320000       31.711483 
      11       64.200000       31.793065 
      11       64.320000       31.783158 
      11       64.300000       31.726793 
      11       64.320000       31.739236 
      11       64.300000       31.801152 
      11       64.310000       31.790771 
      11       64.260000       31.750088 
      11       64.240000       31.702027 
      11       63.820000       31.676571 
      11       63.320000       31.728978 
      11       63.290000       31.788056 
      12       63.290000       31.744635 
      12       63.370000       31.678329 
      12       63.370000       31.687242 
      12       63.290000       31.670698 
      12       63.390000       31.649163 
      12       63.280000       31.696227 
      12       63.380000       31.726139 
      12       63.320000       31.689082 
      12       63.390000       31.603759 
      12       63.500000       31.537629 
      12       63.450000       31.505625 
      12       63.110000       31.513834 
      13       62.250000       31.562535 
      13       62.130000       31.648217 
      13       62.050000       31.641836 
      13       62.140000       31.540246 
      13       62.230000       31.478357 
      13       62.180000       31.512879 
      13       62.150000       31.599408 
      13       62.230000       31.682660 
      13       62.270000       31.713239 
      13       62.140000       31.691200 
      14       62.190000       31.642890 
      14       62.180000       31.574703 
      14       62.130000       31.586023 
      14       62.130000       31.625268 
      14       62.120000       31.609280 
      14       62.200000       31.607385 
      14       62.170000       31.620407 
      14       62.170000       31.549146 
      14       62.170000       31.482427 
      14       62.160000       31.512369 
      14       62.190000       31.587710 
      14       62.220000       31.622596 
      14       62.160000       31.574728 
      14       62.210000       31.520896 
      14       62.080000       31.538488 
      14       62.170000       31.598386 
      15       62.060000       31.664415 
      15       61.970000       31.679906 
      15       61.420000       31.635275 
      15       61.490000       31.534282 
      15       61.480000       31.473537 
      15       61.430000       31.481388 
      15       61.520000       31.531290 
      15       61.510000       31.590771 
      15       61.480000       31.619937 
      15       61.460000       31.559460 
      15       61.570000       31.525408 
      16       61.420000       31.567544 
      16       61.500000       31.591737 
      16       61.420000       31.597127 
      16       61.530000       31.594885 
      16       61.480000       31.647762 
      16       61.480000       31.689884 
      16       61.490000       31.626666 
      16       61.480000       31.567198 
      16       61.460000       31.551737 
      16       61.490000       31.565869 
      16       61.510000       31.610469 
      16       61.520000       31.617293 
      17       61.500000       31.528066 
      17       61.480000       31.521864 
      17       60.970000       31.576000 
      17       60.680000       31.572469 
      17       60.710000       31.561705 
      17       60.670000       31.578218 
      17       60.740000       31.602937 
      17       60.610000       31.553534 
      17       60.680000       31.446088 
      17       60.740000       31.396726 
      17       60.730000       31.422734 
      17       60.730000       31.454075 
      17       60.680000       31.498468 
      17       60.780000       31.528854 
      18       60.730000       31.498508 
      18       60.700000       31.455404 
      18       60.690000       31.438891 
      18       60.720000       31.467987 
      18       60.710000       31.549547 
      18       60.690000       31.552661 
      18       60.730000       31.489043 
      18       60.750000       31.462188 
      18       60.730000       31.468373 
      18       60.720000       31.466215 
      18       60.680000       31.432522 
      19       60.740000       31.421364 
      19       60.720000       31.400711 
      19       60.660000       31.389567 
      19       60.720000       31.422237 
      19       60.670000       31.454061 
      19       60.650000       31.498481 
      19       60.790000       31.529297 
      19       60.720000       31.503880 
      19       60.680000       31.478688 
      19       60.730000       31.467127 
      19       60.700000       31.433851 
      19       60.740000       31.436676 
      19       60.750000       31.462518 
      19       60.710000       31.461285 
      20       60.680000       31.419970 
      20       60.710000       31.439816 
      20       60.760000       31.495228 
      20       60.690000       31.480126 
      20       60.720000       31.472876 
      20       60.660000       31.525363 
      20       60.720000       31.502855 
      20       60.720000       31.426391 
      20       60.670000       31.415523 
      20       60.700000       31.463058 
      20       60.720000       31.488627 
      21       60.680000       31.547292 
      21       60.700000       31.589871 
      21       60.700000       31.526692 
      21       60.700000       31.468044 
      21       60.690000       31.461233 
      21       60.620000       31.498965 
      21       60.730000       31.528868 
      21       60.660000       31.498508 
      21       60.670000       31.455404 
      21       60.730000       31.438891 
      21       60.550000       31.467987 
      21       59.920000       31.549547 
      22       59.880000       31.552661 
      22       59.900000       31.489057 
      22       59.940000       31.462658 
      22       59.980000       31.474659 
      22       59.940000       31.501250 
      22       59.960000       31.522140 
      22       59.960000       31.541547 
      22       59.920000       31.527095 
      22       59.970000       31.520451 
      22       59.950000       31.494425 
      22       59.990000       31.454961 
      22       59.920000       31.437562 
      22       59.970000       31.452246 
      23       59.960000       31.482798 
      23       59.960000       31.462561 
      23       59.930000       31.480113 
      23       59.980000       31.505140 
      23       59.910000       31.478285 
      23       59.960000       31.461746 
      23       59.940000       31.473772 
      23       59.990000       31.491324 
      23       59.960000       31.484074 
      23       59.990000       31.503880 
      23       59.970000       31.523911 
      23       59.940000       31.474298 
      24       59.930000       31.414597 
      24       59.940000       31.403023 
      24       59.970000       31.403825 
      24       59.970000       31.425890 
      24       59.920000       31.443679 
      24       59.980000       31.450060 
      24       60.000000       31.448206 
      24       59.960000       31.440162 
      24       60.000000       31.405640 
      24       59.960000       31.389097 
      25       59.930000       31.410982 
      25       59.950000       31.399382 
      25       59.980000       31.383698 
      25       59.990000       31.392628 
      25       59.950000       31.389540 
      25       59.960000       31.429394 
      25       59.930000       31.479586 
      25       59.960000       31.466587 
      25       60.000000       31.426737 
      25       60.000000       31.390426 
      26       59.990000       31.406123 
      26       59.960000       31.445535 
      26       59.930000       31.471556 
      26       59.950000       31.480473 
      26       59.990000       31.435276 
      26       59.910000       31.419996 
      26       59.940000       31.466658 
      26       59.930000       31.486271 
      26       59.900000       31.471171 
      27       59.960000       31.433851 
      27       59.940000       31.432619 
      27       59.920000       31.454505 
      27       59.960000       31.493526 
      27       59.950000       31.509639 
      27       59.990000       31.478258 
      27       59.900000       31.456360 
      27       59.930000       31.449575 
      27       59.950000       31.451430 
      27       59.910000       31.459877 
      27       59.930000       31.498468 
      27       59.960000       31.523079 
      28       59.930000       31.470671 
      28       59.930000       31.412426 
      28       59.920000       31.464860 
      28       59.950000       31.557600 
      28       59.950000       31.528894 
      28       59.850000       31.440679 
      28       59.970000       31.459890 
      28       59.910000       31.509636 
      28       59.910000       31.448233 
      28       59.940000       31.381527 
      28       59.980000       31.402014 
      28       59.970000       31.444728 
      29       59.900000       31.467447 
      29       59.940000       31.471613 
      29       59.920000       31.458048 
      29       59.990000       31.477482 
      29       59.940000       31.498373 
      29       59.890000       31.524990 
      29       59.930000       31.537797 
      29       59.890000       31.519591 
      29       59.920000       31.473733 
      29       59.970000       31.432203 
      29       59.950000       31.410111 
      30       59.960000       31.432216 
      30       59.860000       31.474189 
      30       59.960000       31.525447 
      30       59.980000       31.567849 
      30       59.930000       31.594884 
      30       59.890000       31.590757 
      30       59.960000       31.555859 
      30       59.920000       31.466189 
      30       59.920000       31.430418 
      30       59.950000       31.481843 
      30       59.940000       31.493982 
      30       59.910000       31.488170 
      31       59.900000       31.510512 
      31       59.880000       31.493996 
      31       59.900000       31.459957 
      31       59.910000       31.458575 
      31       59.940000       31.494912 
      31       59.970000       31.587226 
      31       59.910000       31.633296 
      31       59.970000       31.557661 
      31       59.950000       31.489513 
      31       59.960000       31.463488 
      31       59.890000       31.419620 
      32       59.860000       31.435290 
      32       59.940000       31.481373 
      32       59.900000       31.482798 
      32       59.890000       31.499355 
      32       59.890000       31.510982 
      32       59.880000       31.489097 
      32       59.870000       31.505640 
      32       59.920000       31.540135 
      32       59.940000       31.547332 
      32       59.880000       31.539679 
      32       59.890000       31.499811 
      32       59.910000       31.459958 
      33       59.900000       31.452787 
      33       59.890000       31.466646 
      33       59.870000       31.539320 
      33       59.980000       31.641406 
      33       59.880000       31.644107 
      33       59.950000       31.553191 
      33       59.870000       31.529824 
      33       59.850000       31.520864 
      33       59.890000       31.432576 
      33       59.850000       31.368528 
      33       59.980000       31.362160 
      33       59.880000       31.410650 
      33       59.880000       31.488073 
      33       59.950000       31.527107 
      34       59.860000       31.488073 
      34       59.870000       31.410623 
      34       59.910000       31.361300 
      34       59.870000       31.358629 
      34       59.890000       31.395370 
      34       59.940000       31.493096 
      34       59.910000       31.563805 
      34       59.940000       31.533463 
      34       59.930000       31.513697 
      34       59.920000       31.532535 
      34       59.870000       31.508351 
      35       59.910000       31.510610 
      35       59.870000       31.540592 
      35       59.880000       31.548232 
      35       59.860000       31.550504 
      35       59.840000       31.549078 
      35       59.860000       31.550087 
      35       59.900000       31.543693 
      35       59.870000       31.526307 
      35       59.880000       31.508312 
      35       59.930000       31.515549 
      35       59.920000       31.495756 
      35       59.810000       31.476154 
      35       59.880000       31.530710 
      35       59.900000       31.608766 
      36       59.910000       31.630678 
      36       59.940000       31.591257 
      36       59.930000       31.524951 
      36       59.920000       31.529864 
      36       59.910000       31.550474 
      36       59.880000       31.502939 
      36       59.890000       31.467615 
      36       59.910000       31.480071 
      36       59.850000       31.521364 
      36       59.880000       31.553148 
      36       59.880000       31.587643 
      37       59.820000       31.579586 
      37       59.880000       31.508338 
      37       59.880000       31.463089 
      37       59.890000       31.460387 
      37       59.830000       31.494425 
      37       59.820000       31.515025 
      37       59.850000       31.501583 
      38       59.880000       31.485926 
      38       59.900000       31.431651 
      38       59.830000       31.411620 
      38       59.910000       31.495768 
      38       59.930000       31.580486 
      38       59.890000       31.611467 
      38       59.910000       31.658006 
      38       59.840000       31.649949 
      38       59.880000       31.566644 
      38       59.810000       31.521781 
      38       59.820000       31.471128 
      38       59.860000       31.419607 
      39       59.870000       31.427207 
      39       59.880000       31.443720 
      39       59.870000       31.450114 
      39       59.920000       31.449965 
      39       59.840000       31.461355 
      39       59.880000       31.498373 
      39       59.880000       31.541130 
      39       59.900000       31.546310 
      39       59.850000       31.546073 
      39       59.840000       31.517197 
      39       59.860000       31.477939 
      39       59.910000       31.445080 
      39       59.870000       31.480153 
      39       59.880000       31.523925 
      40       59.890000       31.498495 
      40       59.860000       31.459877 
      40       59.890000       31.451417 
      40       59.830000       31.449119 
      40       59.830000       31.450571 
      40       59.900000       31.450435 
      40       59.870000       31.467157 
      40       59.900000       31.526626 
      41       59.890000       31.588554 
      41       59.850000       31.531525 
      41       59.900000       31.421018 
      41       59.850000       31.363046 
      41       59.850000       31.368998 
      41       59.900000       31.437948 
      41       59.840000       31.544148 
      41       59.830000       31.558020 
      41       59.810000       31.517766 
      41       59.900000       31.516354 
      41       59.830000       31.494412 
      41       59.880000       31.458588 
      42       59.790000       31.440605 
      42       59.850000       31.400725 
      42       59.810000       31.370742 
      42       59.850000       31.400698 
      42       59.840000       31.439705 
      42       59.850000       31.447319 
      42       59.800000       31.439705 
      43       59.910000       31.400698 
      43       59.790000       31.370742 
      43       59.830000       31.400698 
      43       59.860000       31.439706 
      43       59.870000       31.447333 
      43       59.840000       31.440162 
      43       59.820000       31.406553 
      43       59.890000       31.400741 
      43       59.830000       31.468858 
      43       59.800000       31.511797 
      43       59.860000       31.444218 
      44       59.900000       31.350036 
      44       59.800000       31.333102 
      44       59.850000       31.345090 
      44       59.820000       31.361812 
      44       59.870000       31.409144 
      44       59.820000       31.489081 
      44       59.830000       31.520713 
      44       59.780000       31.470714 
      44       59.910000       31.393514 
      44       59.850000       31.379255 
      44       59.870000       31.384584 
      44       59.810000       31.423592 
      45       59.810000       31.455833 
      45       59.720000       31.432521 
      45       59.780000       31.431706 
      45       59.830000       31.444136 
      45       59.790000       31.450074 
      45       59.780000       31.448206 
      45       59.880000       31.440162 
      45       59.760000       31.405667 
      45       59.800000       31.389956 
      45       59.800000       31.420908 
      45       59.720000       31.437434 
      45       59.790000       31.420894 
      46       59.780000       31.389500 
      46       59.780000       31.399838 
      46       59.840000       31.410983 
      46       59.710000       31.388654 
      46       59.750000       31.400241 
      46       59.790000       31.415965 
      46       59.740000       31.408311 
      46       59.800000       31.425850 
      46       59.770000       31.437864 
      46       59.740000       31.420921 
      46       59.780000       31.389930 
      46       59.720000       31.404794 
      47       59.770000       31.429794 
      47       59.710000       31.404767 
      47       59.750000       31.389070 
      47       59.720000       31.410996 
      47       59.760000       31.399852 
      47       59.750000       31.389970 
      47       59.750000       31.427180 
      47       59.790000       31.472429 
      47       59.690000       31.509196 
      47       59.750000       31.493915 
      47       59.770000       31.458573 
      47       59.780000       31.440579 
      48       59.720000       31.399838 
      48       59.770000       31.359917 
      48       59.740000       31.351417 
      48       59.700000       31.349119 
      48       59.760000       31.350531 
      48       59.750000       31.349132 
      48       59.770000       31.351860 
      48       59.730000       31.365316 
      48       59.720000       31.424008 
      48       59.750000       31.479573 
      49       59.680000       31.471516 
      49       59.710000       31.445078 
      49       59.720000       31.400254 
      49       59.730000       31.359957 
      49       59.710000       31.352304 
      49       59.760000       31.359917 
      49       59.710000       31.398938 
      49       59.740000       31.429337 
      50       59.740000       31.404780 
      50       59.730000       31.389943 
      50       59.740000       31.421337 
      50       59.750000       31.442390 
      50       59.720000       31.439732 
      50       59.770000       31.406527 
      50       59.720000       31.400351 
      50       59.740000       31.465219 
      50       59.710000       31.508766 
      50       59.750000       31.496170 
      50       59.660000       31.467074 
      51       59.710000       31.414623 
      51       59.770000       31.411066 
      51       59.740000       31.440149 
      51       59.720000       31.442403 
      51       59.710000       31.421337 
      51       59.710000       31.389943 
      51       59.760000       31.404780 
      51       59.720000       31.429337 
      51       59.710000       31.398951 
      51       59.680000       31.360334 
      51       59.740000       31.356816 
      52       59.770000       31.373343 
      52       59.710000       31.391312 
      52       59.750000       31.384114 
      52       59.770000       31.405197 
      52       59.750000       31.439692 
      52       59.730000       31.442363 
      52       59.740000       31.420478 
      52       59.790000       31.380031 
      52       59.700000       31.367184 
      53       59.740000       31.397943 
      53       59.740000       31.430332 
      53       59.750000       31.397486 
      53       59.740000       31.361342 
      53       59.720000       31.350422 
      53       59.690000       31.355970 
      53       59.780000       31.373746 
      53       59.770000       31.396254 
      53       59.740000       31.402455 
      54       59.710000       31.415052 
      54       59.710000       31.394399 
      54       59.750000       31.359500 
      54       59.760000       31.352290 
      54       59.720000       31.359917 
      54       59.750000       31.398925 
      54       59.760000       31.428880 
      54       59.690000       31.398925 
      55       59.730000       31.359890 
      55       59.720000       31.351430 
      55       59.650000       31.349575 
      55       59.740000       31.356360 
      55       59.720000       31.378258 
      55       59.720000       31.409653 
      55       59.770000       31.393955 
      55       59.690000       31.359460 
      55       59.710000       31.351417 
      55       59.730000       31.349562 
      55       59.690000       31.355930 
      56       59.730000       31.373289 
      56       59.800000       31.390438 
      56       59.710000       31.373772 
      56       59.740000       31.362658 
      56       59.770000       31.389930 
      56       59.700000       31.463029 
      56       59.710000       31.492972 
      56       59.710000       31.428521 
      56       59.690000       31.365733 
      56       59.730000       31.351873 
      57       59.680000       31.349132 
      57       59.740000       31.350531 
      57       59.720000       31.349092 
      57       59.690000       31.350544 
      57       59.700000       31.349535 
      57       59.670000       31.355943 
      57       59.660000       31.373746 
      57       59.720000       31.396280 
      57       59.670000       31.403329 
      57       59.720000       31.425433 
      57       59.680000       31.438280 
      58       59.700000       31.425890 
      58       59.740000       31.409185 
      58       59.750000       31.426347 
      58       59.720000       31.444136 
      58       59.760000       31.455487 
      58       59.750000       31.473302 
      58       59.660000       31.491297 
      58       59.740000       31.483631 
      58       59.750000       31.498468 
      58       59.670000       31.499298 
      59       59.670000       31.429877 
      59       59.670000       31.376571 
      59       59.710000       31.401181 
      59       59.710000       31.440619 
      59       59.730000       31.458574 
      59       59.670000       31.493915 
      59       59.650000       31.509209 
      59       59.720000       31.472859 
      59       59.760000       31.432176 
      59       59.690000       31.410097 
      60       59.720000       31.431719 
      60       59.730000       31.467017 
      60       59.720000       31.479613 
      60       59.770000       31.429824 
      60       59.680000       31.394483 
      60       59.720000       31.411023 
      60       59.640000       31.395325 
      60       59.690000       31.375658 
      60       59.690000       31.423995 
      60       59.670000       31.468801 
