

 time    ||    gripping force   ||   raspberry measurement 

      0       119.900000       -796.939024 
      0       120.080000       -796.939024 
      0       100.080000       -796.939024 
      0       28.270000       -796.939024 
      0       9.010000       -796.939024 
      0       9.760000       -796.939024 
      0       46.190000       -796.939024 
      0       100.900000       -796.939024 
      0       169.420000       -796.939024 
      0       136.610000       -796.939020 
      0       108.230000       -796.937835 
      0       107.620000       -796.831199 
      1       106.210000       -793.299877 
      1       106.120000       -750.279177 
      1       108.030000       -557.472391 
      1       112.690000       -239.625047 
      1       120.040000       -47.114568 
      1       119.550000       -4.754733 
      1       119.490000       -1.806283 
      1       119.380000       -1.891540 
      1       119.440000       -1.669366 
      2       119.540000       -1.010082 
      2       119.510000       -0.131010 
      2       119.430000       0.356733 
      2       120.330000       0.171738 
      2       120.270000       -0.184235 
      2       120.310000       -0.332209 
      2       120.280000       -0.343746 
      3       120.260000       -0.337081 
      3       120.270000       -0.243462 
      3       120.140000       -0.088841 
      3       120.160000       -0.008180 
      3       120.210000       0.010302 
      3       120.220000       0.010220 
      3       120.100000       0.011699 
      3       120.090000       0.010261 
      4       120.090000       0.011699 
      4       120.120000       0.010287 
      4       120.130000       0.012572 
      4       120.040000       0.020629 
      4       120.000000       0.055124 
      4       120.100000       0.070821 
      5       120.040000       0.039427 
      5       120.040000       0.017528 
      5       120.050000       0.010704 
      5       120.030000       0.011256 
      5       119.990000       0.004432 
      6       120.020000       -0.017467 
      6       119.970000       -0.048861 
      6       120.000000       -0.033164 
      6       120.050000       0.001331 
      6       119.990000       0.009388 
      6       120.000000       0.011672 
      6       119.930000       0.010260 
      7       119.930000       0.011672 
      7       119.940000       0.009387 
      7       119.920000       0.001317 
      7       119.980000       -0.033607 
      7       119.950000       -0.054261 
      7       120.000000       -0.041664 
      7       119.980000       -0.035463 
      7       119.880000       -0.012954 
      7       120.120000       0.004848 
      7       119.910000       0.011256 
      7       120.010000       0.010247 
      7       119.940000       0.011699 
      7       119.920000       0.010261 
      8       119.920000       0.011699 
      8       119.900000       0.010247 
      8       119.910000       0.011243 
      8       119.830000       0.004432 
      8       119.950000       -0.017467 
      8       119.970000       -0.048861 
      9       119.940000       -0.033165 
      9       119.960000       0.001304 
      9       119.910000       0.008514 
      9       119.950000       0.001304 
      9       119.870000       -0.033165 
      9       119.910000       -0.048861 
      10       119.980000       -0.017467 
      10       119.870000       0.004418 
      10       119.950000       0.010799 
      10       119.920000       0.004835 
      10       119.960000       -0.012941 
      10       119.940000       -0.035033 
      10       119.920000       -0.036695 
      10       119.880000       -0.035033 
      11       119.930000       -0.012941 
      11       119.880000       0.004848 
      11       119.910000       0.011256 
      11       119.910000       0.010247 
      11       119.900000       0.011699 
      11       119.920000       0.010247 
      11       119.910000       0.011243 
      11       119.940000       0.004432 
      12       119.960000       -0.017467 
      12       119.970000       -0.048888 
      12       119.910000       -0.034037 
      12       119.890000       -0.009037 
      12       120.000000       -0.034037 
      12       119.920000       -0.048888 
      12       119.920000       -0.017467 
      12       119.650000       0.004432 
      13       119.670000       0.011243 
      13       120.000000       0.010247 
      13       119.990000       0.011699 
      13       120.040000       0.010261 
      13       119.930000       0.011699 
      13       119.980000       0.010261 
      13       120.000000       0.011699 
      13       120.090000       0.010261 
      13       119.760000       0.011699 
      14       119.920000       0.010261 
      14       119.830000       0.011699 
      14       119.970000       0.010247 
      14       119.820000       0.011243 
      14       119.970000       0.004387 
      14       119.890000       -0.017336 
      14       120.030000       -0.048243 
      14       119.900000       -0.032221 
      14       119.900000       0.002252 
      15       119.910000       0.010205 
      15       119.940000       0.012365 
      15       119.980000       0.010844 
      15       119.910000       0.012160 
      15       119.830000       0.010614 
      16       119.950000       0.011932 
      16       119.800000       0.010388 
      16       119.890000       0.011709 
      16       119.820000       0.010168 
      16       119.800000       0.011490 
      16       119.960000       0.009951 
      16       119.940000       0.011275 
      16       119.960000       0.009739 
      16       119.950000       0.011065 
      17       119.940000       0.009531 
      17       119.850000       0.010859 
      17       119.890000       0.009327 
      17       119.880000       0.010657 
      17       119.920000       0.009127 
      17       119.880000       0.010460 
      17       119.920000       0.008931 
      18       119.870000       0.010279 
      18       119.980000       0.009177 
      18       119.900000       0.015390 
      18       119.950000       0.031584 
      18       119.950000       0.038819 
      18       119.870000       -0.011685 
      19       119.880000       -0.050625 
      19       119.900000       -0.042555 
      19       119.870000       -0.036415 
      19       119.910000       -0.013781 
      19       119.870000       0.003968 
      19       119.890000       0.009833 
      19       119.900000       0.003418 
      19       119.890000       -0.018283 
      20       119.940000       -0.049207 
      20       119.890000       -0.034026 
      20       119.950000       -0.009348 
      20       119.850000       -0.038499 
      20       119.820000       -0.066958 
      21       119.950000       -0.037444 
      21       119.850000       -0.007825 
      21       119.890000       -0.032085 
      21       119.900000       -0.046453 
      22       119.910000       -0.014882 
      22       119.880000       0.006934 
      22       119.960000       0.013182 
      22       120.020000       0.007145 
      23       119.840000       -0.010525 
      23       119.950000       -0.032290 
      23       119.930000       -0.033613 
      23       119.850000       -0.031631 
      23       120.010000       -0.009444 
      23       119.890000       0.008262 
      23       119.960000       0.014523 
      23       119.860000       0.013366 
      23       119.900000       0.014244 
      23       119.970000       0.007771 
      23       119.900000       -0.009519 
      24       119.910000       -0.027226 
      24       119.870000       -0.019390 
      24       119.950000       -0.034736 
      24       119.990000       -0.045022 
      24       119.850000       -0.013067 
      24       120.030000       0.008744 
      24       119.860000       0.014961 
      25       119.990000       0.008507 
      25       119.810000       -0.013245 
      25       119.910000       -0.044192 
      25       119.870000       -0.028210 
      25       119.990000       0.006222 
      25       119.980000       0.014122 
      26       119.970000       0.015805 
      26       119.910000       0.008930 
      26       120.010000       -0.012839 
      26       119.920000       -0.043791 
      26       119.890000       -0.027813 
      26       119.880000       0.006616 
      26       119.910000       0.014525 
      27       119.930000       0.016616 
      27       119.960000       0.014214 
      27       120.010000       0.006096 
      27       119.940000       -0.028116 
      28       119.970000       -0.043401 
      28       119.950000       -0.012751 
      28       119.930000       -0.001168 
      28       119.880000       -0.036128 
      28       119.920000       -0.081949 
      28       119.980000       -0.050035 
      28       119.890000       0.003225 
      29       119.980000       0.016076 
      29       119.970000       0.018602 
      29       119.910000       0.017031 
      29       119.960000       0.018286 
      29       119.980000       0.016678 
      29       119.920000       0.017910 
      29       119.930000       0.015468 
      29       119.970000       0.007338 
      29       119.960000       -0.026886 
      29       119.930000       -0.042157 
      29       119.970000       -0.010655 
      30       119.890000       0.011131 
      30       119.950000       0.017763 
      30       119.940000       0.016599 
      30       119.970000       0.017844 
      30       119.940000       0.015391 
      30       119.950000       0.006848 
      31       119.960000       -0.031864 
      31       119.980000       -0.061202 
      31       119.930000       -0.030934 
      31       119.960000       0.008020 
      31       119.970000       0.016328 
      31       119.970000       0.018440 
      31       119.930000       0.016858 
      31       119.990000       0.018114 
      32       119.960000       0.016508 
      32       119.970000       0.017767 
      32       119.930000       0.016166 
      32       119.890000       0.017428 
      32       119.900000       0.015830 
      32       119.930000       0.017095 
      32       119.940000       0.015500 
      32       119.950000       0.016769 
      32       119.990000       0.015177 
      32       120.000000       0.016424 
      32       119.960000       0.013997 
      33       119.910000       0.005881 
      33       119.990000       -0.028328 
      33       119.980000       -0.043598 
      33       120.000000       -0.012507 
      33       119.920000       0.004391 
      33       119.950000       -0.007559 
      33       119.930000       -0.025273 
      34       119.990000       -0.022349 
      34       119.950000       -0.056276 
      34       119.970000       -0.081887 
      34       119.990000       -0.034022 
      34       119.930000       0.006621 
      34       119.960000       0.018204 
      34       119.950000       0.017462 
      34       119.890000       0.018738 
      34       119.930000       0.017127 
      35       119.960000       0.018380 
      35       120.020000       0.016771 
      35       119.920000       0.018002 
      35       119.910000       0.015546 
      35       119.940000       0.007002 
      35       119.940000       -0.031712 
      35       119.950000       -0.061051 
      36       119.960000       -0.030784 
      36       120.000000       0.008168 
      36       119.990000       0.016475 
      37       119.960000       0.018585 
      37       119.940000       0.017001 
      37       119.990000       0.018256 
      37       119.970000       0.016649 
      37       120.000000       0.017907 
      37       119.940000       0.016304 
      37       120.030000       0.017565 
      37       119.970000       0.015965 
      38       120.010000       0.017229 
      38       119.900000       0.015633 
      38       119.980000       0.016901 
      38       119.990000       0.015308 
      38       119.990000       0.016579 
      38       120.030000       0.014989 
      38       119.930000       0.016263 
      38       119.980000       0.014676 
      38       119.990000       0.015953 
      39       119.960000       0.014370 
      39       120.060000       0.015650 
      39       119.940000       0.014070 
      39       119.870000       0.015353 
      39       119.790000       0.013776 
      40       119.890000       0.015062 
      40       120.180000       0.013487 
      40       120.100000       0.014776 
      40       119.970000       0.013205 
      40       119.980000       0.014496 
      41       119.990000       0.012927 
      41       120.030000       0.014222 
      41       119.870000       0.012656 
      41       119.980000       0.013953 
      41       120.030000       0.012390 
      41       120.020000       0.013690 
      42       119.840000       0.012129 
      42       120.060000       0.013432 
      42       119.920000       0.011860 
      42       120.110000       0.012740 
      42       119.910000       0.006269 
      42       120.050000       -0.011405 
      43       120.080000       -0.033162 
      43       120.120000       -0.034476 
      43       119.890000       -0.032485 
      43       120.080000       -0.010290 
      43       120.210000       0.007425 
      43       119.860000       0.013694 
      44       120.050000       0.012545 
      44       119.960000       0.013418 
      44       119.960000       0.006541 
      44       119.960000       -0.015204 
      44       119.900000       -0.046132 
      44       120.000000       -0.030131 
      44       119.940000       0.004321 
      44       119.980000       0.012254 
      44       120.040000       0.014393 
      44       119.880000       0.012851 
      45       119.990000       0.014147 
      45       119.970000       0.012582 
      45       119.930000       0.013880 
      45       119.950000       0.012317 
      45       119.980000       0.013618 
      45       119.960000       0.012058 
      46       119.970000       0.013361 
      46       119.980000       0.011803 
      46       119.960000       0.013083 
      46       119.980000       0.010677 
      46       119.930000       0.002182 
      46       119.940000       -0.036484 
      46       119.910000       -0.065776 
      46       119.960000       -0.035461 
      47       119.980000       0.003537 
      47       120.010000       0.011890 
      47       119.960000       0.014020 
      47       119.890000       0.011631 
      47       119.940000       0.003126 
      47       119.990000       -0.035549 
      48       119.900000       -0.064850 
      48       119.960000       -0.034545 
      48       119.950000       0.004445 
      48       119.990000       0.012789 
      48       119.950000       0.014936 
      48       119.980000       0.013375 
      48       119.910000       0.014227 
      48       119.970000       0.007342 
      49       119.950000       -0.014411 
      49       119.950000       -0.045348 
      49       120.050000       -0.029380 
      49       119.970000       0.004200 
      49       119.990000       0.001909 
      49       119.930000       -0.037562 
      49       119.930000       -0.083781 
      49       120.020000       -0.051863 
      49       119.980000       0.001416 
      50       119.910000       0.014285 
      50       119.920000       0.016829 
      50       119.900000       0.015276 
      50       119.920000       0.016548 
      50       119.870000       0.014958 
      50       119.950000       0.016233 
      50       119.990000       0.014646 
      51       119.960000       0.015924 
      51       119.950000       0.014341 
      51       119.950000       0.015621 
      51       119.950000       0.014041 
      51       119.970000       0.015325 
      51       119.900000       0.013748 
      51       119.980000       0.015034 
      51       119.940000       0.013460 
      52       119.930000       0.014749 
      52       119.890000       0.013178 
      52       120.010000       0.014470 
      52       120.060000       0.012901 
      53       120.040000       0.014196 
      53       119.960000       0.012630 
      53       120.050000       0.013928 
      53       119.880000       0.012365 
      53       120.060000       0.013665 
      53       119.870000       0.012104 
      53       119.960000       0.013407 
      54       119.960000       0.011836 
      54       120.010000       0.012716 
      54       120.040000       0.006259 
      54       119.920000       -0.010990 
      55       120.070000       -0.027844 
      55       119.930000       -0.010602 
      55       120.020000       0.006690 
      55       120.020000       0.012954 
      55       119.960000       0.011826 
      55       120.040000       0.013145 
      55       119.910000       0.011589 
      55       120.020000       0.012897 
      55       120.070000       0.011344 
      56       119.970000       0.012655 
      56       119.950000       0.011104 
      56       119.990000       0.012417 
      56       120.010000       0.010869 
      56       120.060000       0.012185 
      56       120.080000       0.010639 
      56       119.990000       0.011956 
      56       119.800000       0.010412 
      57       120.180000       0.011706 
      57       120.090000       0.009287 
      57       120.040000       -0.000058 
      57       120.330000       -0.048927 
      57       119.980000       -0.119808 
      57       120.200000       -0.134176 
      57       120.160000       -0.065385 
      58       120.230000       -0.011971 
      58       120.180000       -0.035338 
      58       120.090000       -0.063351 
      58       120.120000       -0.033035 
      58       120.170000       0.005514 
      58       120.100000       0.008941 
      58       120.080000       -0.007483 
      59       120.140000       -0.024346 
      59       120.280000       -0.007138 
      59       120.250000       0.010119 
      59       120.100000       0.016348 
      59       120.260000       0.015186 
      60       120.280000       0.016472 
      60       120.260000       0.014883 
      60       120.150000       0.016158 
      60       120.270000       0.014573 
      60       120.270000       0.015851 
      60       120.160000       0.014268 
      60       120.150000       0.015523 
