Human trial picking the raspberry twin 

 time    ||     output compensated 

      0       -800.054545 
      0       -800.054545 
      0       -800.054545 
      0       -800.054545 
      0       -800.054545 
      0       -800.054545 
      0       -800.054545 
      0       -800.054545 
      0       -800.054545 
      0       -800.054541 
      0       -800.053351 
      0       -799.946274 
      0       -796.400365 
      0       -753.202623 
      0       -559.606815 
      0       -240.432324 
      0       -46.852214 
      0       -3.657573 
      0       -0.113519 
      0       -0.005003 
      0       -0.004822 
      0       0.001577 
      0       0.018937 
      0       0.036072 
      0       0.018937 
      0       0.001577 
      0       -0.004817 
      0       -0.003809 
      0       -0.005261 
      0       -0.003849 
      0       -0.006133 
      1       -0.014190 
      1       -0.048685 
      1       -0.064383 
      1       -0.032988 
      1       -0.011090 
      1       -0.004305 
      1       -0.006160 
      1       -0.014620 
      1       -0.053654 
      1       -0.083597 
      1       -0.053211 
      1       -0.009221 
      1       0.018050 
      1       0.036045 
      1       0.018936 
      1       0.001577 
      1       -0.004817 
      1       -0.003809 
      1       -0.005260 
      1       -0.003809 
      1       -0.004817 
      1       0.001591 
      1       0.019393 
      1       0.041901 
      1       0.048116 
      1       0.061142 
      1       0.045445 
      1       0.029318 
      1       0.036946 
      1       0.018963 
      1       0.001577 
      1       -0.004817 
      1       -0.003809 
      1       -0.005260 
      1       -0.003809 
      2       -0.004817 
      2       0.001577 
      2       0.018937 
      2       0.036072 
      2       0.018937 
      2       0.001577 
      2       -0.004817 
      2       -0.003809 
      2       -0.005274 
      2       -0.004265 
      2       -0.010659 
      2       -0.028019 
      2       -0.045154 
      2       -0.028006 
      2       -0.010216 
      2       0.001134 
      2       0.018923 
      2       0.036072 
      2       0.018937 
      2       0.001577 
      2       -0.004817 
      2       -0.003809 
      2       -0.005260 
      2       -0.003809 
      2       -0.004817 
      2       0.001577 
      2       0.018937 
      2       0.036072 
      2       0.018937 
      2       0.001577 
      2       -0.004817 
      3       -0.003835 
      3       -0.006147 
      3       -0.014620 
      3       -0.053655 
      3       -0.083610 
      3       -0.053655 
      3       -0.014620 
      3       -0.006147 
      3       -0.003835 
      3       -0.004804 
      3       0.002007 
      3       0.023906 
      3       0.055300 
      3       0.039603 
      3       0.005108 
      3       -0.002949 
      3       -0.005234 
      3       -0.003821 
      3       -0.005234 
      3       -0.002949 
      3       0.005108 
      3       0.039589 
      3       0.054844 
      3       0.017896 
      3       -0.027067 
      3       -0.063195 
      3       -0.047461 
      3       -0.012850 
      3       -0.004745 
      3       -0.002422 
      3       -0.003358 
      3       0.003419 
      3       0.025065 
      3       0.055894 
      4       0.039795 
      4       0.005247 
      4       -0.002782 
      4       -0.005016 
      4       -0.003568 
      4       -0.004956 
      4       -0.003469 
      4       -0.004433 
      4       0.001941 
      4       0.019108 
      4       0.035881 
      4       0.018558 
      4       0.001187 
      4       -0.005156 
      4       -0.004092 
      4       -0.005063 
      4       0.001318 
      4       0.018491 
      4       0.035283 
      4       0.018392 
      4       0.005928 
      4       0.018175 
      4       0.035370 
      4       0.027439 
      4       0.042705 
      4       0.052911 
      4       0.020876 
      4       -0.001025 
      4       -0.007758 
      5       -0.006695 
      5       -0.008065 
      5       -0.006561 
      5       -0.007919 
      5       -0.006416 
      5       -0.007776 
      5       -0.006300 
      5       -0.008499 
      5       -0.016391 
      5       -0.050377 
      5       -0.065413 
      5       -0.033679 
      5       -0.011662 
      5       -0.004803 
      5       -0.005740 
      5       -0.004246 
      5       -0.005627 
      5       -0.004147 
      5       -0.005529 
      5       -0.004050 
      5       -0.005433 
      5       -0.003928 
      5       -0.004449 
      5       0.007231 
      5       0.047010 
      5       0.087842 
      5       0.032779 
      5       -0.049965 
      5       -0.048232 
      6       -0.014889 
      6       -0.007655 
      6       -0.015129 
      6       -0.053596 
      6       -0.082716 
      6       -0.052232 
      6       -0.013053 
      6       -0.004108 
      6       0.003114 
      6       0.020296 
      6       0.037070 
      6       0.020161 
      6       0.007680 
      6       0.019882 
      6       0.036222 
      6       0.018883 
      6       0.001481 
      6       -0.005715 
      6       -0.014472 
      6       -0.052984 
      6       -0.082111 
      6       -0.051633 
      6       -0.012473 
      6       -0.003960 
      6       -0.001672 
      6       -0.003904 
      6       -0.012253 
      6       -0.050775 
      6       -0.079923 
      6       -0.049467 
      6       -0.010315 
      6       -0.001385 
      7       0.006250 
      7       0.028784 
      7       0.070733 
      7       0.108632 
      7       0.187523 
      7       0.320061 
      7       0.472719 
      7       0.649038 
      7       0.797421 
      7       0.866781 
      7       0.929156 
      7       0.988289 
      7       1.041502 
      7       1.213237 
      7       1.473173 
      7       1.700013 
      7       1.810771 
      7       1.831936 
      7       1.837431 
      7       1.864398 
      7       2.003906 
      7       2.285329 
      7       2.575829 
      7       2.753766 
      7       2.822053 
      7       2.834165 
      7       2.853629 
      7       2.936117 
      7       3.113207 
      7       3.314052 
      7       3.526067 
      7       3.703171 
      7       3.774945 
      7       3.811408 
      7       3.852660 
      8       3.968025 
      8       4.191654 
      8       4.448533 
      8       4.670903 
      8       4.835854 
      8       4.917083 
      8       4.932406 
      8       4.937417 
      8       4.963431 
      8       5.090327 
      8       5.300416 
      8       5.397727 
      8       5.290629 
      8       5.119537 
      8       5.059970 
      8       5.174292 
      8       5.355651 
      8       5.532767 
      8       5.658348 
      8       5.524346 
      8       5.072918 
      8       4.446300 
      8       3.516900 
      8       2.139952 
      8       0.666881 
      8       0.305944 
      8       1.213725 
      8       1.916053 
      8       1.856579 
      8       1.413465 
      8       0.792966 
      8       0.218428 
      8       -0.081198 
      8       -0.167026 
      9       -0.234360 
      9       -0.368590 
      9       -0.589049 
      9       -0.809687 
      9       -0.924805 
      9       -0.985963 
      9       -1.013635 
      9       -1.041193 
      9       -1.059870 
      9       -1.071690 
      9       -1.094878 
      9       -1.136224 
      9       -1.158983 
      9       -1.165821 
      9       -1.164825 
      9       -1.166277 
      9       -1.164839 
      9       -1.166278 
      9       -1.164866 
      9       -1.155479 
      9       -1.151927 
      9       -1.175409 
      9       -1.189021 
      9       -1.183736 
      9       -1.187522 
      9       -1.172455 
      9       -1.211423 
      9       -1.297370 
      9       -1.313147 
      9       -1.232854 
      9       -1.196682 
      9       -1.298256 
      9       -1.338646 
      9       -1.206384 
      9       -1.099368 
      9       -1.071913 
      9       -1.072453 
      9       -1.085842 
      9       -1.144560 
      9       -1.200998 
      9       -1.203309 
      9       -1.220282 
      10       -1.235576 
      10       -1.217595 
      10       -1.192582 
      10       -1.154417 
      10       -1.153614 
      10       -1.181302 
      10       -1.248629 
      10       -1.313927 
      10       -1.288940 
      10       -1.234249 
      10       -1.219021 
      10       -1.210952 
      10       -1.254942 
      10       -1.320695 
      10       -1.324808 
      10       -1.332435 
      10       -1.360133 
      10       -1.289854 
      10       -1.199781 
      10       -1.195254 
      10       -1.205109 
      10       -1.248644 
      10       -1.290643 
      10       -1.255345 
      10       -1.245047 
      10       -1.301897 
      10       -1.314037 
      10       -1.302840 
      10       -1.301011 
      10       -1.245473 
      10       -1.197553 
      10       -1.232491 
      10       -1.309578 
      10       -1.360217 
      10       -1.379085 
      10       -1.414869 
      10       -1.434664 
      10       -1.411336 
      10       -1.358902 
      10       -1.281815 
      10       -1.314578 
      10       -1.395139 
      10       -1.339161 
      10       -1.267114 
      10       -1.323035 
      10       -1.407323 
      10       -1.461589 
      10       -1.542220 
      10       -1.530537 
      10       -1.410136 
      10       -1.398439 
      10       -1.478613 
      10       -1.511820 
      10       -1.552574 
      11       -1.549384 
      11       -1.481716 
      11       -1.463639 
      11       -1.437092 
      11       -1.361915 
      11       -1.345201 
      11       -1.309092 
      11       -1.272076 
      11       -1.301074 
      11       -1.365226 
      11       -1.406652 
      11       -1.365456 
      11       -1.381675 
      11       -1.451508 
      11       -1.410501 
      11       -1.301840 
      11       -1.215624 
      11       -1.104057 
      11       -1.049205 
      11       -1.121941 
      11       -1.215993 
      11       -1.249841 
      11       -1.217964 
      11       -1.129769 
      11       -1.078755 
      11       -1.073092 
      11       -1.081148 
      11       -1.066628 
      11       -1.095578 
      11       -1.117743 
      11       -1.034318 
      11       -0.915754 
      11       -0.878982 
      11       -0.865420 
      11       -0.847326 
      11       -0.874045 
      11       -0.889520 
      11       -0.914623 
      11       -0.946922 
      11       -0.994915 
      11       -1.046976 
      11       -1.076493 
      11       -0.993415 
      11       -0.951606 
      11       -1.063177 
      11       -1.111020 
      11       -1.052619 
      11       -1.008603 
      11       -0.985383 
      11       -0.931949 
      11       -0.880107 
      11       -0.848588 
      11       -0.916526 
      11       -0.995918 
      11       -0.931990 
      11       -0.840493 
      12       -0.854353 
      12       -0.888263 
      12       -0.858234 
      12       -0.755372 
      12       -0.691737 
      12       -0.696084 
      12       -0.693768 
      12       -0.670279 
      12       -0.728476 
      12       -0.763197 
      12       -0.769090 
      12       -0.827347 
      12       -0.863089 
      12       -0.851827 
      12       -0.852535 
      12       -0.831673 
      12       -0.810378 
      12       -0.758380 
      12       -0.616740 
      12       -0.509065 
      12       -0.429712 
      12       -0.403856 
      12       -0.483019 
      12       -0.560409 
      12       -0.567527 
      12       -0.552260 
      12       -0.541280 
      12       -0.542199 
      12       -0.493213 
      12       -0.489731 
      12       -0.526388 
      12       -0.527041 
      12       -0.557145 
      12       -0.582255 
      12       -0.543116 
      12       -0.495150 
      12       -0.456830 
      12       -0.481241 
      12       -0.492217 
      12       -0.420010 
      12       -0.408684 
      12       -0.510596 
      12       -0.541929 
      12       -0.526770 
      12       -0.575183 
      12       -0.632891 
      12       -0.668267 
      12       -0.650964 
      12       -0.619154 
      12       -0.584185 
      12       -0.540150 
      12       -0.596475 
      12       -0.698701 
      12       -0.731208 
      12       -0.663577 
      13       -0.604628 
      13       -0.622920 
      13       -0.589201 
      13       -0.555832 
      13       -0.575023 
      13       -0.521401 
      13       -0.468269 
      13       -0.484441 
      13       -0.491064 
      13       -0.460942 
      13       -0.446494 
      13       -0.493578 
      13       -0.464527 
      13       -0.380686 
      13       -0.410825 
      13       -0.462295 
      13       -0.398116 
      13       -0.337445 
      13       -0.319733 
      13       -0.321999 
      13       -0.276040 
      13       -0.219298 
      13       -0.265785 
      13       -0.351062 
      13       -0.359476 
      13       -0.332490 
      13       -0.342378 
      13       -0.442061 
      13       -0.547947 
      13       -0.564833 
      13       -0.538234 
      13       -0.566234 
      13       -0.595583 
      13       -0.592302 
      13       -0.562479 
      13       -0.574027 
      13       -0.615042 
      13       -0.582923 
      13       -0.502831 
      13       -0.422954 
      13       -0.447442 
      13       -0.475833 
      13       -0.426177 
      13       -0.339517 
      13       -0.304007 
      13       -0.280291 
      13       -0.304825 
      13       -0.347633 
      13       -0.357230 
      13       -0.344683 
      13       -0.364779 
      13       -0.345178 
      14       -0.310593 
      14       -0.315585 
      14       -0.296256 
      14       -0.232336 
      14       -0.142763 
      14       -0.170908 
      14       -0.287315 
      14       -0.350819 
      14       -0.233476 
      14       -0.076572 
      14       -0.062321 
      14       -0.174904 
      14       -0.222766 
      14       -0.196639 
      14       -0.164895 
      14       -0.131380 
      14       -0.145980 
      14       -0.182699 
      14       -0.196768 
      14       -0.164706 
      14       -0.067595 
      14       -0.008020 
      14       -0.024686 
      14       -0.101223 
      14       -0.152054 
      14       -0.105733 
      14       0.018169 
      14       0.129400 
      14       0.104042 
      14       -0.034407 
      14       -0.114837 
      14       -0.072017 
      14       -0.065277 
      14       -0.086382 
      14       -0.057647 
      14       -0.042559 
      14       -0.053993 
      14       -0.082479 
      14       -0.106860 
      14       -0.145644 
      14       -0.135566 
      14       -0.077913 
      14       -0.009726 
      14       -0.030348 
      14       -0.056330 
      14       -0.016852 
      14       -0.012909 
      14       -0.023080 
      14       -0.026361 
      14       -0.014571 
      14       -0.033949 
      14       -0.053642 
      14       -0.002511 
      15       0.036340 
      15       -0.086799 
      15       -0.229763 
      15       -0.155820 
      15       -0.075716 
      15       -0.112822 
      15       -0.120449 
      15       -0.115181 
      15       -0.191698 
      15       -0.232062 
      15       -0.144264 
      15       -0.164917 
      15       -0.275057 
      15       -0.237018 
      15       -0.146093 
      15       -0.160764 
      15       -0.198519 
      15       -0.144164 
      15       -0.068103 
      15       -0.093111 
      15       -0.161672 
      15       -0.113268 
      15       -0.083259 
      15       -0.120824 
      15       -0.061686 
      15       0.048027 
      15       0.096062 
      15       0.051641 
      15       -0.059045 
      15       -0.176376 
      15       -0.202024 
      15       -0.127526 
      15       -0.048830 
      15       -0.019055 
      15       -0.047014 
      15       -0.040979 
      15       -0.001667 
      15       0.055248 
      15       0.069267 
      15       0.086415 
      15       0.147113 
      15       0.151942 
      15       0.106461 
      15       0.037561 
      15       -0.024962 
      15       0.031295 
      15       0.135477 
      15       0.172918 
      15       0.150182 
      15       0.100879 
      15       0.032391 
      16       0.044099 
      16       0.091512 
      16       0.103492 
      16       0.110451 
      16       0.131065 
      16       0.160835 
      16       0.145138 
      16       0.110630 
      16       0.102143 
      16       0.094889 
      16       0.077060 
      16       0.054551 
      16       0.048337 
      16       0.035324 
      16       0.051464 
      16       0.072963 
      16       0.088647 
      16       0.135725 
      16       0.128954 
      16       0.062262 
      16       0.028600 
      16       0.080617 
      16       0.144208 
      16       0.115072 
      16       0.051051 
      16       0.052310 
      16       0.066718 
      16       0.053652 
      16       0.047450 
      16       0.025371 
      16       0.012525 
      16       0.024915 
      16       0.041634 
      16       0.024915 
      16       0.012525 
      16       0.025358 
      16       0.047033 
      16       0.049125 
      16       0.052822 
      16       0.053625 
      16       0.060419 
      16       0.016442 
      16       -0.047580 
      16       -0.031492 
      16       0.039323 
      16       0.073818 
      16       0.026757 
      16       -0.018453 
      16       0.021814 
      16       0.055034 
      16       0.024082 
      16       -0.009926 
      16       0.001688 
      16       0.095844 
      17       0.167922 
      17       0.138383 
      17       0.061792 
      17       0.012899 
      17       0.014311 
      17       0.059494 
      17       0.129896 
      17       0.128498 
      17       0.062235 
      17       0.028157 
      17       0.074478 
      17       0.118465 
      17       0.076525 
      17       0.031797 
      17       0.010647 
      17       -0.036519 
      17       -0.029836 
      17       0.033309 
      17       0.068155 
      17       0.084277 
      17       0.130919 
      17       0.132294 
      17       0.097259 
      17       0.075405 
      17       0.078676 
      17       0.109352 
      17       0.050992 
      17       -0.039924 
      17       -0.006759 
      17       0.046095 
      17       0.057656 
      17       0.112513 
      17       0.154362 
      17       0.104088 
      17       0.024521 
      17       -0.016577 
      17       -0.046067 
      17       -0.013715 
      17       0.096041 
      17       0.159352 
      17       0.152074 
      17       0.120350 
      17       0.129382 
      17       0.138297 
      17       0.105833 
      17       0.088427 
      18       0.104741 
      18       0.143736 
      18       0.159471 
      18       0.140664 
      18       0.097939 
      18       0.065042 
      18       0.024896 
      18       0.008668 
      18       0.039649 
      18       0.060958 
      18       0.067929 
      18       0.075665 
      18       0.109098 
      18       0.124385 
      18       0.101435 
      18       0.110616 
      18       0.109931 
      18       0.040506 
      18       -0.008192 
      18       0.029957 
      18       0.065618 
      18       0.051219 
      18       0.077319 
      18       0.082712 
      18       0.025629 
      18       0.018222 
      18       0.046883 
      18       0.053939 
      18       0.055224 
      18       0.048393 
      18       0.031561 
      18       0.023695 
      18       0.073587 
      18       0.112360 
      18       0.109443 
      18       0.131469 
      18       0.165139 
      18       0.175519 
      18       0.119154 
      18       0.059897 
      18       0.046828 
      18       0.053498 
      18       0.092406 
      18       0.130551 
      18       0.132727 
      18       0.114188 
      18       0.085444 
      18       0.054482 
      18       0.001546 
      18       -0.006858 
      19       0.004683 
      19       0.006485 
      19       0.062254 
      19       0.118885 
      19       0.120367 
      19       0.075218 
      19       0.008397 
      19       0.013203 
      19       0.034738 
      19       0.001651 
      19       0.018438 
      19       0.068382 
      19       0.082787 
      19       0.094416 
      19       0.063651 
      19       -0.004287 
      19       -0.029197 
      19       0.001337 
      19       0.022977 
      19       0.029490 
      19       0.028236 
      19       0.030242 
      19       0.038328 
      19       0.076602 
      19       0.105931 
      19       0.080535 
      19       0.064202 
      19       0.085253 
      19       0.072929 
      19       0.057072 
      19       0.069411 
      19       0.074869 
      19       0.096377 
      19       0.112187 
      19       0.107556 
      19       0.066973 
      19       0.021515 
      19       -0.009806 
      19       -0.037146 
      19       -0.007118 
      19       0.029378 
      19       0.029922 
      20       0.067885 
      20       0.098561 
      20       0.090215 
      20       0.073200 
      20       0.089432 
      20       0.104846 
      20       0.099451 
      20       0.050013 
      20       -0.021844 
      20       -0.037166 
      20       0.031506 
      20       0.093764 
      20       0.106560 
      20       0.108208 
      20       0.105742 
      20       0.106109 
      20       0.103623 
      20       0.103985 
      20       0.100670 
      20       0.091275 
      20       0.051744 
      20       0.022422 
      20       0.061666 
      20       0.136914 
      20       0.175013 
      20       0.144432 
      20       0.103518 
      20       0.084256 
      20       0.043067 
      20       0.003141 
      20       -0.004454 
      20       0.003154 
      20       0.042578 
      20       0.081209 
      20       0.083467 
      20       0.060965 
      20       0.019901 
      20       0.002477 
      20       0.018361 
      20       0.043913 
      20       0.009311 
      20       -0.040447 
      21       -0.031640 
