

 time    ||    gripping force   ||   raspberry measurement 

      0       82.260000       2.952297 
      0       58.040000       2.917359 
      0       22.850000       2.909289 
      0       18.600000       2.907004 
      0       17.490000       2.908416 
      0       16.640000       2.906977 
      0       15.330000       2.908416 
      0       14.270000       2.907004 
      0       13.550000       2.909302 
      0       13.050000       2.917762 
      0       12.320000       2.956353 
      1       11.670000       2.980936 
      1       12.030000       2.927535 
      1       12.320000       2.854973 
      1       12.290000       2.816679 
      1       12.350000       2.645940 
      1       12.370000       2.286421 
      1       12.470000       2.015301 
      1       12.440000       1.921013 
      1       12.270000       1.893214 
      1       12.340000       1.833542 
      2       12.310000       1.778392 
      2       12.090000       1.791848 
      2       11.830000       1.842483 
      2       11.400000       1.927200 
      2       10.970000       1.991695 
      2       10.810000       2.004747 
      2       10.900000       1.997537 
      2       10.700000       1.957253 
      2       10.700000       1.912403 
      2       10.820000       1.885119 
      2       10.820000       1.867567 
      2       10.850000       1.890075 
      2       10.900000       1.931618 
      2       10.860000       1.977463 
      2       10.910000       1.995252 
      2       10.920000       1.977879 
      2       10.960000       1.936144 
      2       11.010000       1.903930 
      2       10.940000       1.864882 
      3       10.840000       1.858251 
      3       10.550000       1.923131 
      3       10.640000       1.967524 
      3       10.700000       1.964397 
      3       10.680000       1.967538 
      3       10.710000       1.923574 
      3       10.770000       1.863636 
      3       10.790000       1.888649 
      3       10.790000       1.938841 
      3       10.800000       1.940670 
      3       10.830000       1.957213 
      3       10.850000       1.967981 
      3       10.810000       1.936157 
      3       10.840000       1.914245 
      3       10.800000       1.907434 
      3       10.840000       1.908429 
      3       10.810000       1.906978 
      4       10.860000       1.908416 
      4       10.840000       1.907004 
      4       10.840000       1.909302 
      4       10.920000       1.917762 
      4       10.880000       1.956367 
      4       10.930000       1.981394 
      4       10.870000       1.933499 
      4       10.940000       1.888706 
      4       10.850000       1.934386 
      4       10.900000       1.992218 
      4       10.900000       2.005648 
      4       10.920000       2.008376 
      4       10.910000       2.006977 
      4       10.920000       2.008416 
      4       10.890000       2.006964 
      4       10.910000       2.007959 
      4       10.960000       2.001108 
      4       10.930000       1.977933 
      4       10.920000       1.932088 
      4       10.950000       1.895904 
      4       10.990000       1.896719 
      4       10.930000       1.943784 
      4       10.930000       1.951411 
      4       10.910000       1.936157 
      4       10.950000       1.930828 
      4       10.960000       1.921333 
      5       10.950000       1.958679 
      5       10.980000       1.985354 
      5       10.980000       1.958678 
      5       10.960000       1.921306 
      5       11.000000       1.929942 
      5       11.010000       1.925359 
      5       10.980000       1.902990 
      5       10.680000       1.863083 
      5       10.760000       1.836640 
      5       10.460000       1.825872 
      5       10.460000       1.801635 
      5       10.470000       1.831727 
      5       10.500000       1.846815 
      5       10.480000       1.768105 
      5       14.630000       1.714233 
      5       28.970000       1.761338 
      5       57.240000       1.824943 
      6       99.690000       1.867095 
      6       121.740000       1.857670 
      6       122.380000       1.847425 
      6       110.950000       1.880123 
      6       90.390000       1.911973 
      6       89.780000       1.957240 
      6       93.670000       1.997550 
      6       94.070000       2.005204 
      6       93.900000       1.997564 
      6       93.700000       1.957711 
      7       93.190000       1.918381 
      7       93.140000       1.919283 
      7       93.120000       1.990324 
      7       93.000000       2.258281 
      7       92.770000       2.705234 
      7       92.780000       3.135408 
      7       92.760000       3.393712 
      7       92.590000       3.340324 
      8       92.540000       3.143413 
      8       92.490000       3.031689 
      8       94.450000       3.010282 
      8       94.420000       3.007032 
      8       94.360000       3.008416 
      8       94.290000       3.006977 
      9       94.040000       3.008416 
      9       93.970000       3.006977 
      9       95.600000       3.008416 
      9       95.640000       3.006977 
      10       95.600000       3.008416 
      10       95.560000       3.006977 
      10       95.480000       3.008416 
      10       95.510000       3.006977 
      11       95.500000       3.008416 
      11       95.540000       3.006977 
      11       95.500000       3.008416 
      11       95.520000       3.006977 
      11       95.440000       3.008416 
      12       97.220000       3.006977 
      13       97.280000       3.008416 
      13       97.230000       3.006977 
      13       97.230000       3.008416 
      13       97.200000       3.006977 
      13       97.170000       3.008416 
      13       97.150000       3.006977 
      13       97.130000       3.008416 
      13       97.130000       3.006964 
      14       97.110000       3.007959 
      14       97.060000       3.001149 
      14       97.080000       2.979276 
      14       97.030000       2.948728 
      14       96.950000       2.973921 
      14       96.990000       3.041473 
      14       97.020000       3.066665 
      14       96.980000       3.036117 
      15       96.940000       3.014245 
      15       96.960000       3.007434 
      15       96.940000       3.008429 
      15       96.870000       3.006978 
      15       96.950000       3.008416 
      15       96.870000       3.006977 
      15       96.820000       3.008416 
      16       96.880000       3.006978 
      16       96.850000       3.008429 
      16       96.880000       3.007434 
      16       96.820000       3.014245 
      16       96.810000       3.036143 
      16       96.810000       3.067525 
      17       97.820000       3.051398 
      17       97.850000       3.011947 
      17       97.830000       2.985092 
      17       97.830000       2.967110 
      17       97.750000       2.984219 
      17       97.810000       3.001578 
      17       97.750000       3.007973 
      18       97.730000       3.006964 
      18       97.720000       3.008416 
      18       97.720000       3.006977 
      19       97.710000       3.008416 
      19       97.700000       3.006977 
      19       97.660000       3.008416 
      19       97.630000       3.006977 
      19       97.660000       3.008416 
      19       97.650000       3.006977 
      20       99.090000       3.008416 
      20       99.040000       3.006977 
      20       99.100000       3.008416 
      20       99.050000       3.006977 
      20       99.030000       3.008416 
      21       99.270000       3.006977 
      21       99.690000       3.008416 
      21       99.750000       3.006977 
      21       99.690000       3.008416 
      21       99.900000       3.006977 
      22       100.410000       3.008416 
      22       100.410000       3.006977 
      22       100.410000       3.008416 
      22       100.380000       3.006977 
      22       100.400000       3.008416 
      22       100.350000       3.006977 
      22       100.380000       3.008416 
      22       100.350000       3.006977 
      23       100.340000       3.008416 
      23       100.290000       3.006977 
      23       100.250000       3.008416 
      23       100.290000       3.006977 
      23       100.270000       3.008416 
      23       100.290000       3.006964 
      24       100.240000       3.007973 
      24       100.180000       3.001578 
      25       100.160000       2.984219 
      25       100.230000       2.967083 
      25       100.170000       2.984219 
      25       100.160000       3.001578 
      26       100.070000       3.007973 
      26       100.110000       3.006964 
      26       100.160000       3.008416 
      26       100.090000       3.007004 
      26       100.130000       3.009302 
      26       100.100000       3.017776 
      27       100.030000       3.056810 
      27       100.080000       3.086766 
      27       100.030000       3.056810 
      27       100.140000       3.017776 
      27       100.070000       3.009302 
      27       100.120000       3.007004 
      28       99.980000       3.008416 
      28       100.060000       3.006977 
      29       100.000000       3.008416 
      29       100.000000       3.006977 
      30       99.930000       3.008416 
      30       99.960000       3.006977 
      31       99.920000       3.008416 
      31       99.960000       3.006977 
      33       99.910000       3.008416 
      33       99.870000       3.006977 
      33       99.830000       3.008416 
      33       99.830000       3.006977 
      33       99.840000       3.008416 
      34       99.890000       3.006977 
      34       99.850000       3.008416 
      34       99.800000       3.006977 
      35       99.840000       3.008416 
      35       99.860000       3.006977 
      35       99.850000       3.008416 
      35       99.840000       3.006977 
      35       99.870000       3.008416 
      35       99.870000       3.006977 
      35       99.850000       3.008416 
      35       99.840000       3.006977 
      35       99.870000       3.008416 
      36       99.850000       3.006977 
      36       99.840000       3.008416 
      36       99.780000       3.006977 
      38       99.770000       3.008416 
      38       99.790000       3.006977 
      38       99.770000       3.008416 
      38       99.760000       3.006977 
      38       99.790000       3.008416 
      38       99.800000       3.006977 
      39       99.760000       3.008416 
      39       99.720000       3.007004 
      39       99.740000       3.009302 
      39       99.710000       3.017776 
      41       99.740000       3.056810 
      41       99.720000       3.086766 
      42       99.730000       3.056810 
      42       99.680000       3.017776 
      42       99.660000       3.009302 
      42       99.730000       3.007004 
      42       99.670000       3.008416 
      43       99.680000       3.006977 
      43       99.720000       3.008416 
      43       99.640000       3.006977 
      44       99.670000       3.008416 
      44       99.660000       3.006977 
      46       99.600000       3.008416 
      46       99.670000       3.006977 
      47       99.610000       3.008416 
      47       99.650000       3.006977 
      47       99.680000       3.008416 
      47       99.650000       3.006977 
      47       99.600000       3.008416 
      48       99.620000       3.006977 
      48       99.570000       3.008416 
      48       99.610000       3.006977 
      48       99.620000       3.008416 
      48       99.610000       3.006977 
      49       99.610000       3.008416 
      49       99.620000       3.006977 
      49       99.580000       3.008389 
      49       99.550000       3.006091 
      49       99.870000       2.997618 
      49       100.070000       2.958583 
      50       100.260000       2.928627 
      50       100.280000       2.958583 
      50       100.290000       2.997618 
      50       100.980000       3.006091 
      51       102.840000       3.008389 
      51       102.760000       3.006977 
      51       102.830000       3.008416 
      51       102.850000       3.006977 
      52       102.720000       3.008416 
      52       102.670000       3.006977 
      52       102.700000       3.008416 
      52       102.690000       3.006977 
      52       102.770000       3.008416 
      52       102.650000       3.006977 
      53       102.670000       3.008416 
      53       102.720000       3.006977 
      54       102.590000       3.008416 
      54       102.620000       3.006964 
      55       102.570000       3.007973 
      55       102.590000       3.001578 
      55       102.570000       2.984219 
      55       102.540000       2.967083 
      56       102.530000       2.984219 
      56       102.550000       3.001578 
      56       102.490000       3.007973 
      56       102.500000       3.006964 
      57       102.540000       3.008416 
      57       102.540000       3.006977 
      58       102.480000       3.008416 
      58       102.480000       3.006977 
      59       102.460000       3.008416 
      59       102.480000       3.006977 
      59       102.490000       3.008416 
      59       102.440000       3.006977 
      59       102.400000       3.008416 
