

 time    ||    gripping force   ||   raspberry measurement 

      0       0.030000       -795.053125 
      0       0.010000       -795.053125 
      0       0.080000       -795.053125 
      0       0.040000       -795.053125 
      1       0.350000       -787.102594 
      1       0.030000       -779.231568 
      1       0.190000       -771.439252 
      1       0.400000       -763.724860 
      1       0.240000       -756.087611 
      1       0.580000       -748.526730 
      1       0.540000       -741.040294 
      1       43.340000       -733.524693 
      1       66.050000       -730.005818 
      2       77.230000       -687.137421 
      2       95.680000       -495.017648 
      2       101.900000       -178.277135 
      2       90.290000       13.821998 
      2       89.510000       56.668496 
      2       89.630000       60.169819 
      2       89.800000       60.293202 
      2       89.700000       60.311742 
      2       89.480000       60.318143 
      2       89.280000       60.317281 
      3       89.200000       60.323609 
      3       89.000000       60.381628 
      3       89.040000       60.651504 
      3       88.810000       61.117670 
      3       88.800000       61.527858 
      3       88.700000       61.882056 
      3       88.550000       62.168502 
      3       88.510000       62.286038 
      3       88.380000       62.292492 
      3       88.360000       62.277157 
      3       88.280000       62.293044 
      3       88.250000       62.295093 
      4       88.140000       62.239707 
      4       88.190000       62.167840 
      4       87.850000       62.181445 
      4       87.890000       62.231028 
      4       87.760000       62.258492 
      4       87.690000       62.252141 
      4       87.730000       62.273264 
      4       87.220000       62.308202 
      5       86.610000       62.316259 
      5       85.340000       62.318114 
      5       85.000000       62.311733 
      5       84.760000       62.293931 
      5       84.970000       62.271423 
      5       84.820000       62.265221 
      5       84.880000       62.252598 
      5       84.770000       62.272405 
      5       84.760000       62.297834 
      5       84.170000       62.272821 
      5       83.120000       62.257124 
      5       83.050000       62.279022 
      5       83.030000       62.266952 
      5       82.970000       62.244969 
      6       81.770000       62.218461 
      6       80.660000       62.121712 
      6       80.750000       62.034310 
      6       80.730000       62.002903 
      6       80.740000       62.017740 
      6       80.820000       62.108190 
      6       80.760000       62.171394 
      6       80.730000       62.163740 
      6       80.700000       62.133785 
      7       80.710000       62.066453 
      7       80.570000       62.005656 
      7       78.750000       61.978138 
      7       78.750000       61.993904 
      7       78.720000       62.004132 
      7       78.810000       61.966922 
      7       78.740000       61.855340 
      7       78.730000       61.783205 
      7       78.850000       61.830709 
      7       78.680000       61.853011 
      8       78.570000       61.847768 
      8       78.180000       61.910377 
      8       77.830000       61.947153 
      8       77.630000       61.851295 
      8       77.600000       61.775107 
      8       77.580000       61.796576 
      8       77.550000       61.840026 
      8       77.600000       61.870052 
      8       77.260000       61.815316 
      8       77.190000       61.680006 
      9       77.120000       61.586389 
      9       77.160000       61.623928 
      9       77.150000       61.693444 
      9       76.780000       61.688851 
      9       76.340000       61.668807 
      9       76.400000       61.636817 
      9       76.280000       61.599383 
      9       76.430000       61.572753 
      9       76.310000       61.576072 
      9       76.310000       61.602322 
      9       76.310000       61.668390 
      9       76.240000       61.718793 
      9       76.300000       61.702456 
      10       76.330000       61.621133 
      10       76.300000       61.563103 
      10       76.150000       61.562871 
      10       76.170000       61.638352 
      10       76.160000       61.683005 
      10       76.110000       61.630212 
      10       76.070000       61.545998 
      10       76.060000       61.618102 
      10       76.060000       61.767833 
      10       75.010000       61.766784 
      11       74.380000       61.689477 
      11       74.160000       61.645289 
      11       74.150000       61.619966 
      11       74.110000       61.520744 
      11       74.070000       61.442008 
      11       73.780000       61.435587 
      11       73.560000       61.497085 
      11       73.340000       61.566882 
      11       73.300000       61.561136 
      11       73.260000       61.527917 
      11       73.220000       61.524413 
      11       73.290000       61.535957 
      12       72.960000       61.533825 
      12       72.940000       61.495593 
      12       72.960000       61.469734 
      12       72.990000       61.442283 
      12       72.810000       61.425353 
      12       72.700000       61.434230 
      12       72.710000       61.496588 
      12       72.670000       61.561052 
      12       72.710000       61.531943 
      12       72.660000       61.467935 
      13       72.630000       61.469624 
      13       72.670000       61.489001 
      13       72.650000       61.495150 
      13       72.700000       61.509185 
      13       72.610000       61.485681 
      13       72.640000       61.455891 
      13       72.690000       61.450729 
      13       72.640000       61.479602 
      13       72.590000       61.460611 
      13       72.670000       61.429839 
      13       72.650000       61.428844 
      14       72.620000       61.467891 
      14       72.600000       61.507719 
      14       72.620000       61.514916 
      14       72.510000       61.501917 
      14       72.660000       61.439155 
      14       72.550000       61.374678 
      14       72.590000       61.403787 
      14       72.580000       61.467822 
      14       72.580000       61.467006 
      14       72.530000       61.457983 
      14       72.530000       61.494777 
      14       72.490000       61.534627 
      15       72.510000       61.547197 
      15       72.500000       61.492049 
      15       72.490000       61.433397 
      15       72.470000       61.420801 
      15       72.540000       61.427984 
      15       72.480000       61.466979 
      15       72.360000       61.496934 
      16       72.130000       61.466978 
      16       72.150000       61.427944 
      16       72.170000       61.419471 
      16       72.110000       61.417173 
      16       72.110000       61.418585 
      16       72.040000       61.417146 
      16       72.100000       61.418584 
      16       72.120000       61.417146 
      17       72.040000       61.418598 
      17       72.080000       61.417602 
      17       72.060000       61.424414 
      17       72.120000       61.446339 
      17       72.080000       61.478619 
      17       72.050000       61.473681 
      17       72.100000       61.486277 
      17       72.040000       61.542671 
      17       72.100000       61.526127 
      18       72.000000       61.457111 
      18       71.920000       61.425313 
      18       71.880000       61.418086 
      18       71.920000       61.424427 
      18       71.880000       61.446326 
      18       71.870000       61.478163 
      18       71.820000       61.467879 
      18       71.730000       61.458010 
      19       71.740000       61.494777 
      19       71.690000       61.534641 
      19       71.670000       61.547640 
      19       71.680000       61.497461 
      19       71.700000       61.458010 
      19       71.650000       61.465207 
      19       71.700000       61.465580 
      19       71.630000       61.463878 
      19       71.680000       61.441813 
      19       71.590000       61.424883 
      20       71.580000       61.428414 
      20       71.650000       61.467878 
      20       71.620000       61.507719 
      20       71.610000       61.514929 
      20       71.630000       61.502333 
      20       71.580000       61.443668 
      20       71.540000       61.388077 
      20       71.550000       61.395274 
      20       71.600000       61.411774 
      21       71.550000       61.418141 
      21       71.550000       61.417133 
      21       71.670000       61.418584 
      21       71.500000       61.417146 
      21       71.570000       61.418585 
      21       71.490000       61.417173 
      21       71.570000       61.419471 
      22       71.490000       61.427944 
      22       71.510000       61.466979 
      22       71.550000       61.496974 
      22       71.380000       61.468295 
      22       71.470000       61.443711 
      22       71.500000       61.487093 
      22       71.440000       61.517628 
      22       71.420000       61.470536 
      23       71.370000       61.430699 
      23       71.470000       61.428844 
      23       71.380000       61.467005 
      23       71.430000       61.496935 
      23       71.250000       61.466978 
      23       71.170000       61.427944 
      23       71.070000       61.419471 
      23       71.050000       61.417173 
      24       70.990000       61.418585 
      24       71.000000       61.417146 
      24       70.990000       61.418584 
      24       70.880000       61.417132 
      24       71.010000       61.418128 
      24       70.960000       61.411330 
      24       70.880000       61.389861 
      25       70.940000       61.363423 
      25       70.940000       61.397918 
      25       70.930000       61.448110 
      25       70.870000       61.440470 
      25       70.930000       61.423970 
      25       70.920000       61.418032 
      25       70.940000       61.424010 
      25       70.930000       61.441800 
      25       70.900000       61.464334 
      26       71.000000       61.471369 
      26       70.900000       61.493031 
      26       70.910000       61.500478 
      26       70.870000       61.463891 
      26       70.930000       61.407291 
      26       70.810000       61.400256 
      26       70.960000       61.412647 
      26       70.840000       61.423554 
      26       70.770000       61.441330 
      26       70.750000       61.458478 
      26       70.670000       61.441329 
      26       70.690000       61.423527 
      27       70.640000       61.411760 
      27       70.710000       61.389431 
      27       70.570000       61.358024 
      27       70.640000       61.373721 
      27       70.590000       61.408189 
      27       70.580000       61.415400 
      28       70.430000       61.408189 
      28       70.370000       61.373721 
      28       70.450000       61.358024 
      28       70.370000       61.389418 
      28       70.380000       61.411317 
      28       70.360000       61.418128 
      28       70.330000       61.417133 
      28       70.360000       61.418598 
      28       70.400000       61.417589 
      28       70.380000       61.423957 
      28       70.330000       61.440457 
      29       70.350000       61.447680 
      29       70.330000       61.392949 
      30       70.380000       61.344195 
      30       70.330000       61.369195 
      30       70.350000       61.407800 
      30       70.390000       61.416260 
      30       70.390000       61.418558 
      30       70.340000       61.417146 
      30       70.260000       61.418584 
      30       70.350000       61.417132 
      31       70.400000       61.418128 
      31       70.370000       61.411330 
      31       70.390000       61.389861 
      31       70.240000       61.363423 
      31       70.320000       61.397918 
      31       70.330000       61.448084 
      32       70.320000       61.439584 
      32       70.310000       61.413159 
      32       70.300000       61.369195 
      32       70.360000       61.338809 
      32       70.320000       61.368752 
      32       70.290000       61.407800 
      32       70.350000       61.416702 
      32       70.240000       61.423930 
      32       70.330000       61.440456 
      32       70.310000       61.447654 
      33       70.300000       61.392062 
      33       70.370000       61.333397 
      33       70.320000       61.320841 
      33       70.370000       61.329354 
      33       70.330000       61.384506 
      33       70.310000       61.485750 
      34       70.160000       61.560125 
      34       70.280000       61.530586 
      34       70.330000       61.451684 
      34       70.310000       61.395274 
      34       70.140000       61.348139 
      34       70.450000       61.330310 
      34       70.260000       61.347656 
      34       70.360000       61.388545 
      34       70.340000       61.411290 
      35       70.270000       61.418141 
      35       70.320000       61.417576 
      35       70.270000       61.423983 
      35       70.170000       61.441343 
      35       70.290000       61.458479 
      36       70.360000       61.441343 
      36       70.240000       61.423983 
      36       70.310000       61.417589 
      36       70.130000       61.418598 
      36       70.270000       61.417146 
      36       70.240000       61.418584 
      36       70.190000       61.417146 
      36       70.190000       61.418584 
      36       70.260000       61.417146 
      36       70.240000       61.418584 
      37       70.250000       61.417132 
      37       70.210000       61.418128 
      37       70.250000       61.411317 
      37       70.280000       61.389418 
      37       70.290000       61.358024 
      37       70.220000       61.373721 
      37       70.150000       61.408216 
      37       70.350000       61.416273 
      37       70.200000       61.418558 
      37       70.180000       61.417146 
      38       70.190000       61.418584 
      38       70.170000       61.417146 
      38       70.020000       61.418584 
      38       70.090000       61.417146 
      38       70.010000       61.418584 
      38       70.050000       61.417133 
      38       70.070000       61.418141 
      38       70.020000       61.411747 
      38       69.720000       61.394401 
      39       69.710000       61.377708 
      39       69.730000       61.400216 
      39       69.560000       61.440913 
      39       69.690000       61.477263 
      39       69.460000       61.461996 
      40       69.500000       61.427514 
      40       69.620000       61.419431 
      40       69.470000       61.416286 
      40       69.550000       61.407800 
      40       69.610000       61.369208 
      40       69.580000       61.344625 
      40       69.590000       61.397918 
      40       69.610000       61.466908 
      41       69.510000       61.461123 
      41       69.590000       61.427514 
      41       69.590000       61.420330 
      41       69.600000       61.427541 
      41       69.520000       61.462050 
      41       69.550000       61.479036 
      41       69.530000       61.462509 
      41       69.530000       61.497005 
      41       69.560000       61.537285 
      42       69.580000       61.491162 
      42       69.540000       61.432457 
      42       69.530000       61.409116 
      42       69.560000       61.368792 
      43       69.530000       61.338770 
      43       69.540000       61.367892 
      43       69.540000       61.397861 
      43       69.520000       61.378234 
      43       69.560000       61.382194 
      43       69.570000       61.429312 
      43       69.580000       61.435514 
      43       69.540000       61.423500 
      43       69.550000       61.416689 
      43       69.540000       61.407799 
      44       69.510000       61.368752 
      44       69.530000       61.338796 
      44       69.500000       61.368751 
      44       69.590000       61.407759 
      44       69.550000       61.415373 
      44       69.520000       61.407759 
      44       69.530000       61.368751 
      44       69.570000       61.338769 
      45       69.540000       61.367866 
      45       69.570000       61.397001 
      45       69.510000       61.368309 
      45       69.530000       61.344168 
      46       69.480000       61.392949 
      46       69.570000       61.447680 
      46       69.500000       61.440457 
      46       69.510000       61.423957 
      46       69.460000       61.417589 
      47       69.530000       61.418598 
      47       69.530000       61.417146 
      47       69.530000       61.418584 
      47       69.480000       61.417146 
      47       69.520000       61.418584 
      47       69.470000       61.417146 
      47       69.540000       61.418584 
      48       69.550000       61.417146 
      48       69.530000       61.418584 
      48       69.490000       61.417146 
      48       69.530000       61.418598 
      48       69.540000       61.417602 
      48       69.540000       61.424413 
      48       69.560000       61.446312 
      48       69.620000       61.477706 
      49       69.490000       61.461983 
      49       69.540000       61.426628 
      49       69.500000       61.408673 
      49       69.460000       61.369222 
      49       69.440000       61.344195 
      49       69.490000       61.392949 
      49       69.480000       61.447680 
      49       69.570000       61.440457 
      50       69.510000       61.423957 
      50       69.500000       61.417589 
      50       69.550000       61.418598 
      50       69.480000       61.417146 
      50       69.520000       61.418584 
      50       69.520000       61.417146 
      50       69.520000       61.418584 
      50       69.560000       61.417146 
      51       69.520000       61.418584 
      51       69.490000       61.417146 
      51       69.520000       61.418584 
      51       69.520000       61.417146 
      51       69.480000       61.418584 
      52       69.550000       61.417146 
      52       69.540000       61.418584 
      52       69.480000       61.417146 
      52       69.420000       61.418584 
      52       69.520000       61.417146 
      52       69.530000       61.418558 
      52       69.460000       61.416260 
      53       69.550000       61.407786 
      53       69.530000       61.368752 
      53       69.530000       61.338796 
      53       69.480000       61.368752 
      54       69.490000       61.407786 
      54       69.440000       61.416259 
      54       69.430000       61.418531 
      54       69.460000       61.416273 
      54       69.450000       61.408216 
      54       69.490000       61.373694 
      54       69.580000       61.357137 
      54       69.510000       61.378620 
      54       69.520000       61.362922 
      54       69.540000       61.338313 
      54       69.500000       61.367852 
      54       69.520000       61.396988 
      55       69.470000       61.367865 
      55       69.560000       61.338742 
      55       69.530000       61.367878 
      55       69.480000       61.397418 
      55       69.550000       61.372835 
      56       69.460000       61.357997 
      56       69.550000       61.389418 
      56       69.500000       61.411317 
      56       69.480000       61.418128 
      56       69.450000       61.417132 
      56       69.510000       61.418584 
      56       69.500000       61.417145 
      56       69.510000       61.418544 
      57       69.560000       61.415816 
      57       69.490000       61.402387 
      58       69.460000       61.344555 
      58       69.520000       61.298902 
      58       69.490000       61.344555 
      58       69.530000       61.402387 
      59       69.420000       61.415817 
      59       69.570000       61.418558 
      59       69.440000       61.417588 
      59       69.490000       61.423957 
      59       69.480000       61.440457 
      59       69.520000       61.447680 
      59       69.440000       61.392949 
      59       69.530000       61.344195 
      59       69.460000       61.369195 
