

 time    ||   raspberry measurement 

      0       -793.958333 
      0       -793.958333 
      0       -793.958333 
      0       -793.958333 
      0       -793.958333 
      0       -793.958333 
      0       -793.958333 
      0       -793.958333 
      0       -793.958333 
      0       -793.958329 
      0       -793.957148 
      0       -793.850900 
      0       -790.332443 
      0       -747.468584 
      0       -555.363057 
      0       -238.623553 
      0       -46.502328 
      0       -3.635369 
      0       -0.115056 
      0       -0.010234 
      0       -0.007615 
      0       -0.009048 
      0       -0.007610 
      0       -0.009022 
      0       -0.006737 
      1       0.001320 
      1       0.035815 
      1       0.051512 
      1       0.020118 
      1       -0.001781 
      1       -0.008592 
      1       -0.007596 
      1       -0.009048 
      1       -0.007610 
      1       -0.009048 
      1       -0.007610 
      1       -0.009048 
      1       -0.007610 
      1       -0.009048 
      1       -0.007610 
      1       -0.009048 
      1       -0.007610 
      1       -0.009048 
      1       -0.007610 
      1       -0.009022 
      1       -0.006724 
      1       0.001750 
      1       0.040784 
      1       0.070740 
      1       0.040784 
      2       0.001750 
      2       -0.006724 
      2       -0.009022 
      2       -0.007610 
      2       -0.009048 
      2       -0.007610 
      2       -0.009048 
      2       -0.007596 
      2       -0.008592 
      2       -0.001754 
      3       0.021004 
      3       0.062310 
      3       0.084209 
      3       0.081108 
      3       0.041657 
      3       0.001777 
      3       -0.006723 
      3       -0.009022 
      3       -0.007609 
      3       -0.009022 
      3       -0.006724 
      3       0.001750 
      3       0.040784 
      3       0.070740 
      3       0.040784 
      4       0.001750 
      4       -0.006724 
      4       -0.009022 
      4       -0.007610 
      4       -0.009048 
      4       -0.007610 
      4       -0.009048 
      4       -0.007610 
      4       -0.009022 
      4       -0.006724 
      4       0.001750 
      4       0.040784 
      4       0.070740 
      5       0.040784 
      5       0.001750 
      5       -0.006724 
      5       -0.009022 
      5       -0.007609 
      5       -0.009022 
      5       -0.006724 
      5       0.001750 
      5       0.040785 
      5       0.070767 
      5       0.041671 
      5       0.012548 
      5       0.041671 
      5       0.070767 
      5       0.040785 
      5       0.001777 
      5       -0.005837 
      6       0.001777 
      6       0.040785 
      6       0.070767 
      6       0.041671 
      6       0.012575 
      6       0.042557 
      6       0.081592 
      6       0.090052 
      6       0.091907 
      6       0.085096 
      6       0.062337 
      6       0.020991 
      6       -0.002211 
      6       -0.014420 
      6       -0.036736 
      6       -0.067284 
      6       -0.041675 
      7       0.030416 
      7       0.069867 
      7       0.040758 
      7       0.001776 
      7       -0.005837 
      7       0.001803 
      7       0.041658 
      7       0.081108 
      7       0.084209 
      7       0.062324 
      7       0.021461 
      7       0.004102 
      7       0.021461 
      7       0.062324 
      7       0.084209 
      7       0.081108 
      7       0.041658 
      7       0.001803 
      7       -0.005863 
      7       0.000917 
      7       0.030846 
      7       0.032271 
      7       -0.000978 
      7       -0.010281 
      7       -0.029701 
      7       -0.027281 
      7       -0.019416 
      8       -0.032223 
      8       -0.048499 
      8       -0.025951 
      8       0.015605 
      8       0.061867 
      8       0.084209 
      8       0.081565 
      8       0.047513 
      8       0.031816 
      8       0.062767 
      8       0.079294 
      8       0.062767 
      8       0.031816 
      8       0.047527 
      8       0.082022 
      8       0.090078 
      8       0.092337 
      8       0.090078 
      8       0.082008 
      8       0.047070 
      8       0.025974 
      8       0.033171 
      8       0.015202 
      8       -0.001324 
      9       0.002220 
      9       0.041684 
      9       0.081512 
      9       0.088292 
      9       0.070740 
      9       -0.006723 
      9       -0.077985 
      9       -0.054231 
      9       -0.009021 
      9       0.039912 
      9       0.071170 
      9       0.046640 
      9       0.031803 
      9       0.063224 
      9       0.085122 
      9       0.091907 
      9       0.090052 
      9       0.081565 
      9       0.041671 
      10       0.001777 
      10       -0.006723 
      10       -0.009022 
      10       -0.007609 
      10       -0.009022 
      10       -0.006723 
      10       0.001777 
      10       0.041671 
      10       0.081538 
      10       0.089178 
      10       0.081538 
      10       0.041671 
      10       0.001777 
      10       -0.006723 
      10       -0.008995 
      10       -0.006723 
      10       0.001750 
      10       0.040784 
      10       0.070740 
      11       0.040785 
      11       0.001777 
      11       -0.005837 
      11       0.001817 
      11       0.042114 
      11       0.086964 
      11       0.114262 
      11       0.132258 
      11       0.115149 
      11       0.097789 
      11       0.091395 
      11       0.092403 
      11       0.090952 
      11       0.092390 
      11       0.090951 
      11       0.092363 
      11       0.090065 
      11       0.081565 
      11       0.041671 
      11       0.001777 
      11       -0.006710 
      11       -0.008565 
      11       -0.001754 
      11       0.021005 
      11       0.062337 
      11       0.085082 
      11       0.091477 
      12       0.085109 
      12       0.063224 
      12       0.031830 
      12       0.047526 
      12       0.081995 
      12       0.089205 
      12       0.081995 
      12       0.047526 
      12       0.031829 
      12       0.063197 
      12       0.084236 
      12       0.081109 
      12       0.041657 
      12       0.001777 
      12       -0.006723 
      12       -0.008995 
      12       -0.006723 
      12       0.001777 
      12       0.041671 
      12       0.081565 
      12       0.090065 
      12       0.092378 
      12       0.091530 
      12       0.102328 
      12       0.172712 
      12       0.418334 
      12       0.718466 
      12       0.707308 
      12       0.418752 
      12       0.188491 
      12       0.107767 
      12       0.124491 
      12       0.264667 
      12       0.562338 
      12       0.841461 
      12       0.966684 
      12       0.989085 
      12       0.993330 
      12       1.005444 
      12       1.089001 
      12       1.328772 
      12       1.691971 
      12       1.985080 
      12       2.198304 
      12       2.492822 
      12       2.874879 
      12       3.219769 
      12       3.572625 
      12       3.950753 
      12       4.360605 
      13       4.844067 
      13       5.353508 
      13       5.990853 
      13       6.721386 
      13       7.523137 
      13       8.626583 
      13       10.039939 
      13       11.239135 
      13       11.634442 
      13       11.669204 
      13       12.120871 
      13       12.847642 
      13       13.512834 
      13       14.245455 
      13       15.149019 
      13       16.110386 
      13       17.152096 
      13       18.282646 
      13       19.303672 
      13       20.091961 
      13       20.675970 
      13       21.038419 
      13       21.407388 
      13       22.038987 
      13       22.749114 
      13       23.256675 
      13       23.619415 
      13       23.872333 
      13       23.971113 
      13       23.991866 
      13       24.002609 
      13       24.052039 
      13       24.125030 
      13       24.151956 
      13       24.136383 
      13       24.173940 
      13       24.249825 
      13       24.346972 
      13       24.457313 
      13       24.451415 
      13       24.397776 
      13       24.354712 
      13       24.362822 
      13       24.444440 
      13       24.534000 
      14       24.608047 
      14       24.649647 
      14       24.709388 
      14       24.730319 
      14       24.652053 
      14       24.597778 
      14       24.640397 
      14       24.691449 
      14       24.751610 
      14       24.831275 
      14       24.886481 
      14       24.918318 
      14       24.940674 
      14       24.886991 
      14       24.816536 
      14       24.824742 
      14       24.848286 
      14       24.834610 
      14       24.790067 
      14       24.825641 
      14       24.886009 
      14       24.940341 
      14       24.981082 
      14       24.984666 
      14       24.968166 
      14       24.951044 
      14       24.967737 
      14       24.979724 
      14       24.962767 
      14       24.931373 
      14       24.942128 
      15       24.957825 
      15       24.950171 
      15       24.967723 
      15       24.980153 
      15       24.967750 
      15       24.951044 
      15       24.968193 
      15       24.985553 
      15       24.991947 
      15       24.990938 
      15       24.992390 
      15       24.990952 
      15       24.992390 
      15       24.990952 
      15       24.992390 
      15       24.990938 
      15       24.991947 
      15       24.985553 
      15       24.968193 
      15       24.951058 
      15       24.968193 
      15       24.985553 
      15       24.991947 
      15       24.990938 
      15       24.992390 
      15       24.990952 
      15       24.992390 
      15       24.990938 
      15       24.991934 
      15       24.985096 
      15       24.962338 
      16       24.921032 
      16       24.899133 
      16       24.902234 
      16       24.941685 
      16       24.981565 
      16       24.990052 
      16       24.991907 
      16       24.985123 
      16       24.963224 
      16       24.931830 
      16       24.947527 
      16       24.982022 
      16       24.990079 
      16       24.992364 
      16       24.990952 
      16       24.992390 
      16       24.990952 
      16       24.992390 
      16       24.990952 
      16       24.992390 
      16       24.990952 
      16       24.992390 
      16       24.990952 
      16       24.992390 
      16       24.990952 
      16       24.992390 
      16       24.990938 
      16       24.991947 
      16       24.985553 
      16       24.968193 
      16       24.951058 
      16       24.968193 
      16       24.985553 
      17       24.991947 
      17       24.990925 
      17       24.991934 
      17       24.985123 
      17       24.963197 
      17       24.930930 
      17       24.936272 
      17       24.927786 
      17       24.880694 
      17       24.879851 
      17       24.915176 
      17       24.951110 
      17       24.936715 
      17       24.913018 
      17       24.952886 
      17       25.024144 
      17       25.040244 
      17       24.976223 
      17       24.932259 
      17       24.939483 
      17       24.945242 
      17       24.967737 
      17       24.985539 
      17       24.991947 
      17       24.990925 
      17       24.991934 
      17       24.985123 
      17       24.963224 
      17       24.931830 
      17       24.947513 
      17       24.981566 
      17       24.984249 
      17       24.963157 
      17       24.930500 
      17       24.931330 
      17       24.909431 
      18       24.870383 
      18       24.919329 
      18       24.969355 
      18       24.966864 
      18       24.951017 
      18       24.968193 
      18       24.985553 
      18       24.991947 
      18       24.990938 
      18       24.992363 
      18       24.990079 
      18       24.982008 
      18       24.947070 
      18       24.926001 
      18       24.934058 
      18       24.926001 
      18       24.947070 
      18       24.981982 
      18       24.989192 
      18       24.981565 
      18       24.942517 
      18       24.911259 
      18       24.925930 
      18       24.904031 
      18       24.851115 
      18       24.897789 
      18       24.955443 
      18       24.921114 
      18       24.886026 
      18       24.908987 
      18       24.910233 
      18       24.903202 
      18       24.921435 
      18       24.962350 
      18       24.985083 
      18       24.991477 
      18       24.985109 
      18       24.963224 
      18       24.931803 
      18       24.946640 
      18       24.971184 
      18       24.940341 
      18       24.895921 
      18       24.864097 
      18       24.831414 
      19       24.842155 
      19       24.858685 
      19       24.860123 
      19       24.906649 
      19       24.927732 
      19       24.908517 
      19       24.928162 
      19       24.911645 
      19       24.880237 
      19       24.890123 
      19       24.893193 
      19       24.902245 
      19       24.861772 
      19       24.817115 
      19       24.837159 
      19       24.852439 
      19       24.830943 
      19       24.847473 
      19       24.881122 
      19       24.878864 
      19       24.839457 
      19       24.797791 
      19       24.853383 
      19       24.946570 
      19       24.983753 
      19       24.991007 
      19       24.980139 
      19       24.943969 
      19       24.910290 
      19       24.933601 
      19       24.935816 
      19       24.919272 
      19       24.904435 
      19       24.861882 
      19       24.882092 
      19       24.941587 
      19       24.934969 
      19       24.901723 
      19       24.898206 
      19       24.909360 
      19       24.903535 
      19       24.860539 
      19       24.866311 
      19       24.873509 
      19       24.828672 
      19       24.820189 
      19       24.820991 
      19       24.839925 
      20       24.841574 
      20       24.776707 
      20       24.737699 
      20       24.765024 
      20       24.801790 
      20       24.870394 
      20       24.941117 
      20       24.940301 
      20       24.924604 
      20       24.922372 
      20       24.867198 
      20       24.822487 
      20       24.855513 
      20       24.862254 
      20       24.784294 
      20       24.747527 
      20       24.729558 
      20       24.691089 
      20       24.723303 
      20       24.776623 
      20       24.789676 
      20       24.793680 
      20       24.807135 
      20       24.864552 
      20       24.905719 
      20       24.847513 
      20       24.807689 
      20       24.883311 
      20       24.944797 
      20       24.932201 
      20       24.885153 
      20       24.821544 
      20       24.847527 
      20       24.892280 
      20       24.867209 
      20       24.832661 
      20       24.766338 
      20       24.702287 
      20       24.676252 
      20       24.691519 
      20       24.781566 
      20       24.840284 
      20       24.820118 
      20       24.809420 
      20       24.844731 
      20       24.890090 
      20       24.843775 
      20       24.732785 
      20       24.657343 
      20       24.639040 
      21       24.614760 
      21       24.587422 
      21       24.547527 
      21       24.526485 
      21       24.540397 
      21       24.562769 
      21       24.656995 
      21       24.784099 
      21       24.819216 
      21       24.768042 
      21       24.714789 
      21       24.656953 
      21       24.653409 
      21       24.688268 
      21       24.718372 
      21       24.740688 
      21       24.687420 
      21       24.621505 
      21       24.643983 
      21       24.669381 
      21       24.643056 
      21       24.609364 
      21       24.622399 
      21       24.583352 
      21       24.531483 
      21       24.588711 
      21       24.645710 
      21       24.638473 
      21       24.619248 
      21       24.598565 
      21       24.596846 
      21       24.531747 
      21       24.447664 
      21       24.450200 
      21       24.499186 
      21       24.574825 
      21       24.677564 
      21       24.728064 
      21       24.741713 
      21       24.733933 
      21       24.708517 
      21       24.656053 
      21       24.648400 
      21       24.668193 
      21       24.688237 
      21       24.704920 
      21       24.677025 
      21       24.678008 
      21       24.631316 
      21       24.561466 
      21       24.550712 
      21       24.570339 
      21       24.613084 
      21       24.635264 
      21       24.653478 
      21       24.689540 
      22       24.735025 
      22       24.753191 
      22       24.805361 
      22       24.797094 
      22       24.662767 
      22       24.513989 
      22       24.504060 
      22       24.550265 
      22       24.558671 
      22       24.617516 
      22       24.658073 
      22       24.612614 
      22       24.541202 
      22       24.550698 
      22       24.590092 
      22       24.624144 
      22       24.603091 
      22       24.540303 
      22       24.548938 
      22       24.569785 
      22       24.542223 
      22       24.499868 
      22       24.489290 
      22       24.464497 
      22       24.444440 
      22       24.432273 
      22       24.471750 
      22       24.527719 
      22       24.542986 
      22       24.551082 
      22       24.507938 
      22       24.451653 
      22       24.479710 
      22       24.478421 
      22       24.369537 
      22       24.340897 
      22       24.390550 
      22       24.460150 
      22       24.575696 
      22       24.640646 
      22       24.628660 
      22       24.629946 
      22       24.593192 
      22       24.496408 
      22       24.481636 
      22       24.501233 
      22       24.417488 
      22       24.337286 
      22       24.383352 
      22       24.416571 
      22       24.379821 
      22       24.380724 
      22       24.426403 
      23       24.504446 
      23       24.534818 
      23       24.470380 
      23       24.407566 
      23       24.392847 
      23       24.380194 
      23       24.343956 
      23       24.309820 
      23       24.327356 
      23       24.302163 
      23       24.247584 
      23       24.277123 
      23       24.336215 
      23       24.316158 
      23       24.286026 
      23       24.313916 
      23       24.328601 
      23       24.313903 
      23       24.285623 
      23       24.312061 
      23       24.327302 
      23       24.298175 
      23       24.285180 
      23       24.256456 
      23       24.275821 
      23       24.312018 
      23       24.272167 
      23       24.252526 
      23       24.325890 
      23       24.361394 
      23       24.303951 
      23       24.278925 
      23       24.279737 
      23       24.252049 
      23       24.184712 
      23       24.182619 
      23       24.290425 
      23       24.330468 
      23       24.253258 
      23       24.212175 
      23       24.224575 
      23       24.272246 
      23       24.256360 
      23       24.222057 
      23       24.261355 
      23       24.292762 
      23       24.260056 
      23       24.270354 
      23       24.281508 
      23       24.195975 
      24       24.124717 
      24       24.154309 
      24       24.231786 
      24       24.291451 
      24       24.337546 
      24       24.361353 
      24       24.290938 
      24       24.222944 
      24       24.237615 
      24       24.252439 
      24       24.230460 
      24       24.240785 
      24       24.242044 
      24       24.182119 
      24       24.162312 
      24       24.209404 
      24       24.238499 
      24       24.256442 
      24       24.235815 
      24       24.196377 
      24       24.174439 
      24       24.174408 
      24       24.197746 
      24       24.167198 
      24       24.147181 
      24       24.207978 
      24       24.256911 
      24       24.272582 
      24       24.291850 
      24       24.237131 
      24       24.176750 
      24       24.207119 
      24       24.217430 
      24       24.165952 
      24       24.177539 
      24       24.222346 
      24       24.213403 
      24       24.186938 
      24       24.142114 
      24       24.101790 
      24       24.093277 
      24       24.090979 
      24       24.092391 
      24       24.090992 
      24       24.093733 
      24       24.107592 
      24       24.170381 
      24       24.234831 
      24       24.204849 
      24       24.130473 
      24       24.088777 
      24       24.048897 
      25       24.042668 
      25       24.112505 
      25       24.175709 
      25       24.188722 
      25       24.181525 
      25       24.141671 
      25       24.101803 
      25       24.094150 
      25       24.101360 
      25       24.136272 
      25       24.157341 
      25       24.149284 
      25       24.157342 
      25       24.136299 
      25       24.102234 
      25       24.104518 
      25       24.145215 
      25       24.201789 
      25       24.203880 
      25       24.172679 
      25       24.145632 
      25       24.138167 
      25       24.116063 
      25       24.103659 
      25       24.121435 
      25       24.161921 
      25       24.180153 
      25       24.173552 
      25       24.179754 
      25       24.221459 
      25       24.200363 
      25       24.130930 
      25       24.099106 
      25       24.091435 
      25       24.092417 
      25       24.091395 
      25       24.097803 
      25       24.115605 
      25       24.138114 
      25       24.144315 
      25       24.156911 
      25       24.136258 
      26       24.101333 
      26       24.093264 
      26       24.091005 
      26       24.093277 
      26       24.101750 
      26       24.140784 
      26       24.170740 
      26       24.140758 
      26       24.100864 
      26       24.082492 
      26       24.043028 
      26       24.018001 
      26       24.066755 
      26       24.121486 
      26       24.114263 
      26       24.097763 
      26       24.091395 
      26       24.092404 
      26       24.090952 
      26       24.092390 
      26       24.090952 
      26       24.092390 
      26       24.090952 
      26       24.092391 
      26       24.090979 
      26       24.093277 
      26       24.101790 
      26       24.142114 
      26       24.186938 
      26       24.213376 
      26       24.221433 
      26       24.165881 
      26       24.107619 
      26       24.099119 
      26       24.115189 
      26       24.132285 
      26       24.115149 
      26       24.097789 
      27       24.091395 
      27       24.092430 
      27       24.091838 
      27       24.103189 
      27       24.139373 
      27       24.173065 
      27       24.150144 
      27       24.151583 
      27       24.171627 
      27       24.140811 
      27       24.101750 
      27       24.093277 
      27       24.090979 
      27       24.092404 
      27       24.091395 
      27       24.097803 
      27       24.115592 
      27       24.137684 
      27       24.139346 
      27       24.137684 
      27       24.115592 
      27       24.097803 
      27       24.091395 
      27       24.092404 
      27       24.090952 
      27       24.092390 
      27       24.090952 
      27       24.092390 
      28       24.090952 
      28       24.092390 
      28       24.090952 
      28       24.092390 
      28       24.090952 
      28       24.092390 
      28       24.090952 
      28       24.092390 
      28       24.090952 
      28       24.092390 
      28       24.090952 
      28       24.092390 
      28       24.090952 
      28       24.092390 
      28       24.090952 
      28       24.092363 
      28       24.090065 
      28       24.081565 
      28       24.041671 
      28       24.001804 
      28       23.994164 
      28       24.001804 
      29       24.041671 
      29       24.081565 
      29       24.090065 
      29       24.092363 
      29       24.090952 
      29       24.092390 
      29       24.090952 
      29       24.092390 
      29       24.090952 
      29       24.092390 
      29       24.090952 
      29       24.092363 
      29       24.090065 
      29       24.081592 
      29       24.042558 
      29       24.012602 
      29       24.042558 
      29       24.081592 
      29       24.090065 
      29       24.092363 
      30       24.090952 
      30       24.092390 
      30       24.090952 
      30       24.092390 
      30       24.090952 
      30       24.092390 
      30       24.090938 
      30       24.091934 
      30       24.085096 
      30       24.062351 
      30       24.021461 
      30       24.004102 
      30       24.021461 
      30       24.062351 
      30       24.085096 
      30       24.091934 
      30       24.090938 
      30       24.092363 
      30       24.090079 
      30       24.082022 
      30       24.047527 
      30       24.031829 
      30       24.063197 
      30       24.084236 
      30       24.081136 
      30       24.042544 
      30       24.012575 
      30       24.041671 
      30       24.070794 
      31       24.041671 
      31       24.012548 
      31       24.041671 
      31       24.070767 
      31       24.040785 
      31       24.001777 
      31       23.994150 
      31       24.001347 
      31       24.035842 
      31       24.052399 
      31       24.030943 
      31       24.047500 
      31       24.081995 
      32       24.089192 
      32       24.081539 
      32       24.041671 
      32       24.001804 
      32       23.994163 
      32       24.001777 
      32       24.040785 
      32       24.070767 
      32       24.041671 
      32       24.012548 
      32       24.041671 
      32       24.070767 
      32       24.040785 
      32       24.001750 
      32       23.993277 
      33       23.990979 
      33       23.992391 
      33       23.990952 
      33       23.992390 
      33       23.990952 
      33       23.992391 
      33       23.990979 
      33       23.993277 
      33       24.001750 
      33       24.040798 
      33       24.071197 
      33       24.046613 
      33       24.030916 
      33       24.052399 
      33       24.035842 
      33       24.001321 
      33       23.993277 
      33       23.991435 
      33       23.998246 
      33       24.021004 
      33       24.062311 
      33       24.084209 
      33       24.081109 
      33       24.041658 
      34       24.001777 
      34       23.993277 
      34       23.990979 
      34       23.992391 
      34       23.990979 
      34       23.993277 
      34       24.001750 
      34       24.040784 
      34       24.070740 
      34       24.040784 
      34       24.001750 
      34       23.993277 
      34       23.990979 
      34       23.992391 
      34       23.990952 
      34       23.992390 
      34       23.990952 
      34       23.992390 
      34       23.990938 
      35       23.991947 
      35       23.985553 
      35       23.968193 
      35       23.951058 
      35       23.968193 
      35       23.985553 
      35       23.991947 
      35       23.990938 
      35       23.992390 
      35       23.990952 
      35       23.992391 
      35       23.990979 
      35       23.993277 
      35       24.001750 
      35       24.040784 
      35       24.070740 
      35       24.040784 
      35       24.001750 
      35       23.993277 
      35       23.990979 
      35       23.992391 
      35       23.990952 
      35       23.992390 
      35       23.990952 
      36       23.992390 
      36       23.990938 
      36       23.991947 
      36       23.985553 
      36       23.968193 
      36       23.951058 
      36       23.968193 
      36       23.985553 
      36       23.991947 
      36       23.990938 
      36       23.992390 
      36       23.990952 
      36       23.992390 
      36       23.990952 
      36       23.992390 
      36       23.990952 
      36       23.992364 
      36       23.990079 
      36       23.982022 
      36       23.947527 
      36       23.931830 
      36       23.963224 
      36       23.985123 
      37       23.991934 
      37       23.990938 
      37       23.992390 
      37       23.990979 
      37       23.993277 
      37       24.001750 
      37       24.040784 
      37       24.070740 
      37       24.040784 
      37       24.001750 
      37       23.993277 
      37       23.990979 
      37       23.992391 
      37       23.990952 
      37       23.992390 
      37       23.990952 
      37       23.992390 
      37       23.990952 
      37       23.992390 
      37       23.990952 
      37       23.992364 
      37       23.990079 
      37       23.982022 
      37       23.947527 
      37       23.931829 
      37       23.963197 
      37       23.984239 
      37       23.981402 
      37       23.951262 
      37       24.015816 
      37       24.370667 
      38       24.556891 
      38       24.232387 
      38       24.156362 
      38       24.082077 
      38       23.914824 
      38       23.923630 
      38       23.974873 
      38       23.991062 
      38       23.990912 
      38       23.992390 
      38       23.990952 
      38       23.992390 
      38       23.990952 
      38       23.992390 
      38       23.990952 
      38       23.992390 
      38       23.990952 
      38       23.992390 
      38       23.990952 
      39       23.992390 
      39       23.990952 
      39       23.992391 
      39       23.990979 
      39       23.993277 
      39       24.001777 
      39       24.041671 
      39       24.081539 
      39       24.089179 
      39       24.081539 
      39       24.041671 
      39       24.001763 
      39       23.992834 
      39       23.985606 
      40       23.969080 
      40       23.961856 
      40       24.016587 
      40       24.065341 
      40       24.040341 
      40       24.001737 
      40       23.993276 
      40       23.990979 
      40       23.992391 
      40       23.990952 
      40       23.992390 
      40       23.990952 
      40       23.992390 
      40       23.990952 
      40       23.992390 
      40       23.990952 
      41       23.992391 
      41       23.990979 
      41       23.993277 
      41       24.001777 
      41       24.041671 
      41       24.081539 
      41       24.089179 
      41       24.081539 
      41       24.041671 
      41       24.001777 
      41       23.993277 
      41       23.990979 
      41       23.992404 
      41       23.991395 
      41       23.997789 
      41       24.015149 
      41       24.032284 
      42       24.015149 
      42       23.997789 
      42       23.991395 
      42       23.992404 
      42       23.990979 
      42       23.993277 
      42       24.001750 
      42       24.040784 
      42       24.070740 
      42       24.040784 
      42       24.001750 
      42       23.993277 
      42       23.990979 
      42       23.992391 
      42       23.990952 
      42       23.992390 
      42       23.990952 
      42       23.992390 
      42       23.990952 
      42       23.992390 
      42       23.990952 
      42       23.992390 
      42       23.990952 
      42       23.992390 
      42       23.990952 
      42       23.992391 
      42       23.990979 
      43       23.993277 
      43       24.001750 
      43       24.040784 
      43       24.070740 
      43       24.040758 
      43       24.000877 
      43       23.982908 
      43       23.947553 
      43       23.931816 
      43       23.962768 
      43       23.979294 
      43       23.962768 
      43       23.931816 
      43       23.947527 
      43       23.982022 
      43       23.990079 
      43       23.992364 
      43       23.990951 
      43       23.992364 
      43       23.990079 
      43       23.982022 
      43       23.947500 
      43       23.930957 
      43       23.952883 
      43       23.942584 
      43       23.942171 
      43       24.011605 
      43       24.064911 
      43       24.040328 
      43       24.001737 
      43       23.993276 
      43       23.990979 
      43       23.992391 
      44       23.990952 
      44       23.992390 
      44       23.990952 
      44       23.992390 
      44       23.990952 
      44       23.992364 
      44       23.990079 
      44       23.982022 
      44       23.947527 
      44       23.931830 
      44       23.963224 
      44       23.985123 
      44       23.991934 
      44       23.990925 
      44       23.991947 
      44       23.985552 
      44       23.968167 
      44       23.950184 
      44       23.957825 
      44       23.942101 
      44       23.930513 
      44       23.952842 
      44       23.941698 
      44       23.931373 
      44       23.963210 
      44       23.985123 
      44       23.991934 
      44       23.990938 
      44       23.992390 
      44       23.990952 
      44       23.992390 
      44       23.990952 
      45       23.992390 
      45       23.990938 
      45       23.991947 
      45       23.985553 
      45       23.968193 
      45       23.951057 
      45       23.968167 
      45       23.984680 
      45       23.981579 
      45       23.947513 
      45       23.931816 
      45       23.962781 
      45       23.979724 
      45       23.967737 
      45       23.951044 
      45       23.968193 
      45       23.985553 
      45       23.991947 
      45       23.990925 
      45       23.991947 
      45       23.985553 
      45       23.968193 
      45       23.951058 
      45       23.968193 
      45       23.985553 
      45       23.991947 
      45       23.990938 
      45       23.992390 
      45       23.990952 
      45       23.992390 
      45       23.990952 
      45       23.992390 
      45       23.990952 
      45       23.992390 
      46       23.990952 
      46       23.992390 
      46       23.990952 
      46       23.992390 
      46       23.990952 
      46       23.992390 
      46       23.990952 
      46       23.992390 
      46       23.990952 
      46       23.992390 
      46       23.990952 
      46       23.992390 
      46       23.990952 
      46       23.992363 
      46       23.990065 
      46       23.981552 
      46       23.941241 
      46       23.896821 
      46       23.874492 
      46       23.875725 
      46       23.913500 
      46       23.934404 
      46       23.943096 
      46       23.945632 
      46       23.967750 
      46       23.985539 
      46       23.991947 
      46       23.990938 
      46       23.992363 
      46       23.990065 
      46       23.981592 
      46       23.942558 
      46       23.912602 
      46       23.942558 
      46       23.981592 
      46       23.990065 
      46       23.992363 
      46       23.990952 
      46       23.992390 
      47       23.990952 
      47       23.992390 
      47       23.990938 
      47       23.991947 
      47       23.985553 
      47       23.968193 
      47       23.951044 
      47       23.967737 
      47       23.979724 
      47       23.962781 
      47       23.931816 
      47       23.947527 
      47       23.982022 
      47       23.990079 
      47       23.992364 
      47       23.990952 
      47       23.992390 
      47       23.990952 
      47       23.992363 
      47       23.990039 
      47       23.980706 
      47       23.931759 
      47       23.864181 
      47       23.861883 
      47       23.922400 
      47       23.930873 
      47       23.911689 
      47       23.942530 
      47       23.981565 
      47       23.989179 
      47       23.981565 
      47       23.942544 
      47       23.912145 
      47       23.936689 
      47       23.951109 
      47       23.915163 
      47       23.879435 
      47       23.876154 
      47       23.913514 
      47       23.934404 
      47       23.943096 
      47       23.945632 
      47       23.967750 
      47       23.985539 
      47       23.991920 
      48       23.990052 
      48       23.981592 
      48       23.942557 
      48       23.912575 
      48       23.941684 
      48       23.971210 
      48       23.946157 
      48       23.925061 
      48       23.922386 
      48       23.867238 
      48       23.823857 
      48       23.873054 
      48       23.951552 
      48       23.984183 
      48       23.991007 
      48       23.979670 
      48       23.937697 
      48       23.875738 
      48       23.850712 
      48       23.856027 
      48       23.905373 
      48       23.917390 
      48       23.866382 
      48       23.882509 
      48       23.941627 
      48       23.935842 
      48       23.912119 
      48       23.942543 
      48       23.981552 
      48       23.988723 
      48       23.975723 
      48       23.912948 
      48       23.848054 
      48       23.872637 
      48       23.922829 
      48       23.925061 
      48       23.945727 
      48       23.966241 
      48       23.922456 
      48       23.891909 
      48       23.939027 
      48       23.979724 
      48       23.991491 
      49       23.990925 
      49       23.992363 
      49       23.990065 
      49       23.981592 
      49       23.942544 
      49       23.912118 
      49       23.935789 
      49       23.939841 
      49       23.860496 
      49       23.765027 
      49       23.742668 
      49       23.796348 
      49       23.803159 
      49       23.770383 
      49       23.825588 
      49       23.903921 
      49       23.950209 
      49       23.936635 
      49       23.911245 
      49       23.931316 
      49       23.928202 
      49       23.890136 
      49       23.911591 
      49       23.916517 
      49       23.849768 
      49       23.804935 
      49       23.802246 
      49       23.836285 
      49       23.856912 
      49       23.844342 
      49       23.839027 
      49       23.827317 
      49       23.857882 
      49       23.930416 
      49       23.970323 
      49       23.946587 
      49       23.930889 
      49       23.951526 
      49       23.925500 
      49       23.858769 
      49       23.843084 
      49       23.907079 
      49       23.949740 
      49       23.927205 
      49       23.859666 
      49       23.766326 
      49       23.761121 
      49       23.811133 
      50       23.862324 
      50       23.894565 
      50       23.924990 
      50       23.908061 
      50       23.859127 
      50       23.865496 
      50       23.864027 
      50       23.861935 
      50       23.838018 
      50       23.817544 
      50       23.865855 
      50       23.910648 
      50       23.864525 
      50       23.801321 
      50       23.764594 
      50       23.733186 
      50       23.763308 
      50       23.850087 
      50       23.895946 
      50       23.868942 
      50       23.849381 
      50       23.846518 
      50       23.872276 
      50       23.898925 
      50       23.883017 
      50       23.830364 
      50       23.829697 
      50       23.853672 
      50       23.853851 
      50       23.810707 
      50       23.828312 
      50       23.877926 
      50       23.900017 
      50       23.935762 
      50       23.951056 
      50       23.914289 
      50       23.869026 
      50       23.831400 
      50       23.836729 
      50       23.833171 
      50       23.804421 
      50       23.813473 
      50       23.804794 
      50       23.772733 
      50       23.746531 
      50       23.749368 
      50       23.768486 
      50       23.790117 
      50       23.720948 
      50       23.605073 
      50       23.599148 
      50       23.704958 
      50       23.790039 
      50       23.868111 
      50       23.923563 
      51       23.851512 
      51       23.732330 
      51       23.730059 
      51       23.777119 
      51       23.790079 
      51       23.797320 
      51       23.810192 
      51       23.813460 
      51       23.798566 
      51       23.802702 
      51       23.762228 
      51       23.722447 
      51       23.759139 
      51       23.765310 
      51       23.633215 
      51       23.540870 
      51       23.591878 
      51       23.590119 
      51       23.583878 
      51       23.615189 
      51       23.581607 
      51       23.604159 
      51       23.726750 
      51       23.819713 
      51       23.832564 
      51       23.813016 
      51       23.770741 
      51       23.754781 
      51       23.769413 
      51       23.796873 
      51       23.761772 
      51       23.722500 
      51       23.761355 
      51       23.792320 
      51       23.754697 
      51       23.747500 
      51       23.758241 
      51       23.749324 
      51       23.757772 
      51       23.741241 
      51       23.720588 
      51       23.714790 
      51       23.704461 
      51       23.733171 
      51       23.736675 
      51       23.729640 
      51       23.747846 
      51       23.721987 
      51       23.704005 
      51       23.720145 
      51       23.680680 
      51       23.687022 
      51       23.741130 
      51       23.724144 
      52       23.652013 
      52       23.602636 
      52       23.592861 
      52       23.585606 
      52       23.569066 
      52       23.561400 
      52       23.610772 
      52       23.636658 
      52       23.587961 
      52       23.597724 
      52       23.702674 
      52       23.762143 
      52       23.735884 
      52       23.670271 
      52       23.625615 
      52       23.604931 
      52       23.628659 
      52       23.622444 
      52       23.629088 
      52       23.675754 
      52       23.671223 
      52       23.678438 
      52       23.642074 
      52       23.608987 
      52       23.620092 
      52       23.574018 
      52       23.548374 
      52       23.549395 
      52       23.567610 
      52       23.602262 
      52       23.585526 
      52       23.622911 
      52       23.592171 
      52       23.510926 
      52       23.537992 
      52       23.567706 
      52       23.528175 
      52       23.518859 
      52       23.505237 
      52       23.472733 
      52       23.446115 
      52       23.444883 
      52       23.456054 
      52       23.512075 
      52       23.557382 
      52       23.574824 
      52       23.619262 
      52       23.662670 
      52       23.691003 
      52       23.637561 
      52       23.582619 
      52       23.637574 
      53       23.691406 
      53       23.666726 
      53       23.626792 
      53       23.535842 
      53       23.426887 
      53       23.356125 
      53       23.330082 
      53       23.356564 
      53       23.368611 
      53       23.470867 
      53       23.644203 
      53       23.670708 
      53       23.552469 
      53       23.461900 
      53       23.518457 
      53       23.653670 
      53       23.678796 
      53       23.578411 
      53       23.499522 
      53       23.448440 
      53       23.426042 
      53       23.434085 
      53       23.426887 
      53       23.457868 
      53       23.530363 
      53       23.568564 
      53       23.525393 
      53       23.438197 
      53       23.400822 
      53       23.406410 
      53       23.385998 
      53       23.445465 
      53       23.567016 
      53       23.632282 
      53       23.576945 
      53       23.547998 
      53       23.520451 
      53       23.439979 
      53       23.343942 
      53       23.272292 
      53       23.308576 
      53       23.469437 
      53       23.557629 
      53       23.469011 
      53       23.367201 
      53       23.339523 
      53       23.311617 
      53       23.290770 
      53       23.337563 
      53       23.469148 
      53       23.589400 
      53       23.630899 
      53       23.536564 
      53       23.430570 
      54       23.357827 
      54       23.348037 
      54       23.363668 
      54       23.374368 
      54       23.407161 
      54       23.398535 
      54       23.344426 
      54       23.297791 
      54       23.348454 
      54       23.428242 
      54       23.474368 
      54       23.542586 
      54       23.598024 
      54       23.601304 
      54       23.544261 
      54       23.491934 
      54       23.431773 
      54       23.353436 
      54       23.314348 
      54       23.352510 
      54       23.419658 
      54       23.427745 
      54       23.395938 
      54       23.440797 
      54       23.476969 
      54       23.410829 
      54       23.386456 
      54       23.424214 
      54       23.406592 
      54       23.364193 
      54       23.301238 
      54       23.284861 
      54       23.315620 
      54       23.351593 
      54       23.343001 
      54       23.348027 
      54       23.441671 
      54       23.535275 
      54       23.538985 
      54       23.514665 
      54       23.484333 
      54       23.430431 
      54       23.430557 
      54       23.463570 
      54       23.490963 
      54       23.435332 
      54       23.355154 
      54       23.310317 
      54       23.257410 
      54       23.263738 
      54       23.330833 
      54       23.369007 
      54       23.330390 
      54       23.258338 
      54       23.233173 
      54       23.269107 
      55       23.315175 
      55       23.361828 
      55       23.383323 
      55       23.370766 
      55       23.299079 
      55       23.250698 
      55       23.298189 
      55       23.296308 
      55       23.246294 
      55       23.268044 
      55       23.308060 
      55       23.316034 
      55       23.312516 
      55       23.216492 
      55       23.134225 
      55       23.168112 
      55       23.222440 
      55       23.225974 
      55       23.257842 
      55       23.330415 
      55       23.370283 
      55       23.345270 
      55       23.315135 
      55       23.284347 
      55       23.230444 
      55       23.231014 
      55       23.269412 
      55       23.320586 
      55       23.300310 
      55       23.230070 
      55       23.189181 
      55       23.153423 
      55       23.156484 
      55       23.208517 
      55       23.233517 
      55       23.237227 
      55       23.215605 
      55       23.198676 
      55       23.201764 
      55       23.235882 
      55       23.253312 
      55       23.242615 
      55       23.306276 
      55       23.405691 
      55       23.404849 
      55       23.359612 
      55       23.352801 
      55       23.311201 
      55       23.250185 
      56       23.214816 
      56       23.175738 
      56       23.173579 
      56       23.185110 
      56       23.181189 
      56       23.143431 
      56       23.123400 
      56       23.190978 
      56       23.262241 
      56       23.248411 
      56       23.242074 
      56       23.239000 
      56       23.228645 
      56       23.253811 
      56       23.234390 
      56       23.202302 
      56       23.185969 
      56       23.162364 
      56       23.121032 
      56       23.099133 
      56       23.102234 
      56       23.141712 
      56       23.182505 
      56       23.202636 
      56       23.262354 
      56       23.367528 
      56       23.400361 
      56       23.298538 
      56       23.214846 
      56       23.191865 
      56       23.181646 
      56       23.142585 
      56       23.113488 
      56       23.153356 
      56       23.229986 
      56       23.269854 
      56       23.240758 
      56       23.201750 
      56       23.193277 
      56       23.191046 
      56       23.194607 
      56       23.217974 
      56       23.314249 
      56       23.400791 
      56       23.356788 
      56       23.278092 
      56       23.217834 
      56       23.185304 
      56       23.204421 
      56       23.261367 
      56       23.224574 
      57       23.136785 
      57       23.105378 
      57       23.120615 
      57       23.151553 
      57       23.136729 
      57       23.113005 
      57       23.152482 
      57       23.220048 
      57       23.231385 
      57       23.198995 
      57       23.189692 
      57       23.169426 
      57       23.162364 
      57       23.137589 
      57       23.112172 
      57       23.142531 
      57       23.181135 
      57       23.184210 
      57       23.162311 
      57       23.121031 
      57       23.099119 
      57       23.101804 
      57       23.136715 
      57       23.162324 
      57       23.168969 
      57       23.183863 
      57       23.169842 
      57       23.172732 
      57       23.181456 
      57       23.178118 
      57       23.194026 
      57       23.223328 
      57       23.188224 
      57       23.149382 
      57       23.127304 
      57       23.147137 
      57       23.182882 
      57       23.200447 
      57       23.235788 
      57       23.251485 
      57       23.219245 
      57       23.187851 
      57       23.147957 
      57       23.130957 
      57       23.152439 
      58       23.137158 
      58       23.117088 
      58       23.160886 
      58       23.191447 
      58       23.144772 
      58       23.109447 
      58       23.121018 
      58       23.151539 
      58       23.135816 
      58       23.101347 
      58       23.094176 
      58       23.102663 
      58       23.151583 
      58       23.219135 
      58       23.220586 
      58       23.150588 
      58       23.109487 
      58       23.116505 
      58       23.137711 
      58       23.139346 
      58       23.137684 
      58       23.115592 
      58       23.097803 
      58       23.091422 
      58       23.093277 
      58       23.101334 
      58       23.136259 
      58       23.156925 
      58       23.144772 
      58       23.143942 
      58       23.144745 
      58       23.156039 
      58       23.125460 
      58       23.052939 
      58       23.013475 
      58       23.042584 
      58       23.081606 
      59       23.090509 
      59       23.097763 
      59       23.115175 
      59       23.133144 
      59       23.125061 
      59       23.135399 
      59       23.123233 
      59       23.066408 
      59       23.077553 
      59       23.122386 
      59       23.114733 
      59       23.103175 
      59       23.116035 
      59       23.137710 
      59       23.139789 
      59       23.143096 
      59       23.140233 
      59       23.143109 
      59       23.140232 
      59       23.143069 
      59       23.138903 
      59       23.126899 
      59       23.067198 
      59       23.018014 
      59       23.043001 
      59       23.081605 
      59       23.090066 
      59       23.092377 
      59       23.091395 
      59       23.097816 
      59       23.116035 
      59       23.143056 
      59       23.162670 
      59       23.167210 
      59       23.096378 
      59       23.043084 
      59       23.069510 
      59       23.109347 
      60       23.131828 
      60       23.115122 
      60       23.097333 
      60       23.085566 
      60       23.063237 
      60       23.031830 
      60       23.047527 
      60       23.082022 
      60       23.090079 
      60       23.092364 
      60       23.090952 
      60       23.092390 
      60       23.090952 
      60       23.092404 
      60       23.091409 
      60       23.098246 
      60       23.120991 
      60       23.161881 
      60       23.179240 
      60       23.161881 
      60       23.120991 
      60       23.098246 
      60       23.091409 
      60       23.092404 
      60       23.090952 
      60       23.092390 
      60       23.090952 
      61       23.092363 
      61       23.090065 
      61       23.081565 
      61       23.041671 
      61       23.001777 
      61       22.993277 
      61       22.990979 
      61       22.992391 
      61       22.990979 
      61       22.993277 
      61       23.001777 
      61       23.041671 
      61       23.081565 
      61       23.090065 
      61       23.092363 
      62       23.090952 
      62       23.092390 
      62       23.090952 
      62       23.092390 
      62       23.090952 
      62       23.092390 
      62       23.090952 
      62       23.092363 
      62       23.090065 
      62       23.081592 
      62       23.042557 
      62       23.012575 
      62       23.041671 
      62       23.070767 
      62       23.040785 
      62       23.001750 
      62       22.993277 
      62       22.991005 
      62       22.993277 
      62       23.001777 
      62       23.041671 
      63       23.081539 
      63       23.089192 
      63       23.081995 
      63       23.047527 
      63       23.031829 
      63       23.063197 
      63       23.084236 
      63       23.081109 
      63       23.041658 
      63       23.001803 
      63       22.994163 
      63       23.001777 
      63       23.040785 
      63       23.070740 
      63       23.040784 
      63       23.001750 
      63       22.993277 
      63       22.990979 
      63       22.992404 
      63       22.991408 
      63       22.998219 
      63       23.020132 
      63       23.051969 
      63       23.041671 
      63       23.031373 
      63       23.063184 
      63       23.084236 
      64       23.081136 
      64       23.042544 
      64       23.012602 
      64       23.042558 
      64       23.081592 
      64       23.090052 
      64       23.091907 
      64       23.085123 
      64       23.063224 
      64       23.031803 
      64       23.046640 
      64       23.071224 
      64       23.041685 
      64       23.012575 
      64       23.042557 
      64       23.081565 
      64       23.089179 
      64       23.081538 
      64       23.041671 
      64       23.001763 
      65       22.992834 
      65       22.985606 
      65       22.969080 
      65       22.961883 
      65       23.017474 
      65       23.076166 
      65       23.089622 
      65       23.092323 
      65       23.090065 
      65       23.081592 
      65       23.042557 
      65       23.012575 
      65       23.041671 
      65       23.070767 
      65       23.040785 
      65       23.001777 
      65       22.994163 
      65       23.001777 
      65       23.040785 
      65       23.070740 
      65       23.040785 
      65       23.001777 
      66       22.994163 
      66       23.001777 
      66       23.040785 
      66       23.070740 
      66       23.040785 
      66       23.001777 
      66       22.994163 
      66       23.001777 
      66       23.040785 
      66       23.070767 
      66       23.041671 
      66       23.012575 
      66       23.042557 
      66       23.081565 
      66       23.089179 
      66       23.081565 
      66       23.042557 
      66       23.012575 
      66       23.041671 
      66       23.070794 
      66       23.041671 
      66       23.012575 
      66       23.042544 
      66       23.081135 
      66       23.084210 
      66       23.062311 
      66       23.021004 
      66       22.998246 
      66       22.991409 
      67       22.992404 
      67       22.990952 
      67       22.992390 
      67       22.990952 
      67       22.992390 
      67       22.990938 
      67       22.991947 
      67       22.985553 
      67       22.968193 
      67       22.951058 
      67       22.968193 
      67       22.985553 
      67       22.991947 
      67       22.990938 
      67       22.992390 
      67       22.990952 
      67       22.992390 
      67       22.990952 
      68       22.992390 
      68       22.990952 
      68       22.992390 
      68       22.990952 
      68       22.992390 
      68       22.990952 
      68       22.992390 
      68       22.990952 
      68       22.992390 
      68       22.990952 
      68       22.992390 
      68       22.990952 
      68       22.992390 
      68       22.990952 
      69       22.992390 
      69       22.990952 
      69       22.992390 
      69       22.990952 
      69       22.992390 
      69       22.990938 
      69       22.991947 
      69       22.985553 
      69       22.968193 
      69       22.951058 
      69       22.968193 
      69       22.985553 
      69       22.991947 
      69       22.990938 
      69       22.992390 
      69       22.990952 
      69       22.992390 
      69       22.990952 
      69       22.992390 
      69       22.990952 
      69       22.992390 
      69       22.990952 
      69       22.992390 
      69       22.990952 
      70       22.992390 
      70       22.990952 
      70       22.992390 
      70       22.990938 
      70       22.991947 
      70       22.985553 
      70       22.968193 
      70       22.951058 
      70       22.968193 
      70       22.985553 
      70       22.991947 
      70       22.990938 
      70       22.992390 
      70       22.990938 
      70       22.991934 
      70       22.985123 
      70       22.963224 
      70       22.931830 
      70       22.947527 
      70       22.982022 
      70       22.990079 
      70       22.992364 
      70       22.990952 
      70       22.992390 
      70       22.990952 
      70       22.992390 
      70       22.990952 
      70       22.992390 
      70       22.990952 
      70       22.992390 
      70       22.990952 
      71       22.992390 
      71       22.990952 
      71       22.992390 
      71       22.990952 
      71       22.992390 
      71       22.990952 
      71       22.992390 
      71       22.990925 
      71       22.991504 
      71       22.980154 
      71       22.943996 
      71       22.911163 
      71       22.943996 
      71       22.980154 
      71       22.991504 
      71       22.990925 
      71       22.992390 
      71       22.990952 
      71       22.992390 
      71       22.990952 
      71       22.992390 
      71       22.990938 
      71       22.991934 
      71       22.985123 
      71       22.963224 
      71       22.931830 
      71       22.947527 
      71       22.982022 
      71       22.990079 
      71       22.992364 
      71       22.990952 
      72       22.992390 
      72       22.990952 
      72       22.992390 
      72       22.990952 
      72       22.992390 
      72       22.990952 
      72       22.992390 
      72       22.990925 
      72       22.991504 
      72       22.980154 
      72       22.943996 
      72       22.911163 
      72       22.943996 
      72       22.980153 
      72       22.991477 
      72       22.990052 
      72       22.982022 
      72       22.947527 
      72       22.931830 
      72       22.963224 
      72       22.985123 
      72       22.991934 
      72       22.990938 
      72       22.992390 
      72       22.990952 
      72       22.992390 
      72       22.990952 
      72       22.992390 
      72       22.990952 
      72       22.992390 
      72       22.990952 
      72       22.992390 
      72       22.990938 
      72       22.991934 
      72       22.985123 
      72       22.963211 
      72       22.931387 
      72       22.942128 
      73       22.957825 
      73       22.950184 
      73       22.968167 
      73       22.985552 
      73       22.991947 
      73       22.990925 
      73       22.991934 
      73       22.985123 
      73       22.963224 
      73       22.931830 
      73       22.947527 
      73       22.982022 
      73       22.990079 
      73       22.992364 
      73       22.990952 
      73       22.992390 
      73       22.990952 
      73       22.992390 
      73       22.990952 
      73       22.992390 
      73       22.990952 
      73       22.992390 
      73       22.990952 
      73       22.992364 
      73       22.990079 
      73       22.982022 
      73       22.947527 
      73       22.931803 
      73       22.962337 
      73       22.974284 
      73       22.942183 
      73       22.894066 
      73       22.860607 
      73       22.812077 
      73       22.839097 
      74       22.925447 
      74       22.969464 
      74       22.941631 
      74       22.912575 
      74       22.942557 
      74       22.981592 
      74       22.990052 
      74       22.991920 
      74       22.985552 
      74       22.968193 
      74       22.951058 
      74       22.968193 
      74       22.985553 
      74       22.991947 
      74       22.990938 
      74       22.992390 
      74       22.990938 
      74       22.991934 
      74       22.985123 
      74       22.963224 
      74       22.931830 
      74       22.947527 
      74       22.982022 
      74       22.990052 
      74       22.991464 
      74       22.979697 
      74       22.938154 
      74       22.881540 
      74       22.879018 
      74       22.905264 
      74       22.913514 
      74       22.905294 
      74       22.943513 
      74       22.979267 
      74       22.981122 
      74       22.947043 
      74       22.925960 
      74       22.932728 
      74       22.909777 
      74       22.873593 
      74       22.851501 
      74       22.868207 
      75       22.885553 
      75       22.891920 
      75       22.890052 
      75       22.881592 
      75       22.842531 
      75       22.811716 
      75       22.831786 
      75       22.834084 
      75       22.821062 
      75       22.891934 
      75       22.954973 
      75       22.920657 
      75       22.880654 
      75       22.885649 
      75       22.880211 
      75       22.915258 
      75       22.930776 
      75       22.852080 
      75       22.798208 
      75       22.845312 
      75       22.908903 
      75       22.950613 
      75       22.935789 
      75       22.901346 
      75       22.894137 
      75       22.901360 
      75       22.936272 
      75       22.957368 
      75       22.950158 
      75       22.967723 
      75       22.980153 
      75       22.967696 
      75       22.949258 
      75       22.946113 
      75       22.882049 
      75       22.792379 
      75       22.785734 
      75       22.834874 
      75       22.877175 
      75       22.864403 
      75       22.853451 
      75       22.859474 
      75       22.858834 
      75       22.825005 
      75       22.830583 
      75       22.869815 
      75       22.925113 
      75       22.914206 
      75       22.828728 
      75       22.778940 
      75       22.841698 
      75       22.905263 
      75       22.864565 
      76       22.808022 
      76       22.804531 
      76       22.839843 
      76       22.878035 
      76       22.869385 
      76       22.872692 
      76       22.880583 
      76       22.867763 
      76       22.851044 
      76       22.868166 
      76       22.884680 
      76       22.881579 
      76       22.847513 
      76       22.831816 
      76       22.862781 
      76       22.879724 
      76       22.867750 
      76       22.851501 
      76       22.874022 
      76       22.914693 
      76       22.950209 
      76       22.925850 
      76       22.862408 
      76       22.846102 
      76       22.854751 
      76       22.829531 
      76       22.848912 
      76       22.879710 
      76       22.881148 
      76       22.847460 
      76       22.830499 
      76       22.846973 
      76       22.810785 
      76       22.751514 
      76       22.731484 
      76       22.754615 
      76       22.828284 
      76       22.846876 
      76       22.812144 
      76       22.746088 
      76       22.704585 
      76       22.703550 
      76       22.752079 
      76       22.825407 
      76       22.855125 
      76       22.833074 
      76       22.785193 
      76       22.721988 
      76       22.752966 
      77       22.817820 
      77       22.823757 
      77       22.835305 
      77       22.821472 
      77       22.745229 
      77       22.685290 
      77       22.676598 
      77       22.713070 
      77       22.728548 
      77       22.713070 
      77       22.676584 
      77       22.684820 
      77       22.738903 
      77       22.785175 
      77       22.731746 
      77       22.659308 
      77       22.708922 
      77       22.821056 
      77       22.867099 
      77       22.836757 
      77       22.775644 
      77       22.748535 
      77       22.730361 
      77       22.700571 
      77       22.690027 
      77       22.758350 
      77       22.787710 
      77       22.743096 
      77       22.692298 
      77       22.722013 
      77       22.760425 
      77       22.717004 
      77       22.671325 
      77       22.701733 
      77       22.698633 
      77       22.650711 
      77       22.699066 
      77       22.770337 
      77       22.778394 
      77       22.743956 
      77       22.711579 
      77       22.748509 
      77       22.793539 
      77       22.782521 
      77       22.728632 
      77       22.709860 
      77       22.678036 
      77       22.685636 
      77       22.748398 
      77       22.752328 
      77       22.718443 
      77       22.676584 
      77       22.679475 
      77       22.716049 
      77       22.761880 
      77       22.784170 
      77       22.780276 
      78       22.732632 
      78       22.674979 
      78       22.710303 
      78       22.803047 
      78       22.789125 
      78       22.758283 
      78       22.752302 
      78       22.641738 
      78       22.533244 
      78       22.551625 
      78       22.610260 
      78       22.661425 
      78       22.684183 
      78       22.681162 
      78       22.643444 
      78       22.623816 
      78       22.695438 
      78       22.773867 
      78       22.718301 
      78       22.589224 
      78       22.530142 
      78       22.586506 
      78       22.643054 
      78       22.628658 
      78       22.650201 
      78       22.695450 
      78       22.747884 
      78       22.737130 
      78       22.634473 
      78       22.585250 
      78       22.586036 
      78       22.581606 
      78       22.547098 
      78       22.527343 
      78       22.550685 
      78       22.603561 
      78       22.685981 
      78       22.675266 
      78       22.609779 
      78       22.594635 
      78       22.577425 
      78       22.528768 
      78       22.430902 
      78       22.392503 
      78       22.438573 
      78       22.559663 
      78       22.657231 
      78       22.658726 
      78       22.689568 
      78       22.708017 
      78       22.629544 
      78       22.596049 
      78       22.640272 
      78       22.691460 
      78       22.665829 
      78       22.635939 
      79       22.654628 
      79       22.658325 
      79       22.708490 
      79       22.796682 
      79       22.752854 
      79       22.655570 
      79       22.597348 
      79       22.565896 
      79       22.618443 
      79       22.663070 
      79       22.632325 
      79       22.568558 
      79       22.593320 
      79       22.689135 
      79       22.704805 
      79       22.611205 
      79       22.561842 
      79       22.573992 
      79       22.539843 
      79       22.508589 
      79       22.516089 
      79       22.534084 
      79       22.536786 
      79       22.595921 
      79       22.667612 
      79       22.667156 
      79       22.655568 
      79       22.596710 
      79       22.492931 
      79       22.457384 
      79       22.480277 
      79       22.479782 
      79       22.515728 
      79       22.537531 
      79       22.493320 
      79       22.520149 
      79       22.620959 
      79       22.589122 
      79       22.476737 
      79       22.454698 
      79       22.483351 
      79       22.499118 
      79       22.519175 
      79       22.474381 
      79       22.386150 
      79       22.423290 
      79       22.481079 
      79       22.438097 
      79       22.380724 
      79       22.368155 
      79       22.440838 
      79       22.506149 
      80       22.476223 
      80       22.466355 
      80       22.522789 
      80       22.529973 
      80       22.500004 
      80       22.483324 
      80       22.452926 
      80       22.455141 
      80       22.492320 
      80       22.460926 
      80       22.417558 
      80       22.443430 
      80       22.486964 
      80       22.512920 
      80       22.515604 
      80       22.436755 
      80       22.349827 
      80       22.370480 
      80       22.479737 
      80       22.560481 
      80       22.538405 
      80       22.502221 
      80       22.479267 
      80       22.422386 
      80       22.313032 
      80       22.267765 
      80       22.304905 
      80       22.319715 
      80       22.340785 
      80       22.352815 
      80       22.330513 
      80       22.342088 
      80       22.357368 
      80       22.344316 
      80       22.337738 
      80       22.312462 
      80       22.301945 
      80       22.389167 
      80       22.546998 
      80       22.566655 
      80       22.505336 
      80       22.469052 
      80       22.441185 
      80       22.430154 
      80       22.448719 
      80       22.497775 
      80       22.471113 
      80       22.389276 
      80       22.292768 
      80       22.282146 
      80       22.312448 
      81       22.270878 
      81       22.237243 
      81       22.265010 
      81       22.301777 
      81       22.369924 
      81       22.434805 
      81       22.404419 
      81       22.325491 
      81       22.269093 
      81       22.222401 
      81       22.209945 
      81       22.250654 
      81       22.322346 
      81       22.340314 
      81       22.343845 
      81       22.348385 
      81       22.293649 
      81       22.249825 
      81       22.227290 
      81       22.246237 
      81       22.271640 
      81       22.246627 
      81       22.230943 
      81       22.253285 
      81       22.246641 
      81       22.249755 
      81       22.274395 
      81       22.256053 
      81       22.282509 
      81       22.351942 
      81       22.378367 
      81       22.361411 
      81       22.315578 
      81       22.273593 
      81       22.245699 
      81       22.239497 
      81       22.232260 
      81       22.276250 
      81       22.341104 
      81       22.334082 
      81       22.291368 
      81       22.255237 
      81       22.254641 
      81       22.305417 
      81       22.317846 
      81       22.338100 
      81       22.341591 
      81       22.342582 
      81       22.333047 
      81       22.230943 
      81       22.166826 
      82       22.174449 
      82       22.140769 
      82       22.120273 
      82       22.175281 
      82       22.262254 
      82       22.264525 
      82       22.249714 
      82       22.255100 
      82       22.228228 
      82       22.233158 
      82       22.212478 
      82       22.184334 
      82       22.198619 
      82       22.167668 
      82       22.152553 
      82       22.231276 
      82       22.285591 
      82       22.243859 
      82       22.203618 
      82       22.192295 
      82       22.197830 
      82       22.215592 
      82       22.237684 
      82       22.239373 
      82       22.238610 
      82       22.227734 
      82       22.262864 
      82       22.350074 
      82       22.395906 
      82       22.367612 
      82       22.333131 
      82       22.272180 
      82       22.231843 
      82       22.239014 
      82       22.239413 
      82       22.238544 
      82       22.225504 
      82       22.235399 
      82       22.222816 
      82       22.161882 
      82       22.163725 
      82       22.225930 
      82       22.251512 
      82       22.230004 
      82       22.235828 
      82       22.223246 
      82       22.166422 
      82       22.177996 
      82       22.227785 
      82       22.238943 
      82       22.243513 
      82       22.245631 
      82       22.267320 
      83       22.280570 
      83       22.272719 
      83       22.270299 
      83       22.289719 
      83       22.298982 
      83       22.330941 
      83       22.314608 
      83       22.226956 
      83       22.156913 
      83       22.139927 
      83       22.126014 
      83       22.141671 
      83       22.157355 
      83       22.144329 
      83       22.138127 
      83       22.116049 
      83       22.103215 
      83       22.116035 
      83       22.137697 
      83       22.139373 
      83       22.138570 
      83       22.126417 
      83       22.147110 
      83       22.182882 
      83       22.200447 
      83       22.235775 
      83       22.251082 
      83       22.215175 
      83       22.179838 
      83       22.180237 
      83       22.221930 
      83       22.206219 
      83       22.160982 
      83       22.169026 
      83       22.184706 
      83       22.181579 
      83       22.147487 
      83       22.130943 
      83       22.152426 
      83       22.136715 
      83       22.111689 
      84       22.136715 
      84       22.152399 
      84       22.130044 
      84       22.136272 
      84       22.128658 
      84       22.091036 
      84       22.122444 
      84       22.166711 
      84       22.152039 
      84       22.160929 
      84       22.221459 
      84       22.219161 
      84       22.151583 
      84       22.102663 
      84       22.094177 
      84       22.101361 
      84       22.136259 
      84       22.156925 
      84       22.144758 
      84       22.143513 
      84       22.139842 
      84       22.139013 
      84       22.131360 
      84       22.165451 
      84       22.192723 
      84       22.154724 
      84       22.147957 
      84       22.164097 
      84       22.179337 
      84       22.226402 
      84       22.219591 
      84       22.151596 
      84       22.102637 
      84       22.093330 
      84       22.091865 
      84       22.103189 
      84       22.139387 
      84       22.173548 
      84       22.156873 
      84       22.191990 
      84       22.284569 
      84       22.290520 
      84       22.208907 
      84       22.169039 
      85       22.137185 
      85       22.101361 
      85       22.093277 
      85       22.091435 
      85       22.098246 
      85       22.120991 
      85       22.161881 
      85       22.179267 
      85       22.162754 
      85       22.131359 
      85       22.141671 
      85       22.151969 
      85       22.120132 
      85       22.098219 
      85       22.091409 
      85       22.092431 
      85       22.091838 
      85       22.103188 
      85       22.139332 
      85       22.171722 
      85       22.133517 
      85       22.074022 
      85       22.032716 
      85       22.047554 
      85       22.082022 
      85       22.090079 
      85       22.092364 
      85       22.090952 
      85       22.092390 
      85       22.090952 
      85       22.092390 
      85       22.090952 
      85       22.092391 
      85       22.090979 
      85       22.093277 
      85       22.101750 
      85       22.140784 
      85       22.170740 
      85       22.140784 
      85       22.101750 
      85       22.093277 
      85       22.090979 
      86       22.092404 
      86       22.091408 
      86       22.098219 
      86       22.120118 
      86       22.151513 
      86       22.135829 
      86       22.101763 
      86       22.098662 
      86       22.115176 
      86       22.132285 
      86       22.115149 
      86       22.097789 
      86       22.091395 
      86       22.092404 
      86       22.090952 
      86       22.092390 
      86       22.090952 
      86       22.092390 
      86       22.090952 
      86       22.092404 
      87       22.091395 
      87       22.097789 
      87       22.115149 
      87       22.132284 
      87       22.115149 
      87       22.097789 
      87       22.091395 
      87       22.092417 
      87       22.091395 
      87       22.097789 
      87       22.115149 
      87       22.132284 
      87       22.115149 
      87       22.097789 
      87       22.091395 
      87       22.092417 
      87       22.091408 
      87       22.098219 
      87       22.120118 
      87       22.151512 
      87       22.135788 
      87       22.100433 
      87       22.082438 
      87       22.041698 
      87       22.001817 
      88       21.994620 
      88       22.007633 
      88       22.070838 
      88       22.140687 
      88       22.134929 
      88       22.101293 
      88       22.093236 
      88       22.090092 
      88       22.081566 
      88       22.041685 
      88       22.002233 
      88       21.999106 
      88       22.020145 
      88       22.051553 
      88       22.037145 
      88       22.017558 
      88       22.067184 
      88       22.126885 
      88       22.138460 
      88       22.137657 
      88       22.115592 
      88       22.097803 
      88       22.091395 
      88       22.092404 
      88       22.090952 
      88       22.092390 
      88       22.090952 
      88       22.092390 
      88       22.090952 
      89       22.092363 
      89       22.090065 
      89       22.081592 
      89       22.042558 
      89       22.012602 
      89       22.042558 
      89       22.081592 
      89       22.090092 
      89       22.093237 
      89       22.101333 
      89       22.136258 
      89       22.156911 
      89       22.144315 
      89       22.138113 
      89       22.115605 
      89       22.097803 
      89       22.091395 
      90       22.092404 
      90       22.090952 
      90       22.092390 
      90       22.090952 
      90       22.092364 
      90       22.090079 
      90       22.082022 
      90       22.047500 
      90       22.030943 
      90       22.052399 
      90       22.035842 
      90       22.001347 
      90       21.994150 
      91       22.001803 
      91       22.041671 
      91       22.081565 
      91       22.090065 
      91       22.092337 
      91       22.090065 
      91       22.081565 
      91       22.041671 
      91       22.001804 
      91       21.994164 
      91       22.001804 
      91       22.041671 
      91       22.081565 
      91       22.090065 
      91       22.092363 
      91       22.090952 
      91       22.092390 
      92       22.090952 
      92       22.092390 
      92       22.090952 
      92       22.092390 
      92       22.090938 
      92       22.091934 
      92       22.085096 
      92       22.062351 
      92       22.021461 
      92       22.004075 
      92       22.020575 
      92       22.051553 
      92       22.036702 
      92       22.012145 
      92       22.042544 
      92       22.081592 
      92       22.090065 
      92       22.092363 
      92       22.090951 
      92       22.092363 
      92       22.090065 
      92       22.081565 
      92       22.041671 
      92       22.001777 
      92       21.993277 
      92       21.990979 
      93       21.992391 
      93       21.990979 
      93       21.993277 
      93       22.001750 
      93       22.040784 
      93       22.070740 
      93       22.040784 
      93       22.001750 
      93       21.993277 
      93       21.990979 
      93       21.992391 
      93       21.990979 
      93       21.993277 
      93       22.001777 
      94       22.041671 
      94       22.081538 
      94       22.089179 
      94       22.081538 
      94       22.041671 
      94       22.001804 
      94       21.994163 
      94       22.001777 
      94       22.040785 
      94       22.070767 
      94       22.041671 
      94       22.012575 
      94       22.042557 
      94       22.081565 
      94       22.089179 
      94       22.081538 
      94       22.041671 
      94       22.001777 
      94       21.993277 
      94       21.990979 
      95       21.992391 
      95       21.990952 
      95       21.992390 
      95       21.990952 
      95       21.992390 
      95       21.990938 
      95       21.991947 
      95       21.985580 
      95       21.969080 
      95       21.961883 
      95       22.017474 
      95       22.076166 
      95       22.089622 
      95       22.092323 
      95       22.090065 
      95       22.081565 
      95       22.041671 
      95       22.001777 
      95       21.993277 
      95       21.990979 
      95       21.992391 
      95       21.990952 
      95       21.992391 
      95       21.990979 
      95       21.993277 
      95       22.001750 
      95       22.040798 
      95       22.071197 
      95       22.046640 
      95       22.031803 
      95       22.063197 
      95       22.084236 
      95       22.081109 
      95       22.041658 
      95       22.001803 
      95       21.994163 
      95       22.001777 
      96       22.040785 
      96       22.070740 
      96       22.040784 
      96       22.001737 
      96       21.992833 
      96       21.985580 
      96       21.968193 
      96       21.951058 
      96       21.968193 
      97       21.985553 
      97       21.991947 
      97       21.990965 
      97       21.993263 
      97       22.001320 
      97       22.035815 
      97       22.051512 
      97       22.020118 
      97       21.998219 
      97       21.991408 
      97       21.992404 
      97       21.990952 
      97       21.992390 
      97       21.990952 
      97       21.992391 
      97       21.990978 
      97       21.993263 
      97       22.001320 
      98       22.035815 
      98       22.051512 
      98       22.020118 
      98       21.998219 
      98       21.991408 
      98       21.992404 
      98       21.990952 
      98       21.992404 
      98       21.991408 
      98       21.998219 
      98       22.020118 
      98       22.051512 
      98       22.035815 
      98       22.001320 
      98       21.993263 
      98       21.990978 
      98       21.992391 
      98       21.990952 
      98       21.992390 
      98       21.990952 
      98       21.992390 
      98       21.990952 
      98       21.992390 
      98       21.990952 
      98       21.992390 
      98       21.990952 
      98       21.992390 
      98       21.990952 
      98       21.992390 
      98       21.990952 
      99       21.992390 
      99       21.990952 
      99       21.992390 
      99       21.990952 
      99       21.992390 
      99       21.990952 
      99       21.992390 
      99       21.990952 
      99       21.992390 
      99       21.990952 
      99       21.992390 
      99       21.990952 
      99       21.992390 
      99       21.990952 
      99       21.992390 
      99       21.990952 
      99       21.992390 
      99       21.990952 
      99       21.992390 
      99       21.990952 
      99       21.992390 
      99       21.990952 
      99       21.992390 
      99       21.990952 
      100       21.992390 
      100       21.990952 
      100       21.992390 
      100       21.990952 
      100       21.992390 
      100       21.990952 
      100       21.992390 
      100       21.990952 
      100       21.992390 
      100       21.990952 
      100       21.992390 
      100       21.990938 
      100       21.991947 
      100       21.985552 
      100       21.968167 
      100       21.950184 
      100       21.957825 
      100       21.942128 
      100       21.931387 
      100       21.963210 
      100       21.985109 
      100       21.991491 
      100       21.985539 
      100       21.968193 
      100       21.951058 
      100       21.968193 
      100       21.985553 
      100       21.991947 
      101       21.990938 
      101       21.992390 
      101       21.990952 
      101       21.992390 
      101       21.990952 
