

 time    ||    gripping force   ||   raspberry measurement 

      0       160.090000       -797.004348 
      0       114.430000       -797.004348 
      0       29.660000       -797.004348 
      0       8.990000       -797.004348 
      0       11.830000       -797.004348 
      0       13.220000       -797.004348 
      0       62.990000       -797.004348 
      0       164.470000       -797.004348 
      0       243.870000       -797.004348 
      1       179.470000       -789.034300 
      1       122.340000       -781.142783 
      1       130.040000       -773.225761 
      1       155.960000       -769.693715 
      1       175.180000       -726.667614 
      1       176.400000       -533.879814 
      1       170.510000       -216.273200 
      1       156.990000       -24.310383 
      1       148.850000       17.661512 
      2       160.010000       20.641234 
      2       159.950000       20.714667 
      3       159.770000       21.174456 
      3       159.550000       22.411785 
      3       159.740000       23.952380 
      4       159.730000       24.545441 
      4       159.720000       23.943643 
      4       159.820000       23.332634 
      4       159.890000       23.372041 
      4       159.510000       23.663850 
      4       160.010000       23.891390 
      4       159.980000       23.932049 
      5       160.020000       23.779793 
      5       159.950000       23.660235 
      5       159.830000       23.669092 
      5       159.780000       23.706367 
      5       159.730000       23.714787 
      5       159.740000       23.717058 
      6       159.880000       23.714786 
      6       160.350000       23.706313 
      6       160.360000       23.667279 
      6       160.310000       23.637296 
      6       160.330000       23.666392 
      6       160.280000       23.695488 
      6       160.330000       23.665506 
      7       160.230000       23.626471 
      7       160.190000       23.617998 
      7       160.170000       23.615740 
      7       160.190000       23.618455 
      8       160.200000       23.632327 
      8       160.160000       23.695532 
      8       160.190000       23.764522 
      9       160.080000       23.748852 
      9       160.170000       23.677620 
      10       160.050000       23.638196 
      10       160.110000       23.667306 
      11       160.090000       23.706314 
      11       160.030000       23.714787 
      11       160.060000       23.717085 
      11       160.070000       23.715673 
      11       160.110000       23.717111 
      11       160.050000       23.715660 
      12       160.120000       23.716655 
      12       160.020000       23.709817 
      12       160.090000       23.687059 
      12       160.090000       23.645726 
      12       160.080000       23.622967 
      12       160.120000       23.616130 
      12       159.990000       23.617125 
      12       160.100000       23.615673 
      14       160.010000       23.617111 
      14       160.000000       23.615673 
      14       160.050000       23.617111 
      14       160.070000       23.615673 
      15       160.020000       23.617111 
      15       160.070000       23.615660 
      15       160.040000       23.616668 
      15       160.070000       23.610274 
      15       160.060000       23.592914 
      15       160.020000       23.575779 
      15       160.060000       23.592914 
      15       159.970000       23.610274 
      15       160.110000       23.616668 
      16       160.000000       23.615660 
      16       160.030000       23.617112 
      16       160.040000       23.615700 
      16       160.040000       23.617998 
      16       160.010000       23.626471 
      17       160.090000       23.665519 
      17       160.010000       23.695918 
      17       160.040000       23.671335 
      18       160.120000       23.655637 
      18       159.960000       23.677120 
      18       159.960000       23.660563 
      18       160.080000       23.626042 
      18       159.890000       23.617998 
      20       160.080000       23.616156 
      20       159.990000       23.622941 
      20       159.980000       23.644840 
      20       160.050000       23.676260 
      20       159.990000       23.661410 
      20       160.050000       23.636410 
      20       160.080000       23.661436 
      20       160.050000       23.677147 
      21       160.020000       23.655664 
      21       160.020000       23.672208 
      21       159.950000       23.706286 
      21       160.120000       23.708971 
      21       159.960000       23.687919 
      22       159.960000       23.656564 
      22       160.060000       23.672691 
      22       160.130000       23.712142 
      22       159.940000       23.738997 
      23       159.970000       23.756979 
      23       160.020000       23.739870 
      24       160.010000       23.722484 
      24       159.970000       23.715243 
      25       160.070000       23.706756 
      25       159.960000       23.672221 
      25       159.980000       23.655664 
      25       160.020000       23.677120 
      26       159.910000       23.660563 
      26       160.000000       23.626042 
      26       160.030000       23.617985 
      26       159.860000       23.615700 
      27       159.970000       23.617112 
      27       159.920000       23.615700 
      27       159.940000       23.617998 
      27       160.060000       23.626458 
      28       159.940000       23.665063 
      28       159.970000       23.690089 
      29       160.390000       23.642195 
      30       160.450000       23.597402 
      30       160.390000       23.643081 
      30       160.290000       23.700887 
      31       160.310000       23.713457 
      31       160.350000       23.706273 
      31       160.260000       23.667278 
      31       160.280000       23.637296 
      31       160.300000       23.666392 
      31       160.260000       23.695488 
      31       160.250000       23.665506 
      31       160.410000       23.626471 
      32       160.190000       23.617998 
      32       160.300000       23.615700 
      32       160.270000       23.617112 
      32       160.230000       23.615673 
      33       160.170000       23.617112 
      33       160.280000       23.615700 
      33       160.400000       23.617998 
      33       160.150000       23.626471 
      35       159.610000       23.665506 
      35       159.650000       23.695488 
      35       159.590000       23.666392 
      35       159.350000       23.637310 
      36       159.630000       23.667721 
      36       159.620000       23.711686 
      36       159.790000       23.738097 
      36       159.850000       23.746181 
      37       159.770000       23.691475 
      37       159.860000       23.642695 
      37       159.620000       23.666835 
      37       159.850000       23.695502 
      37       159.710000       23.665506 
      38       159.750000       23.626498 
      38       159.780000       23.618884 
      38       159.700000       23.626498 
      39       159.790000       23.665506 
      39       159.730000       23.695488 
      39       159.670000       23.666392 
      39       159.730000       23.637269 
      39       159.690000       23.666392 
      39       159.770000       23.695488 
      39       159.760000       23.665506 
      39       159.760000       23.626498 
      39       159.760000       23.618884 
      40       160.040000       23.626498 
      40       160.120000       23.665506 
      41       160.060000       23.695462 
      41       159.920000       23.665506 
      41       159.910000       23.626498 
      41       159.860000       23.618884 
      41       159.890000       23.626498 
      41       159.910000       23.665506 
      41       159.930000       23.695462 
      41       159.930000       23.665519 
      41       159.920000       23.626928 
      42       159.880000       23.623853 
      42       159.920000       23.645739 
      42       159.890000       23.686602 
      42       159.900000       23.703961 
      42       159.930000       23.686602 
      42       159.930000       23.645739 
      44       159.990000       23.623853 
      44       159.870000       23.626928 
      44       159.920000       23.665519 
      44       159.860000       23.695488 
      44       159.910000       23.666392 
      44       159.890000       23.637269 
      45       159.920000       23.666392 
      45       159.910000       23.695515 
      45       159.920000       23.666392 
      45       159.920000       23.637269 
      46       159.910000       23.666392 
      46       159.930000       23.695488 
      47       159.880000       23.665506 
      47       159.650000       23.626471 
      47       159.910000       23.617998 
      47       159.880000       23.615700 
      47       159.860000       23.617112 
      47       159.910000       23.615673 
      47       159.880000       23.617111 
      47       159.850000       23.615673 
      48       159.870000       23.617111 
      48       159.850000       23.615673 
      48       159.670000       23.617112 
      48       159.840000       23.615700 
      48       160.040000       23.617998 
      49       159.940000       23.626471 
      49       159.850000       23.665506 
      50       160.020000       23.695462 
      50       159.830000       23.665506 
      50       159.940000       23.626471 
      50       159.860000       23.617998 
      50       159.910000       23.615700 
      51       159.860000       23.617112 
      51       159.920000       23.615673 
      51       159.940000       23.617125 
      52       160.070000       23.616129 
      52       159.970000       23.622940 
      52       159.930000       23.644840 
      52       159.910000       23.676260 
      52       159.920000       23.661423 
      52       159.920000       23.636866 
      52       159.900000       23.667265 
      53       159.930000       23.706313 
      53       159.930000       23.714787 
      53       159.980000       23.717085 
      53       159.970000       23.715673 
      53       159.940000       23.717111 
      53       159.950000       23.715673 
      53       159.940000       23.717111 
      53       159.910000       23.715673 
      54       160.010000       23.717085 
      54       159.980000       23.714786 
      54       159.990000       23.706286 
      54       159.950000       23.666392 
      55       159.960000       23.626498 
      55       159.940000       23.617998 
      55       160.070000       23.615700 
      55       160.030000       23.617125 
      55       159.920000       23.616130 
      55       159.920000       23.622967 
      55       160.000000       23.645726 
      56       159.830000       23.687059 
      56       159.920000       23.709817 
      56       159.990000       23.716628 
      56       159.970000       23.714773 
      57       160.070000       23.706286 
      57       160.060000       23.666392 
      58       160.010000       23.626498 
      58       160.040000       23.618012 
      58       159.990000       23.616156 
      58       160.100000       23.622941 
      58       159.820000       23.644840 
      58       159.980000       23.676260 
      59       159.790000       23.661423 
      59       159.970000       23.636839 
      60       159.790000       23.666379 
      60       159.940000       23.695488 
      60       160.010000       23.665506 
      60       159.970000       23.626498 
      60       159.980000       23.618884 
      60       159.880000       23.626525 
