

 time    ||    gripping force   ||   raspberry measurement 

      0       0.060000       -797.960000 
      0       0.330000       -797.960000 
      0       0.620000       -797.960000 
      0       0.620000       -797.960000 
      0       1.080000       -797.960000 
      0       1.080000       -797.960000 
      1       2.780000       -789.980400 
      1       3.130000       -782.080596 
      1       4.210000       -774.259790 
      1       4.180000       -766.517187 
      1       4.150000       -758.850841 
      1       4.350000       -751.156617 
      2       6.500000       -747.620432 
      2       6.440000       -704.540610 
      2       6.400000       -511.467200 
      2       6.430000       -193.131926 
      3       8.040000       -0.042819 
      3       8.040000       43.040091 
      4       8.510000       46.577701 
      4       8.450000       46.678103 
      4       8.500000       46.661930 
      4       8.460000       46.644826 
      4       8.470000       46.662821 
      4       8.560000       46.690093 
      5       14.590000       46.734083 
      5       23.020000       46.764469 
      5       30.200000       46.734526 
      5       29.750000       46.695492 
      5       29.570000       46.687018 
      6       29.210000       46.684707 
      6       29.150000       46.685689 
      6       28.970000       46.679294 
      6       28.960000       46.661935 
      6       28.840000       46.644799 
      6       28.740000       46.661935 
      6       28.630000       46.679321 
      6       28.540000       46.686575 
      6       28.530000       46.695505 
      6       28.460000       46.735439 
      6       28.470000       46.776180 
      7       28.330000       46.794189 
      7       28.240000       46.829987 
      7       28.280000       46.851123 
      7       28.240000       46.844369 
      7       28.180000       46.867737 
      7       28.130000       46.908434 
      7       28.110000       46.943925 
      7       28.130000       46.918759 
      7       28.090000       46.847124 
      7       28.020000       46.813032 
      8       28.050000       46.865036 
      8       27.960000       46.928627 
      8       28.020000       46.899491 
      8       27.920000       46.835469 
      8       27.900000       46.836729 
      8       27.870000       46.851136 
      8       27.890000       46.838071 
      8       27.820000       46.831856 
      8       27.860000       46.809374 
      9       27.770000       46.792418 
      9       27.760000       46.795518 
      9       27.730000       46.830014 
      9       27.690000       46.850693 
      9       27.650000       46.839386 
      9       27.680000       46.848052 
      9       27.630000       46.881938 
      10       27.610000       46.911227 
      10       27.650000       46.857728 
      10       27.630000       46.802343 
      10       27.560000       46.786023 
      10       27.560000       46.786172 
      10       27.570000       46.784694 
      10       27.560000       46.786132 
      10       27.560000       46.784680 
      10       27.580000       46.785689 
      10       28.930000       46.779294 
      10       29.680000       46.761935 
      11       29.870000       46.744826 
      11       30.220000       46.762821 
      11       30.320000       46.790093 
      11       30.270000       46.834083 
      11       30.380000       46.864495 
      11       31.000000       46.835399 
      11       31.040000       46.805860 
      11       31.040000       46.830430 
      11       31.080000       46.844824 
      11       31.050000       46.808004 
      12       31.040000       46.761922 
      12       31.060000       46.715686 
      12       31.030000       46.698743 
      12       31.020000       46.726001 
      12       30.970000       46.804460 
      12       30.950000       46.857740 
      12       30.950000       46.823244 
      12       30.920000       46.746198 
      12       30.880000       46.696431 
      12       30.900000       46.687932 
      13       30.860000       46.695546 
      13       30.830000       46.735413 
      13       30.760000       46.775307 
      13       30.820000       46.783807 
      14       30.770000       46.786118 
      14       30.770000       46.785136 
      14       30.760000       46.791531 
      14       30.700000       46.808891 
      14       30.810000       46.826040 
      14       30.690000       46.809347 
      14       30.720000       46.797360 
      14       30.740000       46.814303 
      14       30.710000       46.845267 
      14       30.730000       46.829557 
      15       30.690000       46.795062 
      15       30.640000       46.787005 
      15       30.640000       46.784720 
      15       30.670000       46.786132 
      15       30.650000       46.784693 
      15       30.620000       46.786132 
      15       30.640000       46.784693 
      15       30.620000       46.786132 
      16       30.560000       46.784720 
      16       30.630000       46.787005 
      16       30.600000       46.795062 
      16       30.590000       46.829557 
      16       30.590000       46.845254 
      16       30.620000       46.813860 
      16       30.570000       46.791961 
      17       30.520000       46.785150 
      17       30.560000       46.786145 
      17       30.580000       46.784694 
      17       30.490000       46.786132 
      17       30.490000       46.784694 
      17       30.510000       46.786145 
      18       30.450000       46.785123 
      18       30.420000       46.791075 
      18       30.530000       46.803075 
      18       30.430000       46.797316 
      18       30.400000       46.755597 
      18       30.430000       46.775834 
      18       30.370000       46.835329 
      19       30.380000       46.828697 
      19       30.440000       46.795035 
      19       30.420000       46.787005 
      19       30.400000       46.784720 
      19       30.370000       46.786132 
      19       30.410000       46.784720 
      19       30.320000       46.787005 
      20       30.370000       46.795062 
      20       30.390000       46.829557 
      20       30.350000       46.845254 
      20       30.350000       46.813860 
      20       30.330000       46.791961 
      20       30.270000       46.785150 
      20       30.320000       46.786145 
      20       30.290000       46.784694 
      20       30.320000       46.786132 
      21       30.370000       46.784693 
      21       30.310000       46.786132 
      21       30.330000       46.784693 
      21       30.320000       46.786132 
      21       30.310000       46.784693 
      21       30.310000       46.786132 
      21       30.360000       46.784693 
      21       30.300000       46.786105 
      21       30.270000       46.783807 
      21       30.350000       46.775334 
      21       30.330000       46.736299 
      22       30.300000       46.706343 
      22       30.220000       46.736299 
      22       30.270000       46.775334 
      22       30.240000       46.783807 
      23       30.260000       46.786105 
      23       30.230000       46.784693 
      23       30.220000       46.786132 
      23       30.230000       46.784720 
      23       30.240000       46.787005 
      24       30.230000       46.795062 
      24       30.250000       46.829557 
      24       30.210000       46.845254 
      24       30.100000       46.813860 
      24       30.170000       46.791974 
      24       30.130000       46.785606 
      24       30.200000       46.791974 
      24       30.190000       46.813860 
      25       30.130000       46.845254 
      25       30.160000       46.829557 
      25       30.180000       46.795062 
      25       30.140000       46.787005 
      26       30.150000       46.784720 
      26       30.150000       46.786132 
      26       30.200000       46.784693 
      26       30.090000       46.786132 
      26       30.100000       46.784693 
      26       30.160000       46.786132 
      27       30.170000       46.784693 
      27       30.120000       46.786132 
      27       30.130000       46.784693 
      27       30.130000       46.786132 
      27       30.100000       46.784693 
      27       30.100000       46.786105 
      27       30.060000       46.783807 
      27       30.060000       46.775334 
      27       30.110000       46.736299 
      28       30.070000       46.706317 
      28       30.100000       46.735413 
      28       30.100000       46.764535 
      28       30.060000       46.735399 
      29       30.100000       46.705860 
      29       30.050000       46.730470 
      29       30.040000       46.746167 
      29       30.070000       46.724685 
      29       30.080000       46.741242 
      29       30.070000       46.775763 
      30       30.060000       46.783820 
      30       30.050000       46.786105 
      30       30.040000       46.784693 
      30       30.030000       46.786105 
      30       30.020000       46.783807 
      31       30.020000       46.775334 
      31       30.000000       46.736299 
      32       29.990000       46.706343 
      32       29.970000       46.736299 
      32       29.940000       46.775334 
      32       30.030000       46.783807 
      32       29.980000       46.786119 
      33       30.010000       46.785150 
      33       29.930000       46.791961 
      33       29.980000       46.813860 
      33       30.000000       46.845254 
      33       29.950000       46.829557 
      33       29.970000       46.795061 
      33       29.970000       46.786978 
      35       29.890000       46.783834 
      35       29.970000       46.775334 
      35       29.930000       46.736299 
      35       29.910000       46.706343 
      36       29.930000       46.736299 
      36       29.890000       46.775334 
      37       29.940000       46.783807 
      37       29.870000       46.786105 
      37       29.900000       46.784693 
      37       29.860000       46.786105 
      37       29.910000       46.783807 
      37       29.910000       46.775334 
      37       29.940000       46.736299 
      38       29.870000       46.706317 
      38       29.920000       46.735413 
      38       29.820000       46.764535 
      38       29.970000       46.735413 
      38       29.830000       46.706290 
      38       29.840000       46.735412 
      38       29.890000       46.764509 
      38       29.890000       46.734526 
      39       29.870000       46.695492 
      39       29.820000       46.687032 
      39       29.870000       46.685177 
      39       29.840000       46.691961 
      39       29.860000       46.713860 
      39       29.900000       46.745254 
      39       29.910000       46.729557 
      40       29.880000       46.695088 
      40       29.930000       46.687891 
      40       29.870000       46.695518 
      40       29.770000       46.734540 
      42       29.860000       46.764938 
      42       29.850000       46.740355 
      42       29.800000       46.724671 
      42       29.820000       46.746597 
      42       29.850000       46.735413 
      42       29.830000       46.724242 
      43       29.810000       46.746583 
      43       29.840000       46.735399 
      43       29.880000       46.723785 
      43       29.780000       46.740728 
      43       29.830000       46.705387 
      44       29.800000       46.655195 
      44       29.820000       46.663695 
      44       29.790000       46.690146 
      44       29.860000       46.734970 
      45       29.730000       46.775294 
      45       29.800000       46.783806 
      46       29.780000       46.786078 
      46       29.820000       46.783820 
      46       29.810000       46.775763 
      46       29.790000       46.741242 
      46       29.840000       46.724685 
      46       29.780000       46.746167 
      46       29.830000       46.730470 
      46       29.760000       46.705860 
      48       29.750000       46.735399 
      48       29.820000       46.764535 
      49       29.750000       46.735413 
      49       29.690000       46.706317 
      50       29.760000       46.736299 
      50       29.690000       46.775307 
      50       29.710000       46.782921 
      50       29.840000       46.775307 
      51       29.750000       46.736299 
      51       29.740000       46.706317 
      51       29.730000       46.735413 
      51       29.710000       46.764535 
      52       29.740000       46.735413 
      52       29.670000       46.706290 
      53       29.680000       46.735412 
      53       29.730000       46.764509 
      54       29.710000       46.734526 
      54       29.710000       46.695492 
      54       29.660000       46.687018 
      54       29.650000       46.684720 
      54       29.730000       46.686132 
      54       29.670000       46.684693 
      54       29.640000       46.686132 
      55       29.660000       46.684693 
      55       29.680000       46.686132 
      55       29.750000       46.684720 
      55       29.690000       46.687005 
      56       29.660000       46.695062 
      56       29.700000       46.729557 
      56       29.680000       46.745254 
      56       29.650000       46.713860 
      57       29.680000       46.691961 
      57       29.660000       46.685150 
      57       29.630000       46.686146 
      57       29.670000       46.684720 
      58       29.690000       46.687018 
      58       29.630000       46.695492 
      58       29.670000       46.734526 
      58       29.670000       46.764482 
      59       29.670000       46.734526 
      59       29.720000       46.695492 
      59       29.670000       46.687019 
      59       29.650000       46.684747 
      59       29.670000       46.687019 
      59       29.610000       46.695492 
      59       29.610000       46.734526 
      59       29.690000       46.764509 
      60       29.680000       46.735412 
      60       29.670000       46.706290 
      60       29.650000       46.735412 
      60       29.660000       46.764509 
      60       29.610000       46.734526 
      60       29.620000       46.695492 
