

 time    ||    gripping force   ||   raspberry measurement 

      0       0.160000       -794.950000 
      0       1.610000       -794.950000 
      0       0.030000       -794.950000 
      0       0.120000       -794.950000 
      0       0.130000       -794.950000 
      1       0.070000       -787.000500 
      1       0.050000       -779.130495 
      1       0.030000       -771.339190 
      1       0.100000       -763.625798 
      1       0.150000       -755.989535 
      1       0.090000       -748.428473 
      1       0.130000       -740.839122 
      1       0.210000       -737.324680 
      1       0.230000       -694.510273 
      1       0.070000       -502.632458 
      1       0.340000       -186.290457 
      1       2.020000       5.571661 
      2       2.380000       48.382940 
      2       11.620000       51.894668 
      2       33.750000       51.992308 
      2       43.850000       51.954440 
      2       60.470000       51.924059 
      2       91.950000       51.949059 
      2       132.700000       51.969295 
      2       185.100000       51.962058 
      2       212.860000       51.979610 
      2       216.370000       51.991623 
      2       208.620000       51.974681 
      2       198.540000       51.943690 
      2       183.430000       51.958540 
      3       179.390000       51.983124 
      3       177.000000       51.953613 
      3       176.030000       51.925499 
      3       172.860000       51.969973 
      3       167.480000       52.105592 
      3       165.970000       52.450957 
      3       152.660000       53.140504 
      3       148.600000       54.061656 
      4       142.690000       55.024626 
      4       141.380000       55.851618 
      4       140.180000       56.307651 
      5       134.160000       56.337459 
      5       132.050000       56.192028 
      5       131.580000       56.061573 
      5       131.010000       55.970237 
      5       130.180000       55.925692 
      5       129.430000       55.866485 
      5       126.290000       55.684398 
      5       118.040000       55.439743 
      5       117.370000       55.221776 
      6       117.360000       55.077518 
      6       117.650000       55.015518 
      6       117.560000       55.005191 
      6       116.170000       55.001509 
      7       114.800000       54.986683 
      7       111.570000       54.911323 
      7       110.800000       54.776841 
      7       110.700000       54.628931 
      8       108.830000       54.479581 
      8       104.020000       54.346499 
      8       103.990000       54.268411 
      9       104.100000       54.240143 
      9       104.080000       54.178252 
      9       104.050000       54.119090 
      9       103.980000       54.105620 
      9       103.980000       54.102878 
      9       104.090000       54.103834 
      9       103.990000       54.096996 
      9       103.940000       54.074237 
      10       103.940000       54.032905 
      10       103.950000       54.010146 
      10       103.860000       54.003309 
      10       103.780000       54.004304 
      10       103.580000       54.002852 
      10       103.470000       54.004290 
      10       103.150000       54.002838 
      10       103.010000       54.003834 
      10       102.640000       53.996996 
      10       102.490000       53.974211 
      10       102.330000       53.932045 
      10       102.220000       53.900235 
      10       102.140000       53.865739 
      11       102.140000       53.873796 
      11       102.050000       53.945071 
      11       101.320000       53.991154 
      11       99.820000       54.002934 
      11       99.520000       53.997426 
      11       99.430000       53.980093 
      11       99.340000       53.962957 
      11       99.260000       53.980067 
      11       99.330000       53.996580 
      11       99.260000       53.993479 
      11       99.240000       53.959413 
      11       99.270000       53.943703 
      12       99.190000       53.974224 
      12       99.240000       53.985767 
      12       99.240000       53.949544 
      12       99.230000       53.891681 
      12       99.210000       53.870181 
      12       99.190000       53.830287 
      12       99.240000       53.803379 
      12       99.110000       53.850028 
      12       99.230000       53.880852 
      12       98.880000       53.855870 
      12       98.870000       53.833418 
      13       98.650000       53.899777 
      13       98.580000       53.958443 
      13       98.620000       53.960271 
      13       98.570000       53.968355 
      13       98.530000       53.938246 
      13       98.500000       53.875181 
      13       98.440000       53.867887 
      13       98.480000       53.903334 
      13       98.460000       53.861141 
      13       98.380000       53.770225 
      13       98.380000       53.725818 
      13       98.380000       53.754484 
      14       98.440000       53.793049 
      14       98.360000       53.796553 
      14       98.410000       53.779623 
      14       98.360000       53.757545 
      14       98.420000       53.755440 
      14       98.390000       53.751743 
      14       98.360000       53.750900 
      14       98.360000       53.742830 
      14       98.220000       53.772383 
      14       98.450000       53.785435 
      14       98.280000       53.747247 
      14       98.410000       53.771181 
      14       98.330000       53.830119 
      14       98.300000       53.835671 
      15       98.390000       53.781316 
      15       98.330000       53.803404 
      15       98.420000       53.813563 
      15       98.320000       53.724556 
      15       98.370000       53.697152 
      15       98.320000       53.806062 
      15       98.380000       53.930135 
      15       98.280000       53.978638 
      15       98.350000       53.926038 
      15       98.310000       53.796734 
      15       98.320000       53.713718 
      15       98.300000       53.749626 
      16       98.280000       53.786765 
      16       98.340000       53.852228 
      16       98.360000       53.903710 
      16       98.360000       53.880009 
      16       98.230000       53.856286 
      16       98.310000       53.838747 
      16       98.290000       53.858111 
      16       98.270000       53.883110 
      16       98.300000       53.853571 
      17       98.210000       53.824018 
      17       98.260000       53.848588 
      17       98.300000       53.862996 
      17       98.290000       53.826646 
      17       98.220000       53.786795 
      17       98.320000       53.773742 
      17       98.350000       53.822189 
      17       98.260000       53.841360 
      17       98.300000       53.753155 
      17       98.250000       53.661257 
      17       98.280000       53.671568 
      17       98.310000       53.742330 
      17       98.310000       53.780895 
      18       98.330000       53.742330 
      18       98.270000       53.671568 
      18       98.330000       53.661269 
      18       98.280000       53.753545 
      18       98.270000       53.845012 
      18       98.290000       53.825635 
      18       98.280000       53.726303 
      18       98.380000       53.683182 
      18       98.320000       53.737457 
      18       98.310000       53.750386 
      18       98.380000       53.751745 
      18       98.280000       53.733373 
      18       98.300000       53.652616 
      18       98.300000       53.583363 
      19       98.290000       53.592122 
      19       98.250000       53.664450 
      19       98.300000       53.701080 
      19       98.270000       53.808749 
      19       98.220000       53.916665 
      19       98.380000       53.914047 
      19       98.230000       53.861228 
      19       98.360000       53.823479 
      19       98.330000       53.855009 
      19       98.280000       53.880772 
      19       98.310000       53.848267 
      19       98.280000       53.782172 
      20       98.330000       53.737071 
      20       98.310000       53.711379 
      20       98.350000       53.714615 
      20       98.280000       53.673673 
      20       98.320000       53.628611 
      20       98.350000       53.644976 
      20       98.270000       53.655923 
      20       98.330000       53.671028 
      20       98.370000       53.741514 
      20       98.230000       53.770541 
      20       98.380000       53.785492 
      20       98.330000       53.814509 
      20       98.280000       53.882280 
      20       98.370000       53.951661 
      20       98.290000       53.935117 
      21       98.310000       53.853087 
      21       98.310000       53.765243 
      21       98.370000       53.713744 
      21       98.260000       53.695735 
      21       98.270000       53.670682 
      21       98.280000       53.697094 
      21       98.220000       53.774167 
      21       98.350000       53.766943 
      21       98.260000       53.728088 
      21       98.330000       53.743659 
      22       98.290000       53.740598 
      22       98.260000       53.708751 
      22       98.290000       53.763456 
      22       98.300000       53.835973 
      22       98.280000       53.787636 
      22       98.370000       53.689940 
      22       98.250000       53.695322 
      22       98.360000       53.753528 
      22       98.270000       53.746869 
      22       98.240000       53.713650 
      22       98.360000       53.711019 
      22       98.310000       53.732918 
      22       98.340000       53.773821 
      22       98.260000       53.792483 
      23       98.330000       53.790435 
      23       98.210000       53.811339 
      23       98.370000       53.859908 
      23       98.300000       53.846720 
      23       98.260000       53.825013 
      23       98.290000       53.847136 
      23       98.330000       53.864435 
      23       98.210000       53.825234 
      23       98.310000       53.789106 
      23       98.200000       53.782672 
      23       98.310000       53.867065 
      23       98.280000       53.900911 
      23       98.280000       53.787223 
      24       98.280000       53.684124 
      24       98.300000       53.666568 
      24       98.330000       53.635284 
      24       98.300000       53.627590 
      24       98.300000       53.690848 
      24       98.330000       53.717191 
      24       98.250000       53.726330 
      24       98.320000       53.792513 
      24       98.310000       53.902380 
      24       98.250000       53.923419 
      24       98.280000       53.841846 
      24       98.290000       53.722287 
      25       98.240000       53.660328 
      25       98.310000       53.712915 
      25       98.290000       53.789313 
      25       98.310000       53.833912 
      25       98.320000       53.800969 
      25       98.270000       53.772013 
      25       98.280000       53.785369 
      25       98.220000       53.811373 
      25       98.270000       53.716349 
      25       98.320000       53.594078 
      25       98.260000       53.663498 
      25       98.310000       53.772352 
      26       98.270000       53.800180 
      26       98.270000       53.803337 
      26       98.290000       53.792509 
      26       98.260000       53.761725 
      26       98.220000       53.752243 
      26       98.210000       53.815462 
      26       98.320000       53.842329 
      26       98.250000       53.836947 
      26       98.290000       53.849557 
      26       98.340000       53.840931 
      27       98.280000       53.807046 
      27       98.320000       53.777757 
      27       98.330000       53.831256 
      27       98.240000       53.886628 
      27       98.330000       53.902517 
      27       98.280000       53.897413 
      27       98.330000       53.880093 
      27       98.290000       53.862984 
      27       98.280000       53.880979 
      27       98.350000       53.908211 
      27       98.330000       53.950925 
      27       98.340000       53.966872 
      27       98.330000       53.885452 
      27       98.820000       53.816835 
      28       98.990000       53.856282 
      28       99.070000       53.838260 
      28       99.130000       53.787791 
      28       99.210000       53.819839 
      28       99.220000       53.838838 
      28       99.220000       53.811325 
      28       99.150000       53.811062 
      28       99.060000       53.813992 
      28       99.170000       53.787693 
      28       99.130000       53.711409 
      28       99.110000       53.728555 
      29       99.060000       53.741845 
      29       99.180000       53.673893 
      29       99.080000       53.735663 
      29       99.080000       53.887109 
      29       99.110000       53.918517 
      29       99.160000       53.839661 
      29       99.090000       53.784930 
      29       99.060000       53.822228 
      29       99.140000       53.831461 
      29       99.060000       53.715116 
      29       99.110000       53.624490 
      29       99.520000       53.679665 
      30       99.630000       53.751273 
      30       99.730000       53.820390 
      30       99.610000       53.841333 
      30       99.730000       53.754027 
      30       99.680000       53.671598 
      30       99.660000       53.714133 
      30       99.770000       53.793005 
      30       99.780000       53.771926 
      30       99.740000       53.729417 
      30       99.790000       53.754874 
      30       99.830000       53.793049 
      30       99.770000       53.796110 
      30       99.820000       53.774211 
      31       99.760000       53.732931 
      31       99.820000       53.711033 
      31       99.810000       53.714147 
      31       99.780000       53.754014 
      31       99.840000       53.798422 
      31       99.860000       53.820790 
      31       99.850000       53.820821 
      31       99.810000       53.797106 
      31       99.810000       53.824418 
      31       99.840000       53.845528 
      31       99.820000       53.846400 
      31       99.830000       53.901565 
      31       99.870000       53.944893 
      31       99.800000       53.959854 
      31       99.830000       53.891097 
      32       99.860000       53.722757 
      32       99.840000       53.617350 
      32       99.840000       53.710630 
      32       99.820000       53.825632 
      32       99.830000       53.797078 
      32       99.840000       53.732451 
      32       99.880000       53.745071 
      32       99.770000       53.732458 
      32       99.830000       53.670239 
      32       99.870000       53.654984 
      32       99.800000       53.719448 
      32       99.830000       53.767939 
      32       99.800000       53.774557 
      32       99.790000       53.765711 
      33       99.780000       53.712265 
      33       99.770000       53.696761 
      33       99.780000       53.728379 
      33       99.820000       53.773378 
      33       99.780000       53.791583 
      33       99.810000       53.779596 
      33       99.860000       53.761628 
      33       99.800000       53.764325 
      33       99.790000       53.729804 
      33       99.800000       53.702519 
      33       99.750000       53.740492 
      33       99.810000       53.746413 
      34       99.840000       53.720804 
      34       99.780000       53.673339 
      34       99.750000       53.618191 
      34       99.800000       53.685493 
      34       99.780000       53.766886 
      34       99.860000       53.751342 
      34       99.660000       53.712777 
      34       99.890000       53.696151 
      34       99.750000       53.676081 
      34       99.820000       53.721291 
      34       99.840000       53.814061 
      34       99.900000       53.791167 
      34       99.740000       53.734360 
      35       99.740000       53.754431 
      35       99.770000       53.782720 
      35       99.830000       53.753545 
      35       99.820000       53.723562 
      35       99.810000       53.742746 
      35       99.820000       53.733360 
      35       99.820000       53.661199 
      36       99.770000       53.605674 
      36       99.830000       53.562557 
      36       99.800000       53.570806 
      36       99.750000       53.697896 
      36       99.750000       53.818534 
      36       99.750000       53.827047 
      36       99.740000       53.814951 
      36       99.770000       53.759842 
      36       99.790000       53.727146 
      36       99.760000       53.760755 
      36       99.800000       53.740488 
      36       99.860000       53.690449 
      37       99.800000       53.663857 
      37       99.780000       53.680993 
      37       99.840000       53.707821 
      37       99.800000       53.747259 
      37       99.780000       53.762983 
      37       99.750000       53.727506 
      37       99.790000       53.696747 
      37       99.770000       53.712654 
      37       99.780000       53.769351 
      37       99.760000       53.777627 
      37       99.790000       53.717317 
      38       99.810000       53.618621 
      38       99.720000       53.646498 
      38       99.730000       53.729304 
      38       99.820000       53.749500 
      38       99.800000       53.749114 
      38       99.760000       53.722952 
      38       99.780000       53.695431 
      38       99.720000       53.701440 
      38       99.740000       53.716900 
      38       99.710000       53.690229 
      38       99.810000       53.705246 
      38       99.630000       53.705895 
      39       99.840000       53.655453 
      39       99.730000       53.603809 
      39       99.590000       53.629843 
      39       99.850000       53.664273 
      39       99.670000       53.659882 
      39       99.810000       53.658860 
      39       99.790000       53.604720 
      39       99.730000       53.551813 
      39       99.880000       53.567497 
      39       99.690000       53.557129 
      39       99.690000       53.563080 
      40       99.760000       53.584413 
      40       99.670000       53.563926 
      40       99.810000       53.566584 
      40       99.760000       53.599278 
      40       99.780000       53.554511 
      40       99.760000       53.520463 
      40       99.710000       53.610549 
      40       99.730000       53.719860 
      40       99.680000       53.732916 
      41       99.780000       53.678671 
      41       99.740000       53.694395 
      41       99.740000       53.752627 
      41       99.680000       53.736487 
      41       99.760000       53.669702 
      41       99.730000       53.642387 
      41       99.690000       53.648155 
      41       99.740000       53.576025 
      41       99.790000       53.503933 
      41       99.750000       53.576897 
      41       99.720000       53.658496 
      41       99.790000       53.684912 
      41       99.720000       53.719048 
      41       99.760000       53.711307 
      41       99.670000       53.666654 
      42       99.690000       53.651786 
      42       99.740000       53.704676 
      42       99.710000       53.693895 
      42       99.710000       53.655829 
      42       99.700000       53.684898 
      42       99.720000       53.655299 
      42       99.690000       53.558594 
      42       99.780000       53.473315 
      42       99.760000       53.465863 
      42       99.720000       53.568287 
      42       99.770000       53.653140 
      42       99.730000       53.647632 
      43       99.690000       53.623159 
      43       99.700000       53.578656 
      43       99.760000       53.626357 
      43       99.720000       53.731908 
      43       99.640000       53.780007 
      43       99.700000       53.741806 
      43       99.730000       53.664369 
      43       99.850000       53.614563 
      43       99.810000       53.605204 
      43       99.710000       53.602906 
      43       99.800000       53.605177 
      44       99.690000       53.613677 
      44       99.800000       53.653557 
      44       99.760000       53.692982 
      44       99.820000       53.695236 
      44       99.770000       53.663842 
      44       99.800000       53.589479 
      44       99.830000       53.549572 
      44       99.800000       53.575151 
      44       99.760000       53.592121 
      44       99.780000       53.586379 
      44       99.810000       53.603822 
      44       99.840000       53.699320 
      45       99.820000       53.782157 
      45       99.860000       53.799292 
      45       99.820000       53.782600 
      45       99.890000       53.704733 
      45       100.040000       53.628476 
      45       100.020000       53.632143 
      45       100.090000       53.646814 
      45       100.040000       53.655897 
      45       100.150000       53.668357 
      45       100.130000       53.728917 
      45       100.070000       53.787609 
      45       100.130000       53.796069 
      45       100.170000       53.778254 
      45       100.120000       53.740488 
      45       100.120000       53.672923 
      46       100.180000       53.593941 
      46       100.120000       53.638909 
      46       100.150000       53.703154 
      46       100.100000       53.643382 
      46       100.180000       53.606427 
      46       100.210000       53.652738 
      46       100.150000       53.625677 
      46       100.190000       53.606217 
      46       100.190000       53.647633 
      46       100.160000       53.690391 
      46       100.180000       53.691211 
      46       100.220000       53.723088 
      46       100.190000       53.735133 
      46       100.130000       53.702519 
      47       100.150000       53.735163 
      47       100.200000       53.787609 
      47       100.160000       53.789811 
      47       100.190000       53.743728 
      47       100.260000       53.658472 
      47       100.180000       53.603516 
      47       100.130000       53.623936 
      47       100.160000       53.718658 
      47       100.220000       53.768671 
      47       100.110000       53.719974 
      47       100.260000       53.639704 
      47       100.140000       53.671165 
      48       100.200000       53.759786 
      48       100.300000       53.805564 
      48       100.240000       53.840020 
      48       100.200000       53.816732 
      48       100.170000       53.684967 
      48       100.260000       53.582907 
      48       100.150000       53.640130 
      48       100.290000       53.749540 
      48       100.140000       53.773684 
      48       100.180000       53.773727 
      48       100.160000       53.748601 
      48       100.230000       53.713703 
      48       100.170000       53.710993 
      49       100.200000       53.732045 
      49       100.160000       53.763399 
      49       100.140000       53.747259 
      49       100.180000       53.707418 
      49       100.170000       53.676910 
      49       100.180000       53.655414 
      49       100.240000       53.717760 
      49       100.150000       53.812180 
      49       100.160000       53.792149 
      49       100.120000       53.727522 
      50       100.200000       53.731672 
      50       100.090000       53.741374 
      50       100.190000       53.730356 
      50       100.240000       53.711782 
      50       100.170000       53.725413 
      50       100.210000       53.722523 
      50       100.190000       53.714175 
      50       100.160000       53.720750 
      50       100.220000       53.703804 
      50       100.200000       53.614590 
      50       100.250000       53.566696 
      50       100.170000       53.636103 
      51       100.230000       53.736031 
      51       100.150000       53.780411 
      51       100.270000       53.741846 
      51       100.120000       53.665282 
      51       100.170000       53.626275 
      51       100.200000       53.665323 
      51       100.150000       53.743216 
      51       100.260000       53.797938 
      51       100.130000       53.824819 
      51       100.200000       53.828417 
      51       100.170000       53.760299 
      51       100.240000       53.719576 
      52       100.170000       53.793909 
      52       100.270000       53.841413 
      52       100.240000       53.783154 
      52       100.270000       53.735273 
      52       100.280000       53.774168 
      52       100.240000       53.815031 
      52       100.280000       53.815395 
      52       100.270000       53.843258 
      52       100.250000       53.826522 
      52       100.320000       53.738883 
      52       100.300000       53.669687 
      52       100.270000       53.662235 
      53       100.310000       53.682669 
      53       100.290000       53.730356 
      53       100.320000       53.770474 
      53       100.360000       53.794434 
      53       100.280000       53.775873 
      53       100.310000       53.754996 
      53       100.330000       53.727962 
      53       100.340000       53.710589 
      53       100.230000       53.713677 
      53       100.300000       53.748185 
      53       100.320000       53.769268 
      53       100.340000       53.762071 
      53       100.240000       53.780040 
      54       100.340000       53.796566 
      54       100.340000       53.793075 
      54       100.340000       53.755304 
      54       100.300000       53.734413 
      54       100.350000       53.792040 
      54       100.360000       53.824403 
      54       100.330000       53.763883 
      54       100.270000       53.727603 
      54       100.330000       53.696638 
      54       100.340000       53.731699 
      55       100.340000       53.839118 
      55       100.310000       53.836017 
      55       100.340000       53.776925 
      55       100.350000       53.770544 
      55       100.340000       53.747769 
      55       100.350000       53.707875 
      55       100.280000       53.682296 
      55       100.350000       53.679208 
      55       100.350000       53.753558 
      55       100.330000       53.827504 
      55       100.350000       53.819864 
      55       100.340000       53.779623 
      55       100.320000       53.734247 
      55       100.310000       53.721414 
      55       100.370000       53.757545 
      56       100.370000       53.813689 
      56       100.370000       53.815365 
      56       100.300000       53.780093 
      56       100.320000       53.745046 
      56       100.320000       53.770239 
      56       100.360000       53.842343 
      56       100.370000       53.882654 
      56       100.330000       53.863456 
      56       100.350000       53.862084 
      56       100.350000       53.886281 
      56       100.350000       53.867040 
      57       100.360000       53.882738 
      57       100.300000       53.905079 
      57       100.310000       53.867040 
      57       100.280000       53.863926 
      57       100.340000       53.883970 
      57       100.310000       53.857668 
      57       100.390000       53.832489 
      57       100.330000       53.822217 
      57       100.350000       53.803835 
      57       100.320000       53.863913 
      57       100.330000       53.946718 
      57       100.400000       53.934701 
      57       100.330000       53.853531 
      58       100.340000       53.771125 
      58       100.280000       53.744670 
      58       100.340000       53.776024 
      58       100.360000       53.807392 
      58       100.290000       53.847286 
      58       100.320000       53.864285 
      58       100.310000       53.842802 
      58       100.350000       53.858030 
      58       100.300000       53.876382 
      58       100.310000       53.812760 
      59       100.340000       53.706994 
      59       100.350000       53.690463 
      59       100.340000       53.784024 
      59       100.340000       53.832957 
      59       100.320000       53.815851 
      59       100.330000       53.831189 
      59       100.300000       53.846343 
      59       100.350000       53.850484 
      59       100.370000       53.843716 
      59       100.350000       53.883584 
      59       100.320000       53.937886 
      60       100.290000       53.934605 
      60       100.310000       53.881908 
      60       100.310000       53.826137 
      60       100.350000       53.846510 
      60       100.370000       53.835935 
      60       100.330000       53.789575 
      60       100.370000       53.757989 
      60       100.310000       53.750994 
      60       100.370000       53.739674 
      60       100.330000       53.775611 
      60       100.320000       53.871469 
      60       100.350000       53.940902 
      60       100.360000       53.897924 
      60       100.300000       53.826676 
