Human trial picking the raspberry twin 

 time    ||     output     ||     loadcell

      0.000000       -800.000000       0.050000 
      0.029922       -800.000000       0.050000 
      0.060838       -800.000000       0.070000 
      0.090912       -800.000000       0.030000 
      0.121578       -800.000000       0.190000 
      0.153003       -800.000000       0.230000 
      0.184190       -800.000000       0.240000 
      0.215208       -800.000000       0.220000 
      0.246336       -800.000000       0.380000 
      0.278396       -799.999995       0.460000 
      0.309360       -799.998806       0.500000 
      0.340907       -799.891742       0.410000 
      0.371441       -796.346263       0.510000 
      0.402896       -753.153490       0.450000 
      0.434089       -559.576910       0.360000 
      0.465060       -240.423086       0.380000 
      0.496360       -46.846506       0.320000 
      0.526299       -3.653733       0.130000 
      0.557857       -0.108254       0.130000 
      0.603936       -0.001190       0.030000 
      0.635230       -0.000001       0.110000 
      0.665641       0.000004       0.210000 
      0.696652       0.000004       0.000000 
      0.726417       0.000004       0.470000 
      0.757784       0.000004       0.060000 
      0.787705       0.000004       0.170000 
      0.818358       0.000004       0.290000 
      0.849433       0.000004       0.220000 
      0.880822       0.000004       0.040000 
      0.911844       0.000004       0.070000 
      0.943059       0.000004       0.010000 
      0.974077       0.000004       0.170000 
      1.004431       0.000004       0.220000 
      1.036076       0.000004       0.220000 
      1.067046       0.000004       0.370000 
      1.097843       0.000004       0.340000 
      1.129072       0.000004       0.340000 
      1.160080       0.000004       0.350000 
      1.207422       0.000004       0.340000 
      1.238013       0.000004       0.400000 
      1.269570       0.000004       0.320000 
      1.300480       0.000004       0.350000 
      1.331333       0.000004       0.520000 
      1.362203       0.000004       0.170000 
      1.392713       0.000004       0.140000 
      1.422652       0.000004       0.350000 
      1.454266       0.000004       0.140000 
      1.484245       0.000004       0.060000 
      1.514260       0.000004       0.080000 
      1.545233       0.000004       0.110000 
      1.576148       0.000004       0.140000 
      1.621054       0.000004       0.070000 
      1.652977       0.000004       0.230000 
      1.684354       0.000004       0.120000 
      1.714279       0.000004       0.120000 
      1.746056       0.000004       0.050000 
      1.777951       0.000004       0.390000 
      1.807872       0.000004       0.050000 
      1.839875       0.000004       0.050000 
      1.871790       0.000004       0.240000 
      1.901709       0.000004       0.160000 
      1.931629       0.000004       0.040000 
      1.963545       0.000004       0.370000 
      1.994249       0.000004       0.140000 
      2.026195       0.000004       0.170000 
      2.057082       0.000004       0.350000 
      2.087000       0.000004       0.420000 
      2.117361       0.000004       0.390000 
      2.148520       0.000004       0.210000 
      2.179885       0.000004       0.410000 
      2.211359       0.000004       0.360000 
      2.242089       0.000004       0.170000 
      2.273457       0.000004       0.410000 
      2.305336       0.000004       0.190000 
      2.336504       0.000004       0.060000 
      2.367735       0.000004       0.110000 
      2.398562       0.000004       0.050000 
      2.429514       0.000004       0.050000 
      2.461445       0.000004       0.160000 
      2.492449       0.000004       0.070000 
      2.523610       0.000004       0.090000 
      2.555160       0.000004       0.230000 
      2.586114       0.000004       0.060000 
      2.616297       0.000004       0.160000 
      2.647241       0.000004       0.000000 
      2.678876       0.000004       0.180000 
      2.709297       0.000004       0.100000 
      2.740344       0.000004       0.030000 
      2.771401       0.000004       0.080000 
      2.801827       0.000004       0.080000 
      2.832356       0.000004       0.200000 
      2.863224       0.000004       0.320000 
      2.895017       0.000004       0.280000 
      2.926447       0.000004       0.310000 
      2.957360       0.000004       0.120000 
      2.988301       0.000004       0.180000 
      3.020189       0.000004       0.230000 
      3.050142       0.000004       0.400000 
      3.082060       0.000004       0.390000 
      3.111977       0.000004       0.300000 
      3.143891       0.000004       0.180000 
      3.175800       0.000004       0.410000 
      3.205727       0.000004       0.220000 
      3.237635       0.000004       0.010000 
      3.267556       0.000004       0.110000 
      3.299135       0.000004       0.010000 
      3.331055       0.000004       0.040000 
      3.362938       0.000004       0.020000 
      3.392988       0.000004       0.030000 
      3.424629       0.000004       0.130000 
      3.454664       0.000004       0.050000 
      3.486086       0.000004       0.050000 
      3.517944       0.000004       0.100000 
      3.549189       0.000004       0.040000 
      3.580152       0.000004       0.130000 
      3.611686       0.000004       0.090000 
      3.642508       0.000004       0.270000 
      3.674265       0.000004       0.330000 
      3.705061       0.000004       0.230000 
      3.735421       0.000004       0.200000 
      3.766433       0.000004       0.520000 
      3.798125       0.000004       0.350000 
      3.830060       0.000004       0.310000 
      3.861185       0.000004       0.230000 
      3.891995       0.000004       0.580000 
      3.924009       0.000004       0.150000 
      3.954295       0.000004       0.150000 
      3.986109       0.000004       0.150000 
      4.017737       0.000004       0.180000 
      4.047687       0.000004       0.180000 
      4.078453       0.000004       0.230000 
      4.110077       0.000004       0.040000 
      4.140357       0.000004       0.060000 
      4.171589       0.000004       0.390000 
      4.203372       0.000004       0.020000 
      4.234192       0.000004       0.050000 
      4.265562       0.000004       0.090000 
      4.297513       0.000004       0.020000 
      4.328225       0.000004       0.140000 
      4.359507       0.000004       0.160000 
      4.390599       0.000004       0.050000 
      4.421289       0.000004       0.050000 
      4.453165       0.000004       0.050000 
      4.484057       0.000004       0.140000 
      4.515085       0.000004       0.070000 
      4.546611       0.000004       0.140000 
      4.577764       0.000004       0.220000 
      4.609623       0.000004       0.110000 
      4.640573       0.000004       0.110000 
      4.671484       0.000004       0.510000 
      4.703406       0.000004       0.330000 
      4.734323       0.000004       0.110000 
      4.764244       0.000004       0.110000 
      4.794131       0.000004       0.280000 
      4.824086       0.000004       0.330000 
      4.855000       0.000004       0.290000 
      4.886916       0.000004       0.280000 
      4.917832       0.000004       0.010000 
      4.948741       0.000004       0.110000 
      4.980664       0.000004       0.000000 
      5.011577       0.000004       0.360000 
      5.042495       0.000004       0.360000 
      5.074132       0.000004       0.050000 
      5.105102       0.000004       0.090000 
      5.136025       0.000004       0.020000 
      5.167331       0.000004       0.010000 
      5.198988       0.000004       0.010000 
      5.245177       0.000004       0.050000 
      5.275701       0.000004       0.170000 
      5.306466       0.000004       0.100000 
      5.338172       0.000004       0.060000 
      5.369809       0.000004       0.120000 
      5.400984       0.000004       0.070000 
      5.432690       0.000004       0.120000 
      5.464609       0.000004       0.030000 
      5.495227       0.000004       0.300000 
      5.526397       0.000004       0.240000 
      5.556758       0.000004       0.360000 
      5.587239       0.000004       0.190000 
      5.617190       0.000004       0.400000 
      5.649228       0.000004       0.350000 
      5.679521       0.000004       0.150000 
      5.710292       0.000004       0.350000 
      5.741014       0.000004       0.160000 
      5.771123       0.000004       0.170000 
      5.801718       0.000004       0.260000 
      5.832719       0.000004       0.180000 
      5.864489       0.000004       0.240000 
      5.895526       0.000004       0.360000 
      5.927280       0.000004       0.050000 
      5.959476       0.000004       0.020000 
      5.990401       0.000004       0.090000 
      6.021054       0.000004       0.210000 
      6.051860       0.000004       0.010000 
      6.083113       0.000004       0.120000 
      6.113906       0.000004       0.110000 
      6.145368       0.000004       0.100000 
      6.176792       0.000004       0.140000 
      6.207534       0.000004       0.080000 
      6.237944       0.000004       0.090000 
      6.268678       0.000004       0.020000 
      6.300293       0.000004       0.200000 
      6.330908       0.000004       0.030000 
      6.361736       0.000004       0.080000 
      6.392678       0.000004       0.410000 
      6.423759       0.000004       0.370000 
      6.455257       0.000004       0.380000 
      6.486671       0.000004       0.310000 
      6.517598       0.000004       0.160000 
      6.548130       0.000004       0.390000 
      6.580155       0.000004       0.300000 
      6.612039       0.000004       0.360000 
      6.643062       0.000004       0.440000 
      6.674093       0.000004       0.350000 
      6.705239       0.000004       0.080000 
      6.736577       0.000004       0.360000 
      6.766911       0.000004       0.150000 
      6.798931       0.000004       0.170000 
      6.829603       0.000004       0.030000 
      6.860637       0.000004       0.120000 
      6.891568       0.000004       0.220000 
      6.922639       0.000004       0.230000 
      6.954255       0.000004       1.040000 
      6.985166       0.000004       0.730000 
      7.015960       0.000004       0.210000 
      7.046067       0.000004       0.590000 
      7.077865       0.000004       0.740000 
      7.109287       0.000004       0.250000 
      7.140186       0.000004       0.680000 
      7.170643       0.000004       1.320000 
      7.202358       0.000004       1.420000 
      7.233814       0.000004       0.950000 
      7.264172       0.000004       1.860000 
      7.295364       0.000004       0.040000 
      7.326397       0.000004       0.710000 
      7.357964       0.000004       1.060000 
      7.388012       0.000004       2.330000 
      7.420134       0.000004       3.190000 
      7.451362       0.000004       3.730000 
      7.483087       0.000004       3.690000 
      7.513208       0.000004       3.660000 
      7.544044       0.000004       2.280000 
      7.574392       0.000004       0.270000 
      7.605778       0.000004       1.460000 
      7.637731       0.000004       0.570000 
      7.669018       0.000004       0.210000 
      7.700067       0.000004       0.440000 
      7.731439       0.000004       0.030000 
      7.762572       0.000004       0.120000 
      7.794261       0.000004       0.880000 
      7.825912       0.000004       1.660000 
      7.856862       0.000004       2.310000 
      7.888062       0.000004       2.890000 
      7.917950       0.000004       3.700000 
      7.949626       0.000004       4.550000 
      7.981425       0.000004       5.080000 
      8.011377       0.000004       6.010000 
      8.043256       0.000004       6.640000 
      8.075172       0.000004       7.350000 
      8.106786       0.000004       8.930000 
      8.137706       0.000004       10.870000 
      8.168622       0.000004       13.100000 
      8.200604       0.000004       16.090000 
      8.232883       0.000004       18.470000 
      8.264176       0.000004       19.880000 
      8.295614       0.000004       22.820000 
      8.326383       0.000004       25.950000 
      8.357278       0.000004       29.730000 
      8.388380       0.000004       33.610000 
      8.420010       0.000004       37.030000 
      8.451608       0.000004       39.750000 
      8.483266       0.000004       44.110000 
      8.514084       0.000004       49.440000 
      8.544787       0.000004       54.080000 
      8.576370       0.000004       60.780000 
      8.607124       0.000004       66.070000 
      8.639077       0.000004       75.420000 
      8.669070       0.000004       86.660000 
      8.699402       0.000004       96.120000 
      8.730233       0.000004       106.790000 
      8.761176       0.000004       114.270000 
      8.791636       0.000004       123.210000 
      8.822640       0.000004       127.580000 
      8.854039       0.000004       135.340000 
      8.884625       0.000004       145.980000 
      8.915953       0.000004       152.260000 
      8.946700       0.000004       160.480000 
      8.978173       0.000004       169.740000 
      9.009595       0.000004       174.140000 
      9.041162       0.000004       176.880000 
      9.072326       0.000004       184.650000 
      9.102859       0.000018       190.690000 
      9.134410       0.000447       195.680000 
      9.165783       0.005403       195.880000 
      9.198098       0.024201       195.910000 
      9.228619       0.039899       192.180000 
      9.259125       0.024202       191.500000 
      9.290036       0.005431       193.920000 
      9.321030       0.001402       199.180000 
      9.352013       0.013127       206.330000 
      9.382316       0.078592       213.880000 
      9.414258       0.241809       223.070000 
      9.445249       0.459610       228.100000 
      9.476961       0.638985       230.980000 
      9.506918       0.777054       231.030000 
      9.537590       0.908891       231.080000 
      9.568843       0.982409       225.950000 
      9.600225       0.998634       230.310000 
      9.632141       0.999964       233.210000 
      9.664143       0.999990       233.050000 
      9.694151       0.999561       236.290000 
      9.724407       0.994605       247.240000 
      9.755395       0.975794       253.850000 
      9.786430       0.959667       268.250000 
      9.817540       0.970395       276.320000 
      9.848299       0.969952       271.680000 
      9.879007       0.953825       265.910000 
      9.910319       0.946198       266.510000 
      9.940885       0.930514       267.510000 
      9.972436       0.935470       264.510000 
      10.003067       0.970395       266.930000 
      10.034233       0.994162       266.280000 
      10.064461       0.999548       262.440000 
      10.094242       0.999991       264.670000 
      10.125056       1.000004       267.740000 
      10.155033       1.000018       269.610000 
      10.185397       1.000488       275.390000 
      10.215991       1.006747       276.200000 
      10.245903       1.040870       282.630000 
      10.277086       1.118870       284.790000 
      10.308102       1.182090       285.900000 
      10.340054       1.207757       289.990000 
      10.369907       1.337770       294.190000 
      10.400548       1.586535       297.150000 
      10.432324       1.800348       300.540000 
      10.463552       1.931746       300.290000 
      10.494734       1.987768       301.080000 
      10.526328       1.999076       303.410000 
      10.556932       1.999964       306.480000 
      10.587876       1.999561       308.040000 
      10.619043       1.994605       317.980000 
      10.650964       1.975807       322.100000 
      10.681565       1.960110       318.550000 
      10.712826       1.975807       317.180000 
      10.744401       1.994605       323.140000 
      10.776102       1.999575       324.530000 
      10.806426       2.000448       323.290000 
      10.837241       2.005874       324.600000 
      10.867461       2.030528       327.570000 
      10.897973       2.076304       287.940000 
      10.930086       2.131413       2.350000 
      10.960393       2.216617       24.030000 
      10.992619       2.346988       19.330000 
      11.024223       2.454999       11.520000 
      11.055369       2.410163       23.220000 
      11.087185       2.235001       5.050000 
      11.117866       2.084514       7.840000 
      11.148707       2.052662       11.530000 
      11.180458       2.147806       15.830000 
      11.211381       2.404677       8.230000 
      11.242329       2.757432       3.250000 
      11.273074       2.997681       7.370000 
      11.304008       3.125892       4.160000 
      11.334700       2.860769       6.270000 
      11.364956       2.197414       6.790000 
      11.396001       2.107769       4.860000 
      11.427381       2.288035       2.960000 
      11.457855       1.841736       6.960000 
      11.488799       0.849142       5.730000 
      11.520751       -0.190408       4.810000 
      11.551390       -0.872145       6.170000 
      11.582975       -1.276854       5.350000 
      11.613583       -1.626133       6.080000 
      11.644678       -1.879588       6.460000 
      11.674359       -1.980117       6.860000 
      11.705394       -1.998558       4.800000 
      11.736400       -1.999954       6.590000 
      11.767318       -1.999995       5.020000 
      11.799006       -1.999996       5.470000 
      11.830125       -1.999996       4.770000 
      11.861620       -1.999995       5.780000 
      11.892233       -1.999969       5.550000 
      11.923185       -1.999096       6.060000 
      11.954203       -1.988741       5.530000 
      11.985233       -1.945732       5.780000 
      12.016795       -1.889698       5.600000 
      12.048197       -1.875799       6.360000 
      12.079456       -1.865000       6.340000 
      12.110495       -1.829592       5.910000 
      12.141934       -1.804979       5.650000 
      12.172817       -1.790568       5.850000 
      12.204107       -1.763326       5.620000 
      12.236027       -1.780260       5.040000 
      12.267571       -1.889723       5.110000 
      12.298669       -1.955876       4.640000 
      12.330584       -1.900924       4.860000 
      12.362236       -1.833609       4.440000 
      12.392686       -1.861899       4.800000 
      12.423212       -1.854202       4.560000 
      12.454241       -1.794238       5.040000 
      12.485055       -1.782084       4.850000 
      12.516210       -1.795939       5.360000 
      12.546074       -1.809934       5.070000 
      12.577737       -1.843408       5.400000 
      12.608945       -1.860569       5.320000 
      12.639881       -1.828166       5.720000 
      12.671607       -1.812622       5.550000 
      12.702106       -1.821908       5.650000 
      12.732673       -1.826031       5.780000 
      12.762915       -1.760948       5.940000 
      12.794206       -1.735048       6.230000 
      12.824748       -1.799039       6.240000 
      12.856412       -1.788268       6.390000 
      12.887319       -1.675883       5.990000 
      12.918165       -1.632778       6.230000 
      12.949903       -1.698251       5.860000 
      12.980787       -1.766772       6.080000 
      13.011730       -1.808468       5.500000 
      13.043620       -1.788271       5.830000 
      13.074564       -1.730048       5.320000 
      13.105487       -1.687470       5.040000 
      13.137403       -1.684285       4.770000 
      13.168320       -1.708964       4.900000 
      13.199238       -1.677916       4.700000 
      13.229127       -1.585697       5.000000 
      13.261070       -1.514795       4.720000 
      13.291990       -1.492449       4.820000 
      13.322875       -1.456059       4.820000 
      13.353791       -1.451673       5.050000 
      13.383745       -1.519250       4.950000 
      13.414667       -1.574842       5.070000 
      13.446916       -1.558731       5.200000 
      13.478046       -1.559161       5.270000 
      13.508488       -1.580214       5.720000 
      13.540433       -1.542601       5.680000 
      13.572144       -1.482084       5.700000 
      13.603287       -1.447589       5.530000 
      13.633946       -1.484338       6.090000 
      13.664163       -1.550565       5.810000 
      13.694274       -1.545730       5.940000 
      13.726276       -1.507512       5.820000 
      13.757058       -1.418864       5.950000 
      13.788019       -1.313050       5.960000 
      13.819112       -1.324707       6.050000 
      13.849754       -1.337592       5.790000 
      13.881871       -1.316618       5.630000 
      13.912867       -1.257347       5.680000 
      13.944183       -1.156155       5.180000 
      13.976078       -1.153431       5.280000 
      14.006616       -1.240320       4.900000 
      14.037787       -1.299910       4.830000 
      14.068954       -1.273029       4.830000 
      14.099127       -1.155132       4.970000 
      14.129050       -1.058898       4.700000 
      14.159625       -1.068214       4.810000 
      14.190403       -1.151615       4.660000 
      14.221783       -1.241634       4.830000 
      14.252988       -1.297199       4.910000 
      14.282906       -1.257747       5.040000 
      14.313826       -1.159188       4.930000 
      14.344858       -1.082084       5.280000 
      14.376179       -1.031002       5.200000 
      14.407298       -1.006765       5.660000 
      14.438554       -1.011278       5.540000 
      14.470343       -1.049290       5.830000 
      14.500934       -1.090583       5.700000 
      14.532331       -1.096784       6.020000 
      14.563259       -1.090623       5.800000 
      14.593427       -1.050660       5.930000 
      14.624244       -1.028818       5.780000 
      14.655445       -1.096010       5.850000 
      14.687360       -1.229118       5.580000 
      14.717287       -1.303955       5.470000 
      14.749193       -1.312095       5.340000 
      14.779088       -1.340306       5.290000 
      14.811003       -1.340776       5.200000 
      14.840923       -1.318851       5.020000 
      14.872838       -1.345262       5.260000 
      14.904785       -1.353275       4.830000 
      14.935703       -1.298653       4.950000 
      14.966619       -1.230022       4.830000 
      14.998529       -1.176269       4.870000 
      15.029455       -1.130976       4.740000 
      15.060374       -1.111721       4.940000 
      15.091690       -1.130505       4.810000 
      15.122816       -1.169943       4.890000 
      15.154084       -1.193683       5.130000 
      15.184889       -1.193683       5.120000 
      15.216062       -1.169916       5.030000 
      15.246638       -1.129592       5.120000 
      15.277475       -1.100023       5.280000 
      15.308739       -1.071299       5.550000 
      15.339325       -1.041317       5.480000 
      15.371156       -1.060102       6.070000 
      15.402084       -1.110294       5.750000 
      15.432838       -1.118337       5.570000 
      15.463046       -1.104482       5.470000 
      15.494971       -1.094583       5.900000 
      15.526376       -1.070399       5.680000 
      15.556165       -1.035461       5.550000 
      15.586925       -1.030505       5.390000 
      15.617207       -1.046189       5.390000 
      15.647630       -1.053802       5.200000 
      15.679255       -1.069486       5.120000 
      15.709364       -1.064530       5.280000 
      15.741145       -1.029605       5.030000 
      15.771908       -1.005838       5.210000 
      15.802702       -1.000452       4.970000 
      15.834159       -1.000023       5.040000 
      15.864079       -1.000439       4.970000 
      15.895704       -1.005395       4.980000 
      15.926346       -1.024220       5.020000 
      15.957876       -1.040777       4.900000 
      15.988843       -1.035018       5.090000 
      16.019626       -1.054675       5.290000 
      16.050380       -1.091026       5.200000 
      16.081420       -1.096798       5.270000 
      16.113082       -1.090596       5.570000 
      16.144271       -1.049746       5.470000 
      16.175268       -1.017106       5.560000 
      16.207503       -1.035891       5.980000 
      16.238387       -1.088767       5.520000 
      16.268706       -1.109824       5.830000 
      16.300249       -1.083399       5.620000 
      16.331629       -1.075785       5.700000 
      16.361973       -1.070869       5.700000 
      16.393254       -1.060545       5.690000 
      16.424021       -1.086141       5.400000 
      16.455304       -1.137618       5.370000 
      16.487210       -1.156030       5.380000 
      16.518238       -1.119280       5.460000 
      16.550095       -1.134977       5.280000 
      16.580340       -1.174828       5.290000 
      16.610994       -1.142561       5.040000 
      16.641765       -1.086127       4.930000 
      16.672806       -1.055159       5.120000 
      16.704669       -1.046659       5.050000 
      16.736520       -1.035448       4.970000 
      16.767159       -1.053803       5.130000 
      16.797369       -1.080228       5.120000 
      16.828666       -1.048417       5.340000 
      16.860257       -1.011251       5.230000 
      16.890082       -1.006724       5.550000 
      16.921536       -1.029619       5.360000 
      16.952709       -1.064087       5.510000 
      16.984179       -1.064087       5.340000 
      17.015687       -1.029605       5.390000 
      17.046986       -1.006295       5.560000 
      17.077216       -1.006295       5.620000 
      17.109166       -1.029605       5.600000 
      17.139596       -1.064087       5.610000 
      17.170942       -1.064100       5.660000 
      17.202230       -1.030035       5.620000 
      17.232931       -1.011237       5.560000 
      17.263850       -1.024649       5.610000 
      17.295137       -1.039904       5.310000 
      17.326457       -1.024206       5.060000 
      17.357342       -1.005838       5.060000 
      17.388260       -1.005851       5.450000 
      17.420197       -1.024649       5.120000 
      17.451123       -1.045289       5.320000 
      17.482035       -1.048390       5.250000 
      17.513951       -1.045289       5.120000 
      17.544873       -1.024636       5.310000 
      17.575759       -1.005408       5.230000 
      17.607681       -1.000439       5.410000 
      17.638608       -1.000009       5.280000 
      17.670047       -0.999996       5.180000 
      17.701166       -0.999996       5.030000 
      17.732082       -0.999996       5.050000 
      17.762785       -0.999996       5.420000 
      17.794111       -0.999996       5.390000 
      17.825247       -0.999996       5.370000 
      17.855968       -0.999996       5.530000 
      17.886580       -0.999996       5.740000 
      17.916561       -0.999996       5.680000 
      17.947642       -0.999996       5.520000 
      17.978806       -0.999996       5.480000 
      18.009556       -0.999996       5.720000 
      18.039547       -0.999996       5.620000 
      18.070700       -0.999996       5.480000 
      18.101051       -0.999996       5.340000 
      18.132751       -0.999996       5.310000 
      18.163884       -0.999996       5.130000 
      18.195300       -0.999996       5.360000 
      18.227059       -0.999996       5.500000 
      18.257950       -1.000009       5.530000 
      18.289497       -1.000439       5.140000 
      18.320525       -1.005395       5.320000 
      18.351309       -1.024193       5.110000 
      18.381982       -1.039890       5.420000 
      18.411841       -1.024193       5.330000 
      18.443320       -1.005395       5.370000 
      18.473534       -1.000439       4.970000 
      18.504070       -1.000009       5.310000 
      18.534093       -0.999996       5.390000 
      18.565485       -0.999996       5.290000 
      18.595090       -0.999996       5.230000 
      18.626084       -0.999996       5.390000 
      18.655866       -0.999996       5.500000 
      18.686143       -0.999996       5.490000 
      18.715914       -0.999996       5.480000 
      18.747758       -0.999996       5.600000 
      18.778214       -0.999996       5.460000 
      18.808000       -0.999996       5.500000 
      18.839779       -0.999996       5.560000 
      18.886755       -0.999996       5.330000 
      18.916948       -0.999996       5.530000 
      18.947138       -0.999996       5.490000 
      18.979270       -0.999996       5.360000 
      19.010688       -0.999996       5.310000 
      19.056608       -0.999996       5.430000 
      19.087701       -0.999996       5.260000 
      19.118763       -0.999996       5.290000 
      19.149261       -0.999996       5.170000 
      19.181276       -0.999996       5.400000 
      19.212861       -0.999996       5.230000 
      19.243992       -0.999996       5.250000 
      19.274428       -0.999996       5.280000 
      19.305848       -0.999996       5.140000 
      19.336517       -0.999996       5.220000 
      19.367062       -0.999996       5.390000 
      19.397894       -0.999996       5.440000 
      19.429245       -0.999996       5.330000 
      19.460771       -0.999996       5.330000 
      19.491568       -0.999996       5.440000 
      19.522527       -0.999996       5.290000 
      19.553965       -0.999996       5.360000 
      19.585877       -0.999996       5.500000 
      19.617450       -0.999996       5.520000 
      19.648333       -0.999996       5.370000 
      19.679310       -0.999996       5.490000 
      19.710873       -0.999996       5.330000 
      19.742399       -0.999996       5.360000 
      19.774366       -0.999996       5.410000 
      19.806457       -0.999996       5.270000 
      19.837725       -0.999996       5.250000 
      19.869363       -0.999996       5.360000 
      19.901085       -0.999996       5.360000 
      19.931610       -0.999996       5.090000 
      19.962963       -0.999996       5.070000 
      19.994314       -0.999996       5.240000 
      20.025063       -0.999996       5.160000 
      20.055009       -0.999996       5.430000 
      20.086111       -0.999996       5.390000 
      20.117482       -0.999996       5.400000 
      20.148134       -0.999996       5.290000 
      20.179234       -0.999996       5.420000 
      20.210417       -0.999996       5.360000 
      20.242511       -0.999996       5.360000 
      20.272690       -0.999996       5.190000 
      20.302722       -0.999996       5.680000 
      20.334102       -0.999996       5.330000 
      20.365364       -0.999996       5.590000 
      20.396369       -0.999996       5.340000 
      20.427340       -0.999996       5.430000 
      20.458177       -0.999996       5.640000 
      20.489333       -0.999996       5.430000 
      20.520401       -0.999996       5.220000 
      20.551417       -0.999996       5.340000 
      20.582135       -0.999996       5.270000 
      20.613052       -0.999996       5.390000 
      20.643093       -0.999996       5.500000 
      20.674225       -0.999996       5.140000 
      20.705272       -0.999996       5.190000 
      20.737033       -0.999996       5.480000 
      20.767942       -0.999996       5.330000 
      20.799280       -0.999996       5.390000 
      20.830205       -0.999996       5.390000 
      20.861012       -0.999996       5.320000 
      20.892376       -0.999996       5.350000 
      20.923269       -0.999996       5.750000 
      20.954195       -0.999996       5.250000 
      20.984841       -0.999996       5.520000 
      21.016280       -0.999996       5.350000 
