

 time    ||    gripping force   ||   raspberry measurement 

      0       100.830000       -793.915625 
      0       92.450000       -793.915625 
      0       70.200000       -793.915625 
      0       55.300000       -793.915625 
      0       35.280000       -793.915625 
      0       29.940000       -793.915625 
      0       19.570000       -793.915625 
      0       15.210000       -793.915625 
      1       12.030000       -785.976469 
      1       10.900000       -778.116699 
      1       10.350000       -770.334364 
      1       9.730000       -762.525835 
      1       9.860000       -759.007432 
      1       16.860000       -716.145400 
      1       77.720000       -524.063268 
      1       80.150000       -207.443008 
      1       80.520000       -15.588088 
      2       80.910000       26.984010 
      2       81.350000       30.343316 
      2       82.810000       30.402814 
      2       83.870000       30.342576 
      2       85.100000       30.285619 
      2       85.290000       30.277948 
      2       85.570000       30.238040 
      2       85.450000       30.196888 
      2       85.350000       30.238068 
      2       85.230000       30.278902 
      2       85.220000       30.298673 
      2       85.120000       30.419286 
      2       85.070000       30.620459 
      2       84.940000       30.763550 
      3       85.410000       30.808764 
      3       88.060000       30.822344 
      3       90.740000       30.840200 
      3       91.990000       30.857350 
      3       92.430000       30.840268 
      3       92.740000       30.824655 
      3       92.730000       30.838971 
      3       92.630000       30.925996 
      3       94.730000       31.036587 
      3       94.650000       31.064963 
      4       94.550000       31.075209 
      4       94.420000       31.109761 
      4       94.450000       31.122757 
      4       94.350000       31.146069 
      4       94.340000       31.101675 
      4       94.240000       31.016598 
      4       94.200000       31.006743 
      4       94.190000       31.052852 
      4       94.170000       31.146622 
      4       94.230000       31.244187 
      4       97.440000       31.275234 
      5       97.950000       31.245143 
      5       97.910000       31.223231 
      5       97.840000       31.214714 
      5       97.630000       31.196303 
      5       97.660000       31.124212 
      5       97.580000       31.077563 
      5       97.540000       31.145724 
      5       97.540000       31.228556 
      6       97.440000       31.275208 
      6       97.430000       31.259954 
      6       97.500000       31.215587 
      6       97.390000       31.169935 
      6       97.370000       31.136282 
      6       97.330000       31.169948 
      6       97.330000       31.216044 
      6       97.260000       31.265850 
      6       97.310000       31.306604 
      6       97.240000       31.315130 
      6       97.260000       31.317429 
      7       97.190000       31.316017 
      7       97.210000       31.317456 
      7       97.110000       31.316017 
      7       97.180000       31.317429 
      7       97.190000       31.315144 
      7       97.080000       31.307074 
      7       97.100000       31.272149 
      7       97.150000       31.251496 
      8       97.100000       31.264092 
      8       97.130000       31.270294 
      8       97.130000       31.292802 
      8       97.290000       31.310605 
      8       97.760000       31.317012 
      8       97.900000       31.316004 
      8       98.540000       31.317429 
      8       98.550000       31.315144 
      8       98.620000       31.307087 
      8       98.630000       31.272592 
      9       98.680000       31.256895 
      9       98.720000       31.288289 
      9       98.850000       31.310175 
      9       99.080000       31.316556 
      9       99.080000       31.310605 
      9       99.070000       31.293258 
      9       99.150000       31.276123 
      9       99.110000       31.293232 
      9       99.090000       31.309732 
      10       99.040000       31.306214 
      10       99.050000       31.267610 
      10       99.090000       31.237667 
      10       99.060000       31.267623 
      10       99.150000       31.306657 
      10       99.230000       31.315118 
      10       99.220000       31.316986 
      10       99.260000       31.310605 
      10       99.260000       31.292815 
      11       99.240000       31.270724 
      11       99.260000       31.269062 
      11       99.260000       31.270724 
      11       99.250000       31.292815 
      11       99.260000       31.310605 
      11       99.260000       31.317012 
      12       99.180000       31.316004 
      12       99.230000       31.317456 
      12       99.180000       31.316017 
      12       99.270000       31.317456 
      13       99.130000       31.316017 
      13       99.140000       31.317456 
      13       99.130000       31.316017 
      13       99.070000       31.317429 
      14       99.170000       31.315144 
      14       100.390000       31.307087 
      14       101.580000       31.272592 
      14       101.590000       31.256895 
      14       101.550000       31.288289 
      14       101.560000       31.310175 
      14       101.470000       31.316556 
      14       101.430000       31.310605 
      14       101.410000       31.293258 
      15       101.430000       31.276123 
      15       101.370000       31.293259 
      15       101.360000       31.310618 
      15       101.360000       31.317012 
      15       101.350000       31.315990 
      15       101.330000       31.316999 
      15       101.400000       31.310188 
      15       101.320000       31.288289 
      15       101.310000       31.256895 
      16       101.300000       31.272592 
      16       101.280000       31.307087 
      16       101.280000       31.315144 
      16       101.210000       31.317429 
      16       101.240000       31.316017 
      17       101.240000       31.317456 
      17       101.170000       31.316017 
      17       101.190000       31.317429 
      17       101.130000       31.315131 
      18       101.120000       31.306657 
      18       101.160000       31.267623 
      18       101.060000       31.237667 
      18       101.130000       31.267623 
      18       101.140000       31.306657 
      18       101.100000       31.315131 
      19       101.070000       31.317429 
      19       101.080000       31.316017 
      19       101.060000       31.317456 
      19       101.090000       31.316017 
      19       101.100000       31.317456 
      19       101.010000       31.316017 
      19       101.070000       31.317456 
      19       101.070000       31.316017 
      20       101.070000       31.317456 
      20       101.050000       31.316017 
      20       101.030000       31.317456 
      20       101.060000       31.316017 
      20       101.000000       31.317456 
      20       101.000000       31.316004 
      20       101.040000       31.316999 
      21       100.990000       31.310188 
      21       101.020000       31.288289 
      21       100.950000       31.256895 
      21       101.000000       31.272592 
      21       101.040000       31.307061 
      21       100.930000       31.314271 
      21       100.900000       31.307061 
      21       100.980000       31.272592 
      22       100.980000       31.256895 
      22       100.970000       31.288289 
      22       100.990000       31.310188 
      22       100.910000       31.316972 
      22       100.930000       31.315117 
      22       100.960000       31.306657 
      22       100.960000       31.267610 
      22       100.970000       31.237224 
      23       100.910000       31.262224 
      23       100.950000       31.282460 
      23       100.850000       31.275237 
      23       100.940000       31.293232 
      23       100.910000       31.310618 
      23       100.920000       31.317012 
      23       100.970000       31.316004 
      23       100.890000       31.317456 
      23       100.980000       31.316017 
      23       100.820000       31.317456 
      23       100.900000       31.316017 
      24       100.860000       31.317456 
      24       100.830000       31.316017 
      24       100.880000       31.317456 
      24       100.870000       31.316004 
      24       100.820000       31.316999 
      24       100.860000       31.310188 
      25       100.910000       31.288289 
      25       100.850000       31.256869 
      25       100.890000       31.271719 
      25       100.820000       31.296719 
      25       100.800000       31.271719 
      25       100.790000       31.256869 
      25       100.900000       31.288289 
      26       100.810000       31.310188 
      26       100.840000       31.316999 
      26       100.830000       31.315990 
      26       100.850000       31.317012 
      26       100.780000       31.310618 
      26       100.800000       31.293232 
      26       100.830000       31.275237 
      26       100.790000       31.282460 
      27       100.850000       31.262224 
      27       100.800000       31.237224 
      27       100.830000       31.267610 
      27       100.810000       31.306657 
      27       100.780000       31.315118 
      27       100.780000       31.316986 
      27       100.820000       31.310618 
      28       100.760000       31.293259 
      28       100.780000       31.276123 
      28       100.800000       31.293259 
      28       100.780000       31.310618 
      28       100.820000       31.317012 
      28       100.800000       31.316004 
      28       100.740000       31.317456 
      28       100.750000       31.316017 
      28       100.770000       31.317456 
      28       100.730000       31.316017 
      29       100.750000       31.317456 
      29       100.750000       31.316004 
      29       100.740000       31.316999 
      29       100.770000       31.310188 
      29       100.720000       31.288289 
      29       100.730000       31.256895 
      29       100.730000       31.272592 
      29       100.730000       31.307087 
      29       100.660000       31.315131 
      30       100.740000       31.316973 
      30       100.730000       31.310188 
      30       100.690000       31.288289 
      30       100.730000       31.256895 
      30       100.780000       31.272592 
      30       100.620000       31.307061 
      30       100.690000       31.314271 
      30       100.680000       31.307061 
      31       100.730000       31.272592 
      31       100.670000       31.256895 
      31       100.710000       31.288289 
      31       100.680000       31.310188 
      31       100.650000       31.316999 
      31       100.710000       31.316004 
      31       100.740000       31.317456 
      31       100.710000       31.316017 
      31       100.760000       31.317456 
      31       100.680000       31.316017 
      31       100.690000       31.317456 
      32       100.680000       31.316017 
      32       100.660000       31.317456 
      32       100.600000       31.316017 
      32       100.640000       31.317456 
      32       100.630000       31.316017 
      32       100.700000       31.317456 
      32       100.650000       31.316017 
      33       100.590000       31.317456 
      33       100.420000       31.316017 
      33       100.670000       31.317456 
      33       100.630000       31.316017 
      33       100.710000       31.317456 
      33       100.660000       31.316017 
      33       100.650000       31.317456 
      33       100.610000       31.316017 
      33       100.620000       31.317456 
      33       100.640000       31.316017 
      34       100.590000       31.317456 
      34       101.610000       31.316004 
      34       100.730000       31.316999 
      34       100.520000       31.310188 
      34       100.720000       31.288289 
      34       100.710000       31.256895 
      35       100.600000       31.272592 
      35       100.590000       31.307087 
      35       100.610000       31.315144 
      35       100.620000       31.317429 
      35       100.600000       31.316017 
      35       100.620000       31.317456 
      35       100.610000       31.316017 
      36       100.600000       31.317456 
      36       100.670000       31.316004 
      36       100.550000       31.317012 
      36       100.560000       31.310618 
      36       100.590000       31.293259 
      36       100.550000       31.276123 
      36       100.620000       31.293259 
      36       100.560000       31.310618 
      36       100.570000       31.317012 
      36       100.500000       31.316004 
      37       100.620000       31.317429 
      37       100.600000       31.315144 
      37       100.550000       31.307074 
      37       100.580000       31.272149 
      38       100.490000       31.251483 
      38       100.580000       31.263649 
      38       100.550000       31.264895 
      38       100.570000       31.268578 
      38       100.600000       31.269837 
      38       100.610000       31.282447 
      38       100.560000       31.267180 
      38       100.510000       31.256452 
      38       100.550000       31.288276 
      38       100.550000       31.310175 
      38       100.510000       31.316543 
      38       100.600000       31.310175 
      39       100.540000       31.288289 
      39       100.530000       31.256895 
      39       100.520000       31.272592 
      39       100.440000       31.307087 
      39       100.590000       31.315144 
      39       100.510000       31.317429 
      39       100.460000       31.316017 
      39       100.500000       31.317456 
      40       100.530000       31.316017 
      40       100.540000       31.317456 
      40       100.500000       31.316017 
      40       100.510000       31.317456 
      40       100.540000       31.316017 
      40       100.510000       31.317456 
      41       100.470000       31.316017 
      41       100.500000       31.317429 
      41       100.490000       31.315131 
      41       100.480000       31.306657 
      41       100.450000       31.267610 
      41       100.510000       31.237224 
      41       100.530000       31.262197 
      42       100.560000       31.281574 
      42       100.450000       31.264439 
      42       100.500000       31.244838 
      42       100.510000       31.230829 
      43       100.390000       31.268618 
      43       100.410000       31.305206 
      43       100.460000       31.316569 
      43       100.480000       31.315991 
      43       100.440000       31.317455 
      43       100.480000       31.316017 
      43       100.460000       31.317456 
      43       100.470000       31.316017 
      43       100.460000       31.317456 
      43       100.470000       31.316017 
      43       100.440000       31.317456 
      43       100.440000       31.316017 
      44       100.430000       31.317456 
      44       100.450000       31.316017 
      44       100.440000       31.317456 
      44       100.440000       31.316017 
      44       100.400000       31.317456 
      44       100.460000       31.316017 
      45       100.420000       31.317456 
      45       100.430000       31.316017 
      45       100.440000       31.317456 
      45       100.440000       31.316017 
      45       100.480000       31.317456 
      45       100.450000       31.316017 
      45       100.400000       31.317456 
      45       100.420000       31.316017 
      45       100.400000       31.317456 
      46       100.350000       31.316017 
      46       100.400000       31.317456 
      46       100.390000       31.316017 
      46       100.420000       31.317456 
      46       100.390000       31.316017 
      46       100.380000       31.317456 
      46       100.410000       31.316017 
      46       100.440000       31.317456 
      47       100.370000       31.316004 
      47       100.380000       31.316999 
      48       100.370000       31.310188 
      48       100.420000       31.288289 
      48       100.350000       31.256868 
      49       100.300000       31.271706 
      49       100.380000       31.296289 
      49       100.340000       31.266737 
      49       100.320000       31.237197 
      49       100.310000       31.262224 
      49       100.320000       31.282460 
      50       100.330000       31.275237 
      50       100.370000       31.293232 
      50       100.340000       31.310618 
      50       100.350000       31.317012 
      50       100.370000       31.316004 
      50       100.340000       31.317455 
      50       100.410000       31.316004 
      50       100.330000       31.317012 
      51       100.320000       31.310618 
      51       100.320000       31.293232 
      51       100.350000       31.275250 
      51       100.360000       31.282890 
      51       100.310000       31.267166 
      52       100.330000       31.255566 
      52       100.300000       31.277478 
      52       100.330000       31.261794 
      52       100.320000       31.237211 
      52       100.300000       31.267610 
      52       100.280000       31.306657 
      53       100.290000       31.315131 
      53       100.270000       31.317429 
      53       100.270000       31.316017 
      53       100.310000       31.317456 
      53       100.300000       31.316017 
      53       100.310000       31.317456 
      53       100.250000       31.316017 
      54       100.290000       31.317456 
      54       100.330000       31.316004 
      54       100.330000       31.316999 
      54       100.240000       31.310188 
      54       100.270000       31.288289 
      54       100.300000       31.256895 
      54       100.290000       31.272579 
      55       100.300000       31.306644 
      55       100.250000       31.309745 
      55       100.310000       31.293232 
      55       100.300000       31.276123 
      56       100.250000       31.293259 
      56       100.250000       31.310618 
      56       100.290000       31.317012 
      56       100.290000       31.315991 
      56       100.300000       31.317012 
      56       100.270000       31.310618 
      57       100.220000       31.293259 
      57       100.310000       31.276123 
      57       100.230000       31.293259 
      57       100.280000       31.310618 
      57       100.240000       31.317012 
      57       100.280000       31.316004 
      58       100.230000       31.317456 
      58       100.250000       31.316017 
      58       100.250000       31.317456 
      58       100.280000       31.316017 
      58       100.180000       31.317456 
      58       100.250000       31.316017 
      59       100.210000       31.317456 
      59       100.200000       31.316004 
      59       100.280000       31.317012 
      59       100.220000       31.310618 
      59       100.300000       31.293259 
      59       100.270000       31.276123 
      59       100.260000       31.293259 
      59       100.220000       31.310618 
      60       100.190000       31.317012 
      60       100.200000       31.316004 
      60       100.200000       31.317456 
      60       100.290000       31.316017 
      60       100.220000       31.317456 
      60       100.240000       31.316017 
      60       100.250000       31.317456 
      60       100.270000       31.316017 
      61       100.260000       31.317456 
