Human trial picking the raspberry twin 

 time    ||     output     ||     loadcell

      0.000000       -800.753846       0.150000 
      0.031766       -800.753846       0.090000 
      0.062150       -800.753846       0.150000 
      0.092967       -800.753846       0.020000 
      0.124146       -800.753846       0.120000 
      0.155677       -800.753846       0.070000 
      0.186522       -800.753846       0.110000 
      0.217311       -800.753846       0.140000 
      0.247698       -800.753846       0.100000 
      0.278696       -800.753841       0.130000 
      0.309484       -800.752651       0.040000 
      0.341776       -800.645466       0.080000 
      0.373806       -797.096025       0.030000 
      0.405014       -753.855533       0.380000 
      0.436810       -560.071521       0.040000 
      0.467479       -240.601188       0.020000 
      0.499162       -46.856651       0.090000 
      0.529255       -3.596365       0.030000 
      0.560333       0.004940       0.210000 
      0.591765       0.076384       0.100000 
      0.623325       -0.013894       0.180000 
      0.654967       0.014821       0.030000 
      0.685279       0.099491       0.230000 
      0.715833       0.123232       0.010000 
      0.747556       0.077999       0.010000 
      0.778525       0.044333       0.160000 
      0.809167       0.077135       0.160000 
      0.839881       0.049605       0.160000 
      0.870515       -0.028552       0.130000 
      0.902004       -0.053494       0.070000 
      0.933009       -0.054174       0.060000 
      0.964052       -0.058354       0.340000 
      0.995305       -0.001324       0.140000 
      1.027289       -0.014487       0.120000 
      1.058517       -0.043860       0.010000 
      1.089969       0.011123       0.060000 
      1.120251       0.040271       0.260000 
      1.152171       -0.013903       0.160000 
      1.182938       -0.034531       0.120000 
      1.214011       -0.001877       0.230000 
      1.245748       -0.024689       0.180000 
      1.277786       -0.041285       0.320000 
      1.308207       -0.032816       0.100000 
      1.339812       -0.104508       0.110000 
      1.370436       -0.171669       0.090000 
      1.401848       -0.146656       0.110000 
      1.431508       -0.089254       0.310000 
      1.462109       -0.060154       0.050000 
      1.492874       -0.054782       0.040000 
      1.524792       -0.060181       0.090000 
      1.555260       -0.090180       0.050000 
      1.586408       -0.158784       0.040000 
      1.618106       -0.236274       0.130000 
      1.649506       -0.257370       0.250000 
      1.680710       -0.207568       0.050000 
      1.712445       -0.163324       0.020000 
      1.743411       -0.133588       0.100000 
      1.774328       -0.062479       0.100000 
      1.804979       -0.018409       0.030000 
      1.836571       -0.095175       0.140000 
      1.868175       -0.134819       0.000000 
      1.899509       -0.059767       0.010000 
      1.931327       0.017044       0.150000 
      1.962773       0.002595       0.220000 
      1.994126       0.002183       0.280000 
      2.025905       0.009820       0.280000 
      2.057115       -0.021149       0.210000 
      2.087951       -0.093706       0.120000 
      2.119270       -0.136315       0.230000 
      2.150824       -0.057859       0.110000 
      2.182408       -0.064267       0.040000 
      2.212841       -0.159530       0.070000 
      2.243975       -0.141298       0.200000 
      2.276000       -0.078096       0.020000 
      2.307000       -0.077141       0.260000 
      2.337372       -0.083935       0.150000 
      2.368443       -0.107649       0.030000 
      2.399360       -0.139473       0.040000 
      2.430750       -0.126876       0.110000 
      2.461553       -0.109517       0.010000 
      2.492474       -0.098623       0.070000 
      2.522144       -0.086220       0.220000 
      2.554035       -0.092852       0.120000 
      2.585122       -0.145342       0.030000 
      2.616492       -0.172627       0.260000 
      2.648113       -0.182565       0.040000 
      2.679341       -0.194596       0.150000 
      2.711198       -0.183451       0.070000 
      2.742756       -0.183412       0.020000 
      2.774702       -0.193307       0.020000 
      2.806867       -0.167723       0.050000 
      2.837447       -0.117079       0.190000 
      2.869347       -0.107692       0.210000 
      2.900976       -0.171253       0.020000 
      2.932217       -0.139000       0.180000 
      2.962021       0.006595       0.060000 
      2.992242       0.034831       0.140000 
      3.022988       -0.055655       0.070000 
      3.054292       -0.165495       0.080000 
      3.085315       -0.227278       0.080000 
      3.116175       -0.201336       0.090000 
      3.148049       -0.159697       0.170000 
      3.178694       -0.136803       0.020000 
      3.210146       -0.148526       0.090000 
      3.241101       -0.212534       0.040000 
      3.272646       -0.228231       0.130000 
      3.303181       -0.167298       0.280000 
      3.334018       -0.140886       0.080000 
      3.365240       -0.149812       0.120000 
      3.396326       -0.159698       0.030000 
      3.427321       -0.188368       0.430000 
      3.458212       -0.236301       0.050000 
      3.489235       -0.228701       0.030000 
      3.520468       -0.149815       0.190000 
      3.552414       -0.135504       0.040000 
      3.583170       -0.206692       0.060000 
      3.614343       -0.211175       0.150000 
      3.646099       -0.089335       0.150000 
      3.678438       0.001651       0.010000 
      3.710516       -0.053914       0.050000 
      3.741115       -0.195548       0.010000 
      3.771943       -0.304849       0.040000 
      3.803096       -0.263670       0.070000 
      3.833924       -0.174996       0.070000 
      3.864178       -0.223431       0.060000 
      3.895301       -0.338074       0.010000 
      3.925976       -0.415274       0.180000 
      3.957106       -0.430822       0.130000 
      3.988978       -0.374454       0.010000 
      4.019239       -0.297820       0.000000 
      4.050762       -0.276738       0.160000 
      4.082293       -0.260181       0.080000 
      4.113189       -0.268184       0.080000 
      4.129154       -0.319762       0.010000 
      4.159497       -0.334016       0.000000 
      4.191278       -0.290649       0.120000 
      4.222404       -0.204993       0.200000 
      4.253150       -0.206888       0.300000 
      4.283996       -0.295523       0.190000 
      4.315948       -0.371323       0.410000 
      4.346837       -0.416994       0.160000 
      4.378340       -0.417490       0.240000 
      4.408207       -0.378952       0.050000 
      4.438994       -0.347171       0.010000 
      4.469450       -0.373570       0.070000 
      4.501042       -0.456954       0.290000 
      4.532061       -0.465814       0.370000 
      4.563978       -0.363741       0.110000 
      4.595323       -0.279909       0.050000 
      4.626045       -0.277651       0.040000 
      4.656930       -0.289791       0.070000 
      4.688337       -0.337675       0.220000 
      4.719508       -0.408480       0.070000 
      4.751102       -0.408462       0.190000 
      4.782103       -0.339446       0.170000 
      4.813010       -0.225203       0.020000 
      4.843111       -0.175007       0.100000 
      4.874476       -0.198748       0.030000 
      4.906246       -0.222474       0.040000 
      4.937138       -0.303635       0.160000 
      4.968594       -0.371669       0.160000 
      4.999913       -0.347516       0.170000 
      5.031868       -0.299166       0.030000 
      5.062317       -0.297750       0.310000 
      5.093132       -0.286176       0.180000 
      5.124041       -0.228747       0.360000 
      5.155254       -0.251255       0.120000 
      5.185618       -0.332662       0.040000 
      5.217161       -0.362381       0.250000 
      5.247879       -0.332289       0.050000 
      5.278706       -0.311733       0.010000 
      5.310491       -0.320260       0.080000 
      5.342411       -0.383907       0.270000 
      5.373323       -0.463603       0.100000 
      5.404214       -0.493734       0.100000 
      5.436152       -0.472086       0.270000 
      5.467072       -0.361995       0.010000 
      5.496998       -0.273142       0.030000 
      5.527883       -0.323484       0.090000 
      5.557554       -0.355514       0.040000 
      5.588015       -0.341425       0.020000 
      5.618970       -0.347464       0.110000 
      5.649884       -0.413972       0.110000 
      5.679801       -0.426336       0.020000 
      5.710715       -0.362854       0.110000 
      5.741401       -0.308535       0.090000 
      5.772170       -0.271352       0.190000 
      5.801900       -0.225230       0.010000 
      5.832742       -0.244001       0.150000 
      5.863647       -0.309904       0.060000 
      5.895267       -0.321504       0.200000 
      5.926798       -0.315333       0.060000 
      5.957363       -0.333175       0.260000 
      5.988003       -0.369579       0.130000 
      6.018105       -0.378912       0.340000 
      6.049476       -0.393806       0.030000 
      6.080489       -0.443003       0.100000 
      6.112096       -0.463226       0.160000 
      6.143498       -0.431403       0.190000 
      6.174004       -0.400035       0.200000 
      6.205157       -0.360597       0.240000 
      6.236580       -0.349426       0.040000 
      6.268146       -0.399995       0.060000 
      6.298050       -0.441270       0.110000 
      6.329963       -0.436705       0.090000 
      6.360834       -0.379881       0.090000 
      6.391437       -0.317505       0.160000 
      6.422487       -0.302817       0.110000 
      6.454003       -0.288365       0.050000 
      6.485478       -0.315803       0.020000 
      6.516343       -0.372600       0.150000 
      6.548219       -0.411245       0.130000 
      6.579168       -0.389224       0.010000 
      6.610352       -0.331044       0.050000 
      6.641029       -0.355202       0.030000 
      6.671775       -0.457398       0.040000 
      6.702954       -0.489622       0.040000 
      6.733547       -0.404991       0.040000 
      6.764432       -0.321619       0.150000 
      6.796379       -0.371395       0.060000 
      6.826293       -0.477082       0.190000 
      6.858208       -0.504906       0.190000 
      6.889497       -0.447557       0.020000 
      6.921413       -0.367326       0.210000 
      6.952331       -0.342756       0.070000 
      6.983248       -0.438171       0.040000 
      7.015179       -0.562713       0.100000 
      7.046112       -0.564997       0.140000 
      7.076997       -0.512981       0.070000 
      7.108911       -0.480793       0.060000 
      7.139827       -0.452900       0.040000 
      7.170779       -0.436899       0.070000 
      7.202254       -0.435807       0.030000 
      7.232742       -0.459307       0.080000 
      7.264122       -0.412466       0.190000 
      7.295121       -0.337896       0.070000 
      7.326557       -0.354273       0.000000 
      7.358066       -0.461025       0.010000 
      7.388019       -0.513822       0.650000 
      7.419375       -0.510264       0.110000 
      7.451336       -0.434047       4.500000 
      7.481222       -0.298734       10.850000 
      7.512148       -0.228884       14.160000 
      7.542710       -0.240844       22.420000 
      7.574118       -0.309544       33.300000 
      7.604164       -0.385583       63.640000 
      7.635272       -0.408989       113.650000 
      7.666348       -0.368116       157.010000 
      7.697141       -0.368628       218.430000 
      7.728592       -0.394497       253.440000 
      7.760093       -0.310261       300.890000 
      7.791230       -0.089737       332.220000 
      7.820953       0.096695       358.250000 
      7.851986       0.127234       381.940000 
      7.883064       0.086942       389.350000 
      7.914279       0.087895       393.350000 
      7.945177       0.141229       385.310000 
      7.976389       0.186094       253.630000 
      8.007204       0.200961       19.410000 
      8.039211       0.236536       4.430000 
      8.069951       0.346491       5.400000 
      8.100505       0.657347       4.560000 
      8.132035       1.262147       5.490000 
      8.163944       2.017997       6.580000 
      8.195281       2.716535       5.770000 
      8.226785       3.403499       6.250000 
      8.258207       4.154810       5.790000 
      8.287951       4.756517       5.310000 
      8.319708       5.054295       5.170000 
      8.351098       5.165862       4.860000 
      8.382262       5.024938       5.270000 
      8.413997       4.182221       5.140000 
      8.445271       2.833783       5.280000 
      8.476490       2.128316       5.650000 
      8.506168       1.963262       6.010000 
      8.537589       1.524933       6.040000 
      8.568486       0.589406       6.580000 
      8.600437       -0.537378       6.740000 
      8.630672       -1.360398       6.260000 
      8.661261       -1.688284       6.350000 
      8.691735       -1.749070       6.040000 
      8.722811       -1.753704       5.780000 
      8.754092       -1.753854       5.570000 
      8.785414       -1.754285       5.540000 
      8.816815       -1.759254       5.190000 
      8.848156       -1.778482       5.080000 
      8.879184       -1.799163       4.840000 
      8.910538       -1.803177       4.990000 
      8.941957       -1.811761       5.230000 
      8.972527       -1.850326       5.790000 
      9.004373       -1.960101       5.710000 
      9.036390       -2.091936       5.970000 
      9.067507       -2.173414       5.840000 
      9.098283       -2.159642       5.770000 
      9.129282       -2.076684       5.820000 
      9.160689       -2.062439       5.620000 
      9.192306       -2.073969       5.340000 
      9.222838       -2.082135       5.350000 
      9.253193       -2.088297       5.320000 
      9.284887       -2.047972       5.420000 
      9.315685       -1.988394       5.520000 
      9.346680       -1.948873       5.630000 
      9.377412       -1.899619       5.730000 
      9.408071       -1.838628       5.840000 
      9.438940       -1.811733       5.770000 
      9.469903       -1.813948       5.670000 
      9.500380       -1.847570       5.630000 
      9.531547       -1.858714       5.680000 
      9.562359       -1.813061       5.530000 
      9.593423       -1.789724       5.440000 
      9.625368       -1.800048       5.670000 
      9.656204       -1.802706       5.470000 
      9.687077       -1.804548       5.530000 
      9.718995       -1.803136       5.340000 
      9.749239       -1.805005       5.820000 
      9.780900       -1.808549       5.700000 
      9.811800       -1.829645       5.820000 
      9.842714       -1.853815       5.410000 
      9.873035       -1.877139       5.340000 
      9.904338       -1.887867       5.680000 
      9.935470       -1.847999       5.510000 
      9.966233       -1.789737       5.320000 
      9.996799       -1.765540       5.360000 
      10.027150       -1.778522       5.590000 
      10.058456       -1.794193       5.790000 
      10.090253       -1.783438       5.710000 
      10.122041       -1.783452       5.880000 
      10.152422       -1.794636       5.900000 
      10.183197       -1.783895       5.600000 
      10.214119       -1.788837       5.720000 
      10.244725       -1.818377       5.720000 
      10.276252       -1.817960       5.660000 
      10.307266       -1.783881       5.290000 
      10.338691       -1.765083       5.560000 
      10.369451       -1.778496       5.480000 
      10.401009       -1.793763       5.570000 
      10.432949       -1.778482       5.540000 
      10.463116       -1.764640       5.610000 
      10.494191       -1.778482       5.330000 
      10.525085       -1.793776       5.550000 
      10.556178       -1.778925       5.800000 
      10.587434       -1.770039       5.380000 
      10.619326       -1.802693       5.550000 
      10.649115       -1.834100       5.520000 
      10.681109       -1.808078       5.490000 
      10.712388       -1.794236       5.590000 
      10.742736       -1.818820       5.380000 
      10.773027       -1.817960       5.610000 
      10.804062       -1.783438       5.750000 
      10.835267       -1.759684       5.530000 
      10.866219       -1.754299       5.730000 
      10.896826       -1.753869       5.680000 
      10.927800       -1.754285       5.760000 
      10.958625       -1.759241       5.760000 
      10.988925       -1.778039       5.660000 
      11.020217       -1.793736       5.810000 
      11.050201       -1.778039       5.720000 
      11.081115       -1.759241       5.650000 
      11.112458       -1.754285       5.430000 
      11.143481       -1.753855       5.540000 
      11.175200       -1.753842       5.540000 
      11.206330       -1.753842       5.580000 
      11.237338       -1.753842       5.360000 
      11.268784       -1.753842       5.750000 
      11.299654       -1.753842       5.630000 
      11.330704       -1.753842       5.910000 
      11.361766       -1.753842       5.500000 
      11.392903       -1.753842       5.750000 
      11.424337       -1.753842       5.770000 
      11.455100       -1.753842       5.610000 
      11.486853       -1.753842       5.500000 
      11.518146       -1.753842       5.410000 
      11.550013       -1.753842       5.640000 
      11.580880       -1.753842       5.670000 
      11.612193       -1.753842       5.610000 
      11.642971       -1.753842       5.720000 
      11.674079       -1.753842       5.960000 
      11.705065       -1.753842       5.660000 
      11.736652       -1.753842       5.880000 
      11.766795       -1.753855       5.840000 
      11.797745       -1.754285       5.650000 
      11.829612       -1.759241       5.650000 
      11.859512       -1.778039       5.620000 
      11.890806       -1.793736       5.830000 
      11.921867       -1.778039       5.800000 
      11.952616       -1.759241       5.800000 
      11.984181       -1.754285       5.580000 
      12.015338       -1.753855       5.720000 
      12.046676       -1.753842       5.630000 
      12.077065       -1.753842       5.630000 
      12.108181       -1.753855       5.700000 
      12.140220       -1.754285       5.780000 
      12.171852       -1.759241       5.820000 
      12.202454       -1.778039       5.610000 
      12.234173       -1.793736       5.680000 
      12.265637       -1.778039       5.610000 
      12.296753       -1.759241       5.420000 
      12.328141       -1.754285       5.480000 
      12.358359       -1.753855       5.510000 
      12.389386       -1.753842       5.740000 
      12.420566       -1.753842       5.640000 
      12.451169       -1.753842       5.720000 
      12.481941       -1.753842       5.670000 
      12.512830       -1.753842       5.840000 
      12.559243       -1.753842       5.630000 
      12.590577       -1.753842       5.690000 
      12.622147       -1.753842       5.560000 
      12.652323       -1.753842       5.860000 
      12.683103       -1.753842       5.590000 
      12.713727       -1.753842       5.800000 
      12.744762       -1.753842       5.380000 
      12.775242       -1.753842       5.500000 
      12.806316       -1.753842       5.660000 
      12.836404       -1.753842       5.620000 
      12.868355       -1.753842       5.750000 
      12.900218       -1.753842       5.550000 
      12.931455       -1.753842       5.530000 
      12.962186       -1.753842       5.750000 
      12.992665       -1.753842       5.720000 
      13.024134       -1.753855       5.620000 
      13.054225       -1.754285       5.840000 
      13.084989       -1.759241       5.570000 
      13.116349       -1.778039       5.520000 
      13.147574       -1.793736       5.670000 
      13.177902       -1.778039       5.530000 
      13.225259       -1.759241       5.510000 
      13.256524       -1.754285       5.920000 
      13.288261       -1.753855       5.560000 
      13.319836       -1.753842       5.600000 
      13.351254       -1.753842       5.860000 
      13.381747       -1.753842       5.790000 
      13.413380       -1.753842       5.620000 
      13.444481       -1.753842       5.630000 
      13.476398       -1.753842       5.720000 
      13.522296       -1.753842       5.520000 
      13.553012       -1.753842       5.740000 
      13.584235       -1.753842       5.800000 
      13.631151       -1.753842       5.710000 
      13.662037       -1.753842       5.500000 
      13.693199       -1.753842       5.600000 
      13.724005       -1.753842       5.780000 
      13.755208       -1.753842       5.660000 
      13.786505       -1.753842       5.600000 
      13.817547       -1.753842       5.500000 
      13.848054       -1.753842       5.520000 
      13.878829       -1.753842       5.490000 
      13.909674       -1.753842       5.600000 
      13.941768       -1.753842       5.860000 
      13.972946       -1.753842       5.790000 
      14.003733       -1.753842       5.570000 
      14.035021       -1.753842       5.690000 
      14.066775       -1.753842       5.590000 
      14.097592       -1.753842       5.760000 
      14.128688       -1.753842       5.640000 
      14.160266       -1.753842       5.370000 
      14.191680       -1.753842       5.590000 
      14.222580       -1.753842       5.540000 
      14.253725       -1.753842       5.560000 
      14.284646       -1.753842       5.810000 
      14.315037       -1.753842       5.770000 
      14.346118       -1.753842       5.530000 
      14.376976       -1.753842       5.690000 
      14.409172       -1.753842       5.800000 
      14.439919       -1.753842       5.710000 
      14.470503       -1.753842       5.690000 
      14.502012       -1.753842       5.690000 
      14.532642       -1.753842       5.750000 
      14.562999       -1.753842       5.540000 
      14.594312       -1.753842       5.610000 
      14.626060       -1.753842       5.460000 
      14.657811       -1.753842       5.810000 
      14.688926       -1.753842       5.690000 
      14.719304       -1.753842       5.780000 
      14.751346       -1.753842       5.690000 
      14.782608       -1.753842       5.810000 
      14.814363       -1.753842       5.740000 
      14.845445       -1.753842       5.730000 
      14.875399       -1.753842       5.700000 
      14.906096       -1.753842       5.730000 
      14.936883       -1.753842       5.640000 
      14.967956       -1.753842       5.620000 
      15.015113       -1.753842       5.700000 
      15.061325       -1.753842       5.630000 
      15.092832       -1.753842       5.540000 
      15.124346       -1.753842       5.800000 
      15.153988       -1.753842       5.700000 
      15.184353       -1.753842       5.520000 
      15.215368       -1.753842       5.610000 
      15.246599       -1.753842       5.800000 
      15.278187       -1.753842       5.670000 
      15.309756       -1.753842       5.930000 
      15.340636       -1.753842       5.780000 
      15.371556       -1.753842       5.740000 
      15.403045       -1.753842       5.740000 
      15.434002       -1.753842       5.490000 
      15.464907       -1.753842       5.750000 
      15.496830       -1.753842       5.660000 
      15.527745       -1.753842       5.850000 
      15.558628       -1.753842       5.740000 
      15.589574       -1.753842       5.600000 
      15.620489       -1.753842       5.660000 
      15.651381       -1.753842       5.570000 
      15.682300       -1.753842       5.770000 
      15.713217       -1.753842       5.780000 
      15.744161       -1.753842       5.580000 
      15.775287       -1.753842       5.550000 
      15.806489       -1.753842       5.380000 
      15.837475       -1.753842       5.420000 
      15.867983       -1.753842       5.750000 
      15.897905       -1.753842       5.600000 
      15.928150       -1.753842       5.700000 
      15.958283       -1.753842       5.640000 
      15.990206       -1.753842       5.640000 
      16.021596       -1.753842       5.690000 
      16.052348       -1.753842       5.690000 
      16.083119       -1.753842       5.810000 
      16.113956       -1.753842       5.480000 
      16.145205       -1.753842       5.620000 
      16.176247       -1.753842       5.780000 
      16.221086       -1.753842       5.870000 
      16.267532       -1.753842       5.620000 
      16.297997       -1.753842       5.810000 
      16.328344       -1.753842       5.550000 
      16.359428       -1.753842       5.650000 
      16.390836       -1.753842       5.800000 
      16.422127       -1.753842       5.520000 
      16.453083       -1.753842       5.700000 
      16.484300       -1.753842       5.380000 
      16.515535       -1.753842       5.670000 
      16.546981       -1.753842       5.670000 
      16.577616       -1.753842       5.580000 
      16.609280       -1.753842       5.710000 
      16.640133       -1.753842       5.690000 
      16.672044       -1.753842       5.740000 
      16.702511       -1.753842       5.350000 
      16.734104       -1.753842       5.470000 
      16.764991       -1.753842       5.640000 
      16.811866       -1.753842       5.600000 
      16.841786       -1.753842       5.490000 
      16.872672       -1.753842       5.850000 
      16.903590       -1.753842       5.800000 
      16.935530       -1.753842       5.690000 
      16.966453       -1.753842       5.590000 
      16.997365       -1.753842       5.670000 
      17.029279       -1.753842       5.430000 
      17.060194       -1.753842       5.660000 
      17.091123       -1.753842       5.520000 
      17.123002       -1.753842       5.260000 
      17.153960       -1.753842       5.660000 
      17.183841       -1.753842       5.660000 
      17.215130       -1.753842       5.660000 
      17.246228       -1.753842       5.740000 
      17.276676       -1.753842       5.650000 
      17.308360       -1.753842       5.520000 
      17.339402       -1.753842       5.780000 
      17.371239       -1.753842       5.640000 
      17.401936       -1.753842       5.630000 
      17.432679       -1.753842       5.650000 
      17.464145       -1.753828       5.680000 
      17.495141       -1.753399       5.920000 
      17.526027       -1.748443       5.470000 
      17.557560       -1.729645       5.800000 
      17.588368       -1.713948       6.000000 
      17.619257       -1.729645       5.810000 
      17.651114       -1.748443       5.900000 
      17.681055       -1.753399       5.830000 
      17.712643       -1.753828       5.600000 
      17.743156       -1.753842       5.700000 
      17.773162       -1.753842       5.760000 
      17.804983       -1.753842       5.730000 
      17.836148       -1.753842       5.520000 
      17.867069       -1.753842       5.410000 
      17.898644       -1.753842       5.720000 
      17.930560       -1.753842       5.490000 
      17.960923       -1.753842       5.590000 
      17.991576       -1.753842       5.660000 
      18.022388       -1.753842       5.750000 
      18.053570       -1.753842       5.580000 
      18.084385       -1.753842       5.690000 
      18.116118       -1.753842       5.720000 
      18.146313       -1.753842       5.660000 
      18.177360       -1.753842       5.530000 
      18.207201       -1.753828       5.640000 
      18.237715       -1.753385       5.710000 
      18.268181       -1.748000       5.610000 
      18.298956       -1.724246       5.570000 
      18.329520       -1.689751       5.620000 
      18.361567       -1.689751       5.780000 
      18.392082       -1.724246       5.600000 
      18.424195       -1.748000       5.670000 
      18.455305       -1.753385       5.530000 
      18.487016       -1.753815       5.640000 
      18.516967       -1.753385       5.580000 
      18.548050       -1.747986       5.460000 
      18.579891       -1.723803       5.690000 
      18.610799       -1.684351       5.560000 
      18.642334       -1.665554       5.520000 
      18.673884       -1.684351       5.660000 
      18.705336       -1.723803       5.540000 
      18.737353       -1.747986       5.690000 
      18.769462       -1.753372       5.240000 
      18.801198       -1.753372       5.630000 
      18.832079       -1.747986       5.460000 
      18.863213       -1.723803       5.490000 
      18.893886       -1.684351       5.460000 
      18.925611       -1.665553       5.670000 
      18.957325       -1.684325       5.700000 
      18.988168       -1.722903       5.610000 
      19.018976       -1.736745       5.790000 
      19.049760       -1.699565       5.930000 
      19.081303       -1.648943       5.500000 
      19.112768       -1.654299       5.740000 
      19.143885       -1.664610       5.420000 
      19.175065       -1.638172       5.400000 
      19.206686       -1.640886       5.590000 
      19.238089       -1.678939       5.830000 
      19.269338       -1.723346       5.560000 
      19.300624       -1.747516       5.670000 
      19.332172       -1.747529       5.510000 
      19.364072       -1.723789       5.710000 
      19.394978       -1.684351       5.730000 
      19.426898       -1.665540       5.570000 
      19.457373       -1.683895       5.860000 
      19.488370       -1.717947       5.790000 
      19.519796       -1.717933       5.740000 
      19.550671       -1.683438       5.930000 
      19.582093       -1.659684       5.800000 
      19.614034       -1.654312       5.520000 
      19.644279       -1.654299       5.750000 
      19.676090       -1.659255       5.740000 
      19.707403       -1.678496       5.590000 
      19.738917       -1.699579       5.600000 
      19.769348       -1.707649       5.670000 
      19.800142       -1.723789       5.540000 
      19.831620       -1.724232       5.910000 
      19.862828       -1.713491       5.410000 
      19.894053       -1.729161       5.600000 
      19.925429       -1.742130       5.550000 
      19.955355       -1.717504       5.530000 
      19.986364       -1.654298       5.640000 
      20.016867       -1.596036       5.690000 
      20.047824       -1.595163       5.420000 
      20.078978       -1.643044       5.620000 
      20.109344       -1.663267       5.450000 
      20.140655       -1.632732       5.920000 
      20.171926       -1.616232       5.630000 
      20.202550       -1.633189       5.650000 
      20.233149       -1.669109       5.600000 
      20.264205       -1.672640       5.670000 
      20.295238       -1.659241       5.550000 
      20.326030       -1.659684       5.590000 
      20.357075       -1.678509       5.640000 
      20.387781       -1.699578       5.450000 
      20.418479       -1.707622       5.700000 
      20.449061       -1.722902       5.530000 
      20.480336       -1.713407       5.630000 
      20.511711       -1.664197       5.670000 
      20.542284       -1.638131       5.630000 
      20.573227       -1.639956       5.690000 
      20.604188       -1.603150       5.620000 
      20.650325       -1.570066       5.510000 
      20.681427       -1.579369       5.840000 
      20.713172       -1.599189       5.640000 
      20.744140       -1.603136       5.560000 
      20.775325       -1.610377       5.770000 
      20.807182       -1.632302       5.570000 
      20.838051       -1.664126       5.580000 
      20.869624       -1.653372       5.510000 
      20.899255       -1.637258       5.680000 
      20.931109       -1.640359       5.570000 
      20.963093       -1.608105       5.660000 
      20.994047       -1.588837       5.440000 
      21.025314       -1.594166       5.470000 
