

 time    ||    gripping force   ||   raspberry measurement 

      0       0.080000       -802.104255 
      0       0.140000       -802.104255 
      0       0.100000       -802.104255 
      0       0.030000       -802.104255 
      0       0.150000       -802.104255 
      0       0.090000       -802.104255 
      0       0.120000       -802.104255 
      0       0.140000       -802.104255 
      0       0.100000       -802.104255 
      0       0.110000       -802.104255 
      0       0.110000       -802.104255 
      0       1.170000       -802.104255 
      0       0.020000       -802.104255 
      0       0.420000       -802.104255 
      0       0.230000       -802.104255 
      0       0.130000       -802.104255 
      0       0.200000       -802.104255 
      0       0.330000       -802.104255 
      0       0.230000       -802.104255 
      0       0.200000       -802.104255 
      1       0.010000       -802.104255 
      1       0.130000       -802.104255 
      1       0.030000       -802.104255 
      1       0.010000       -802.104255 
      1       0.190000       -802.104255 
      1       0.250000       -802.104255 
      1       0.170000       -802.104255 
      1       0.190000       -802.104255 
      1       0.470000       -802.104255 
      1       0.210000       -802.104255 
      1       0.480000       -802.104255 
      1       0.420000       -802.104255 
      1       0.280000       -802.104255 
      1       1.080000       -802.104255 
      1       10.870000       -794.083213 
      2       19.820000       -786.142381 
      2       57.600000       -778.280957 
      2       79.090000       -770.498147 
      2       93.710000       -762.793161 
      2       110.100000       -755.164049 
      2       110.850000       -747.506150 
      2       108.850000       -747.506150 
      2       109.400000       -747.506150 
      2       109.320000       -747.506150 
      2       108.570000       -747.506150 
      2       108.060000       -743.951794 
      2       106.910000       -700.650609 
      2       102.990000       -506.585119 
      2       93.580000       -186.614182 
      2       81.280000       7.467032 
      2       56.910000       50.772192 
      2       41.870000       54.338866 
      3       32.680000       54.491367 
      3       25.800000       54.491367 
      3       24.920000       54.491367 
      3       25.440000       54.491367 
      3       25.780000       54.594636 
      3       26.020000       54.819534 
      3       26.210000       54.819534 
      3       27.400000       55.255910 
      3       28.510000       55.748295 
      3       30.450000       56.128663 
      3       32.690000       56.297535 
      3       36.380000       56.333154 
      3       39.570000       56.333154 
      3       41.400000       56.331286 
      3       41.270000       56.293655 
      4       40.940000       56.293655 
      4       40.030000       56.105700 
      4       37.330000       56.105700 
      4       35.950000       56.105700 
      4       34.650000       55.742664 
      4       33.990000       55.380426 
      4       33.320000       55.074167 
      4       32.380000       54.758608 
      4       32.240000       54.529942 
      4       32.100000       54.451370 
      4       31.260000       54.445970 
      4       30.410000       54.445970 
      4       29.400000       54.479565 
      4       28.630000       54.479565 
      4       27.910000       54.479565 
      5       27.230000       54.497477 
      5       27.040000       54.493951 
      5       26.820000       54.493951 
      5       26.930000       54.603353 
      5       26.850000       54.603353 
      5       26.930000       54.603353 
      5       26.940000       54.603353 
      5       27.040000       54.603353 
      5       26.990000       54.837704 
      5       27.050000       54.999912 
      5       27.080000       54.970390 
      5       27.060000       54.867774 
      5       27.060000       54.867774 
      5       27.090000       54.867774 
      5       27.180000       54.867774 
      6       27.570000       54.772715 
      6       28.040000       54.650924 
      6       28.690000       54.650924 
      6       29.150000       54.650924 
      6       29.500000       54.577297 
      6       29.610000       54.570169 
      6       29.630000       54.596496 
      6       29.690000       54.655271 
      6       29.700000       54.612083 
      6       29.830000       54.506075 
      6       29.860000       54.447620 
      6       29.790000       54.442357 
      6       29.830000       54.457944 
      6       29.880000       54.457944 
      6       29.840000       54.465154 
      6       29.770000       54.410853 
      7       29.820000       54.367081 
      7       29.810000       54.411739 
      7       29.870000       54.475966 
      7       29.810000       54.506768 
      7       29.820000       54.527035 
      7       29.890000       54.512650 
      7       29.820000       54.507321 
      7       29.830000       54.507321 
      7       29.810000       54.496983 
      7       29.790000       54.522562 
      7       29.840000       54.575869 
      7       29.750000       54.529221 
      7       29.770000       54.529221 
      7       29.780000       54.472037 
      8       29.790000       54.512638 
      8       29.790000       54.582238 
      8       29.760000       54.582238 
      8       29.780000       54.640903 
      8       29.790000       54.705411 
      8       29.760000       54.678999 
      8       29.820000       54.628377 
      8       29.820000       54.622965 
      8       29.750000       54.622965 
      8       29.740000       54.582610 
      8       29.790000       54.536059 
      8       29.790000       54.487125 
      8       29.740000       54.457169 
      8       29.770000       54.497011 
      8       29.800000       54.573654 
      9       29.750000       54.613951 
      9       29.770000       54.589811 
      9       29.760000       54.569628 
      9       29.800000       54.577698 
      9       29.770000       54.569198 
      9       29.730000       54.584869 
      9       29.720000       54.595583 
      9       29.740000       54.562913 
      9       29.960000       54.531532 
      9       30.200000       54.492524 
      9       30.700000       54.492524 
      9       31.140000       54.492524 
      9       31.160000       54.486282 
      9       31.280000       54.554829 
      9       31.530000       54.603153 
      10       31.590000       54.559342 
      10       31.590000       54.500098 
      10       31.540000       54.488551 
      10       31.660000       54.489836 
      10       31.830000       54.518576 
      10       31.910000       54.574974 
      10       31.880000       54.671827 
      10       31.830000       54.712538 
      10       31.900000       54.609065 
      10       31.850000       54.497497 
      10       31.810000       54.497497 
      10       31.850000       54.492108 
      10       31.800000       54.515858 
      10       31.830000       54.497454 
      10       31.830000       54.520405 
      11       31.660000       54.634105 
      11       31.420000       54.680784 
      11       31.250000       54.635548 
      11       31.150000       54.647175 
      11       30.730000       54.621136 
      11       30.520000       54.563011 
      11       30.350000       54.572770 
      11       30.310000       54.557528 
      11       30.280000       54.550444 
      11       30.160000       54.649363 
      11       30.000000       54.649363 
      11       29.960000       54.712148 
      11       29.860000       54.627877 
      11       29.610000       54.519023 
      11       29.330000       54.519023 
      12       29.360000       54.505979 
      12       29.350000       54.560198 
      12       29.360000       54.560198 
      12       29.360000       54.560198 
      12       29.460000       54.560198 
      12       29.670000       54.543589 
      12       29.740000       54.474611 
      12       29.850000       54.444076 
      12       29.940000       54.450857 
      12       30.020000       54.450857 
      12       30.140000       54.450857 
      12       30.050000       54.450857 
      12       30.020000       54.450857 
      12       30.010000       54.503707 
      12       30.030000       54.535948 
      13       29.990000       54.498808 
      13       30.080000       54.497010 
      13       29.940000       54.497010 
      13       30.110000       54.497010 
      13       29.960000       54.531975 
      13       30.070000       54.531975 
      13       30.020000       54.563839 
      13       30.020000       54.607281 
      13       30.000000       54.644517 
      13       29.940000       54.703196 
      13       30.060000       54.734604 
      13       29.930000       54.682557 
      13       30.040000       54.622632 
      13       30.010000       54.590212 
      13       30.030000       54.587650 
      14       30.020000       54.588426 
      14       29.970000       54.600566 
      14       29.960000       54.600566 
      14       29.920000       54.579483 
      14       30.040000       54.540072 
      14       30.050000       54.540072 
      14       30.000000       54.540072 
      14       29.940000       54.540072 
      14       29.980000       54.540072 
      14       29.980000       54.519436 
      14       30.080000       54.534716 
      14       29.980000       54.619807 
      14       29.960000       54.619807 
      14       29.950000       54.659231 
      14       29.960000       54.616236 
      15       30.030000       54.576799 
      15       30.000000       54.511362 
      15       29.960000       54.511362 
      15       30.020000       54.463012 
      15       30.080000       54.463012 
      15       29.990000       54.502852 
      15       30.030000       54.597824 
      15       30.010000       54.652529 
      15       29.970000       54.598240 
      15       29.940000       54.598240 
      15       29.970000       54.598240 
      15       30.000000       54.507352 
      15       30.010000       54.475954 
      15       29.980000       54.497007 
      15       29.920000       54.491182 
      16       30.000000       54.504194 
      16       29.990000       54.565987 
      16       30.040000       54.565987 
      16       29.930000       54.573640 
      16       29.940000       54.544518 
      16       29.960000       54.536878 
      16       29.920000       54.533786 
      16       30.050000       54.533786 
      16       29.900000       54.526576 
      16       30.100000       54.502396 
      16       29.810000       54.502396 
      16       30.030000       54.502396 
      16       30.020000       54.528391 
      16       30.070000       54.600066 
      16       30.180000       54.600066 
      16       29.920000       54.568711 
      17       30.340000       54.492111 
      17       30.030000       54.492111 
      17       30.240000       54.508252 
      17       30.230000       54.593392 
      17       30.450000       54.593392 
      17       30.130000       54.593392 
      17       30.250000       54.635961 
      17       30.230000       54.609566 
      17       30.080000       54.644947 
      17       30.150000       54.705908 
      17       30.170000       54.682141 
      17       30.140000       54.646843 
      17       30.110000       54.636365 
      17       30.100000       54.646453 
      17       30.200000       54.678501 
      18       30.080000       54.702837 
      18       30.120000       54.702837 
      18       30.020000       54.695570 
      18       30.110000       54.710434 
      18       29.890000       54.645777 
      18       30.030000       54.645777 
      18       29.800000       54.550457 
      18       29.800000       54.550457 
      18       29.850000       54.550457 
      18       29.750000       54.561559 
      18       29.760000       54.579922 
      18       29.860000       54.520778 
      18       29.840000       54.491212 
      18       29.840000       54.544931 
      18       29.810000       54.560225 
      19       29.850000       54.560225 
      19       29.800000       54.505537 
      19       29.840000       54.505537 
      19       29.810000       54.513650 
      19       29.800000       54.604553 
      19       29.790000       54.682609 
      19       29.820000       54.668188 
      19       29.730000       54.601522 
      19       29.890000       54.601522 
      19       29.850000       54.576357 
      19       29.850000       54.606878 
      19       29.980000       54.627904 
      19       30.070000       54.625220 
      19       30.140000       54.591181 
      19       30.300000       54.575927 
      20       30.260000       54.612251 
      20       30.150000       54.652088 
      20       30.310000       54.664684 
      20       30.240000       54.610382 
      20       30.250000       54.561198 
      20       30.240000       54.561198 
      20       30.250000       54.580786 
      20       30.250000       54.580786 
      20       30.230000       54.594764 
      20       30.230000       54.558374 
      20       30.300000       54.517690 
      20       30.260000       54.495612 
      20       30.280000       54.517300 
      20       30.180000       54.554747 
      20       30.040000       54.592150 
      21       30.000000       54.592150 
      21       29.940000       54.637236 
      21       29.940000       54.691139 
      21       30.010000       54.676258 
      21       29.980000       54.676258 
      21       30.040000       54.630202 
      21       30.020000       54.562861 
      21       30.020000       54.515502 
      21       29.960000       54.551243 
      21       29.960000       54.551243 
      21       30.000000       54.572313 
      21       29.920000       54.572313 
      21       29.920000       54.563400 
      21       30.050000       54.625206 
      21       30.040000       54.655201 
      22       29.940000       54.655201 
      22       29.980000       54.603737 
      22       29.940000       54.596097 
      22       29.950000       54.596097 
      22       29.970000       54.596097 
      22       29.970000       54.615334 
      22       29.970000       54.585325 
      22       29.910000       54.555330 
      22       30.060000       54.555330 
      22       29.980000       54.555330 
      22       29.980000       54.555330 
      22       29.980000       54.555330 
      22       30.070000       54.574957 
      22       29.930000       54.570997 
      22       29.980000       54.523905 
      23       30.050000       54.518550 
      23       30.020000       54.540032 
      23       29.940000       54.579026 
      23       29.980000       54.579026 
      23       30.020000       54.579026 
      23       29.940000       54.594710 
      23       29.980000       54.558373 
      23       29.960000       54.558373 
      23       30.110000       54.558373 
      23       29.920000       54.517690 
      23       29.950000       54.495625 
      23       29.870000       54.517717 
      23       29.820000       54.559300 
      23       29.850000       54.606851 
      23       29.850000       54.644061 
      23       29.930000       54.697810 
      24       29.840000       54.697810 
      24       29.950000       54.710810 
      24       29.870000       54.646745 
      24       29.880000       54.646745 
      24       29.870000       54.646745 
      24       29.870000       54.606878 
      24       29.900000       54.557516 
      24       29.770000       54.515973 
      24       29.810000       54.562915 
      24       29.810000       54.631531 
      24       29.840000       54.631531 
      24       29.850000       54.692455 
      24       29.850000       54.763731 
      24       29.850000       54.756959 
      24       29.870000       54.756959 
      25       29.840000       54.666057 
      25       29.820000       54.586712 
      25       29.940000       54.586278 
      25       29.760000       54.596967 
      25       29.950000       54.579580 
      25       29.970000       54.610396 
      25       30.030000       54.646786 
      25       30.100000       54.642716 
      25       30.320000       54.642716 
      25       30.290000       54.642716 
      25       30.170000       54.663843 
      25       30.220000       54.694241 
      25       30.220000       54.753500 
      25       30.280000       54.753500 
      25       30.230000       54.753500 
      26       30.220000       54.778956 
      26       30.240000       54.778956 
      26       30.260000       54.715377 
      26       30.170000       54.715377 
      26       30.170000       54.715377 
      26       30.220000       54.667417 
      26       30.230000       54.709079 
      26       30.270000       54.743101 
      26       30.240000       54.655260 
      26       30.250000       54.551371 
      26       30.190000       54.563801 
      26       30.220000       54.606945 
      26       30.110000       54.642690 
      26       30.040000       54.642690 
      26       29.970000       54.702824 
      27       29.950000       54.702824 
      27       29.810000       54.730924 
      27       29.790000       54.744086 
      27       29.800000       54.744086 
      27       29.600000       54.688342 
      27       29.750000       54.577795 
      27       29.790000       54.517235 
      27       29.790000       54.517235 
      27       29.770000       54.517235 
      27       29.790000       54.517235 
      27       29.830000       54.517235 
      27       29.780000       54.556656 
      27       29.740000       54.595664 
      27       29.770000       54.593799 
      27       29.800000       54.616320 
      28       29.830000       54.642592 
      28       29.850000       54.626658 
      28       29.800000       54.573575 
      28       29.760000       54.573575 
      28       29.850000       54.573575 
      28       29.790000       54.567953 
      28       29.810000       54.573129 
      28       29.880000       54.557611 
      28       29.880000       54.530164 
      28       30.080000       54.566527 
      28       30.050000       54.619834 
      28       30.150000       54.619834 
      28       30.210000       54.628334 
      28       30.230000       54.617206 
      28       30.210000       54.618895 
      29       30.180000       54.651285 
      29       30.290000       54.647549 
      29       30.200000       54.610974 
      29       30.180000       54.565976 
      29       30.150000       54.552752 
      29       30.190000       54.552752 
      29       30.160000       54.552752 
      29       30.170000       54.552752 
      29       30.250000       54.552752 
      29       30.130000       54.584800 
      29       30.190000       54.632514 
      29       30.250000       54.661904 
      29       30.190000       54.661904 
      29       30.170000       54.702407 
      29       30.150000       54.707157 
      30       30.060000       54.704205 
      30       30.030000       54.664105 
      30       29.980000       54.571067 
      30       29.970000       54.500608 
      30       29.930000       54.484481 
      30       29.920000       54.480924 
      30       29.910000       54.539589 
      30       29.830000       54.539589 
      30       29.910000       54.611280 
      30       29.930000       54.611280 
      30       29.820000       54.611293 
      30       29.960000       54.605965 
      30       29.940000       54.605965 
      30       29.940000       54.581242 
      30       29.890000       54.555826 
      31       29.840000       54.586198 
      31       29.960000       54.625207 
      31       29.850000       54.632444 
      31       29.920000       54.621607 
      31       29.880000       54.621607 
      31       29.860000       54.621607 
      31       29.890000       54.584054 
      31       29.830000       54.618563 
      31       29.900000       54.746245 
      31       29.910000       54.762358 
      31       29.900000       54.708210 
      31       29.870000       54.701452 
      31       29.930000       54.670511 
      31       29.930000       54.613235 
      31       29.860000       54.635133 
      32       29.850000       54.730575 
      32       29.850000       54.743548 
      32       29.910000       54.702851 
      32       29.950000       54.696926 
      32       30.000000       54.661584 
      32       29.930000       54.634234 
      32       29.850000       54.670970 
      32       29.920000       54.663715 
      32       29.890000       54.600650 
      32       29.940000       54.600650 
      32       29.950000       54.600650 
      32       29.990000       54.570515 
      32       30.060000       54.577725 
      32       30.290000       54.569199 
      32       30.280000       54.584922 
      32       30.170000       54.597369 
      33       30.110000       54.597369 
      33       30.170000       54.584966 
      33       30.240000       54.634190 
      33       30.190000       54.682584 
      33       30.190000       54.658013 
      33       30.250000       54.690658 
      33       30.190000       54.735074 
      33       30.170000       54.701409 
      33       30.170000       54.644615 
      33       30.160000       54.609954 
      33       30.190000       54.662580 
      33       30.150000       54.712996 
      33       30.220000       54.710491 
      33       30.140000       54.693785 
      33       30.230000       54.701022 
      34       30.060000       54.679926 
      34       29.980000       54.644988 
      34       30.070000       54.636931 
      34       29.990000       54.636931 
      34       30.100000       54.635049 
      34       30.010000       54.640531 
      34       30.110000       54.647132 
      34       30.010000       54.617176 
      34       30.060000       54.535603 
      34       30.040000       54.535603 
      34       29.880000       54.535603 
      34       29.930000       54.532945 
      34       29.790000       54.532945 
      34       29.850000       54.532945 
      34       29.720000       54.602352 
      35       29.770000       54.602352 
      35       29.750000       54.657071 
      35       29.710000       54.694710 
      35       29.680000       54.680342 
      35       29.740000       54.655759 
      35       29.860000       54.684869 
      35       29.770000       54.684869 
      35       29.890000       54.709022 
      35       29.930000       54.660242 
      35       29.910000       54.605563 
      35       29.900000       54.614480 
      35       29.900000       54.649944 
      35       29.990000       54.721592 
      35       29.900000       54.745802 
      35       29.870000       54.653917 
      36       29.900000       54.618190 
      36       29.960000       54.618190 
      36       29.930000       54.670900 
      36       29.940000       54.700163 
      36       30.010000       54.692886 
      36       29.950000       54.700109 
      36       29.970000       54.700109 
      36       30.010000       54.669101 
      36       29.970000       54.595721 
      36       30.030000       54.595721 
      36       29.950000       54.595721 
      36       29.950000       54.546801 
      36       30.000000       54.544130 
      36       29.950000       54.580427 
      36       29.970000       54.672728 
      36       29.970000       54.718407 
      37       30.000000       54.639105 
      37       30.040000       54.567041 
      37       30.020000       54.567041 
      37       29.970000       54.567041 
      37       30.000000       54.567041 
      37       30.030000       54.582142 
      37       30.000000       54.606032 
      37       30.000000       54.606032 
      37       29.940000       54.612651 
      37       29.960000       54.628404 
      37       29.920000       54.624307 
      37       30.060000       54.665171 
      37       30.070000       54.665171 
      37       30.280000       54.708539 
      37       30.150000       54.673224 
      38       30.130000       54.597427 
      38       30.150000       54.562085 
      38       30.130000       54.604580 
      38       30.150000       54.604580 
      38       30.160000       54.635115 
      38       30.230000       54.588883 
      38       30.200000       54.588883 
      38       30.090000       54.558984 
      38       30.150000       54.595611 
      38       30.230000       54.675965 
      38       30.180000       54.722881 
      38       30.120000       54.734648 
      38       30.160000       54.727837 
      38       30.130000       54.695206 
      38       30.110000       54.695206 
      39       30.130000       54.616695 
      39       30.110000       54.567068 
      39       30.120000       54.605453 
      39       30.160000       54.640500 
      39       30.130000       54.640500 
      39       30.090000       54.612167 
      39       30.160000       54.612167 
      39       30.090000       54.587181 
      39       30.120000       54.587181 
      39       30.060000       54.560200 
      39       30.020000       54.560200 
      39       29.960000       54.548669 
      39       30.030000       54.581743 
      39       30.010000       54.683995 
      39       30.070000       54.772617 
      40       30.140000       54.772617 
      40       30.050000       54.747657 
      40       30.050000       54.747657 
      40       30.060000       54.747657 
      40       30.000000       54.670528 
      40       30.030000       54.670528 
      40       30.020000       54.631160 
      40       29.870000       54.631160 
      40       29.890000       54.665642 
      40       29.910000       54.794267 
      40       29.920000       54.866318 
      40       29.910000       54.866318 
      40       29.840000       54.801424 
      40       29.880000       54.691140 
      40       29.920000       54.598353 
      41       29.880000       54.556310 
      41       29.930000       54.556310 
      41       29.910000       54.575897 
      41       29.870000       54.582681 
      41       29.880000       54.582681 
      41       29.850000       54.582681 
      41       29.890000       54.582681 
      41       29.870000       54.582681 
      41       29.970000       54.583057 
      41       29.810000       54.645416 
      41       29.840000       54.652474 
      41       29.910000       54.571483 
      41       29.890000       54.516751 
      41       29.860000       54.516751 
      41       29.860000       54.556186 
      42       29.900000       54.589808 
      42       29.870000       54.589808 
      42       29.880000       54.563773 
      42       29.810000       54.547273 
      42       29.920000       54.559716 
      42       29.860000       54.581808 
      42       29.860000       54.588856 
      42       29.880000       54.611391 
      42       29.940000       54.629193 
      42       29.860000       54.635561 
      42       29.930000       54.635561 
      42       29.890000       54.633263 
      42       29.900000       54.619861 
      42       29.890000       54.562471 
      42       29.880000       54.562471 
      42       29.920000       54.562471 
      43       29.840000       54.522164 
      43       29.950000       54.590268 
      43       29.940000       54.667285 
      43       30.040000       54.618961 
      43       30.090000       54.517208 
      43       30.130000       54.517208 
      43       30.220000       54.514563 
      43       30.150000       54.604580 
      43       30.170000       54.682609 
      43       30.220000       54.668188 
      43       30.160000       54.668188 
      43       30.120000       54.668188 
      43       30.130000       54.601496 
      43       30.120000       54.575470 
      43       30.160000       54.596067 
      44       30.140000       54.579067 
      44       30.180000       54.540006 
      44       30.110000       54.540006 
      44       30.190000       54.517690 
      44       30.110000       54.513993 
      44       30.100000       54.533374 
      44       30.120000       54.542649 
      44       30.150000       54.542649 
      44       30.150000       54.575039 
      44       30.160000       54.563702 
      44       30.130000       54.496150 
      44       30.140000       54.457089 
      44       30.190000       54.485352 
      44       30.130000       54.514462 
      44       30.110000       54.514462 
      45       30.100000       54.485782 
      45       29.970000       54.462045 
      45       30.060000       54.514921 
      45       29.920000       54.578513 
      45       29.830000       54.548557 
      45       29.910000       54.475887 
      45       29.940000       54.453585 
      45       29.860000       54.483940 
      45       29.820000       54.521716 
      45       29.930000       54.513536 
      45       29.900000       54.523505 
      45       29.930000       54.569574 
      45       29.870000       54.569574 
      45       29.860000       54.569574 
      45       29.930000       54.569574 
      46       29.950000       54.569574 
      46       29.950000       54.569574 
      46       29.910000       54.642244 
      46       29.910000       54.648447 
      46       29.850000       54.545014 
      46       29.900000       54.469230 
      46       29.880000       54.502449 
      46       29.920000       54.502449 
      46       29.910000       54.587523 
      46       29.810000       54.610851 
      46       29.920000       54.558417 
      46       29.890000       54.566500 
      46       29.930000       54.590681 
      46       29.900000       54.590681 
      46       29.910000       54.563812 
      47       29.890000       54.563812 
      47       29.910000       54.547690 
      47       29.920000       54.564228 
      47       29.910000       54.595167 
      47       29.810000       54.579026 
      47       29.950000       54.539575 
      47       29.880000       54.539575 
      47       29.910000       54.512721 
      47       29.960000       54.494739 
      47       29.990000       54.494739 
      47       30.020000       54.511848 
      47       29.980000       54.511848 
      47       30.030000       54.529207 
      47       29.890000       54.535615 
      48       29.980000       54.535049 
      48       29.960000       54.541874 
      48       30.050000       54.563786 
      48       30.120000       54.595623 
      48       30.130000       54.595623 
      48       30.050000       54.595623 
      48       30.140000       54.585299 
      48       30.090000       54.574141 
      48       30.110000       54.596040 
      48       30.130000       54.596040 
      48       30.160000       54.579496 
      48       30.090000       54.544974 
      48       30.110000       54.536891 
      48       30.130000       54.533760 
      48       30.080000       54.533760 
      48       30.130000       54.533760 
      49       30.040000       54.525676 
      49       30.080000       54.491154 
      49       30.130000       54.474598 
      49       30.040000       54.496080 
      49       30.070000       54.496080 
      49       30.090000       54.480382 
      49       30.150000       54.480382 
      49       30.090000       54.455760 
      49       30.190000       54.484882 
      49       30.220000       54.509506 
      49       30.040000       54.466984 
      49       30.030000       54.446348 
      49       30.080000       54.446348 
      49       30.190000       54.530619 
      49       30.170000       54.530619 
      50       30.080000       54.597338 
      50       30.100000       54.554399 
      50       30.160000       54.487129 
      50       30.090000       54.502449 
      50       30.110000       54.502449 
      50       30.100000       54.569558 
      50       30.120000       54.599236 
      50       30.050000       54.582114 
      50       30.160000       54.552628 
      50       30.030000       54.501024 
      50       29.910000       54.501024 
      50       29.950000       54.501024 
      50       29.780000       54.507392 
      50       29.850000       54.507392 
      50       29.830000       54.574514 
      51       29.850000       54.574514 
      51       29.780000       54.613535 
      51       29.840000       54.584412 
      51       29.880000       54.545431 
      51       29.840000       54.537804 
      51       29.810000       54.537804 
      51       29.930000       54.544975 
      51       29.840000       54.578610 
      51       29.880000       54.578610 
      51       29.890000       54.585255 
      51       29.830000       54.526163 
      51       29.830000       54.510023 
      51       29.920000       54.510023 
      51       29.910000       54.510023 
      51       29.820000       54.510023 
      52       30.060000       54.560601 
      52       30.030000       54.543615 
      52       30.010000       54.475027 
      52       29.760000       54.475027 
      52       29.810000       54.448589 
      52       29.830000       54.448589 
      52       29.960000       54.448589 
      52       30.040000       54.464283 
      52       29.940000       54.496093 
      52       30.120000       54.491141 
      52       30.120000       54.491141 
      52       30.120000       54.503737 
      52       30.010000       54.560158 
      52       30.080000       54.544501 
      52       30.060000       54.486269 
      53       30.070000       54.502382 
      53       30.160000       54.568255 
      53       30.090000       54.568255 
      53       30.080000       54.568255 
      53       30.080000       54.583925 
      53       30.100000       54.583925 
      53       30.090000       54.520294 
      53       30.030000       54.480426 
      53       30.080000       54.496550 
      53       30.060000       54.480853 
      53       30.120000       54.461615 
      53       30.160000       54.461615 
      53       30.020000       54.461615 
      53       30.140000       54.461615 
      53       30.060000       54.514908 
      54       30.040000       54.578512 
      54       30.030000       54.548530 
      54       30.100000       54.548530 
      54       30.130000       54.475001 
      54       30.050000       54.442787 
      54       30.090000       54.435546 
      54       30.050000       54.441914 
      54       30.120000       54.464659 
      54       30.100000       54.505965 
      54       30.010000       54.527891 
      54       30.050000       54.527891 
      54       30.030000       54.525662 
      54       30.000000       54.525662 
      54       30.060000       54.496540 
      54       30.120000       54.498808 
      55       30.070000       54.536391 
      55       30.030000       54.509093 
      55       30.070000       54.509093 
      55       30.070000       54.474598 
      55       30.040000       54.474598 
      55       30.090000       54.474598 
      55       30.140000       54.478141 
      55       29.990000       54.478141 
      55       30.120000       54.469642 
      55       29.940000       54.489865 
      55       29.980000       54.515751 
      55       29.920000       54.496137 
      55       29.800000       54.504597 
      55       29.820000       54.504597 
      55       29.770000       54.565114 
      55       29.840000       54.562842 
      56       29.840000       54.562842 
      56       29.790000       54.562842 
      56       29.760000       54.496110 
      56       29.810000       54.456659 
      56       29.820000       54.480383 
      56       29.840000       54.495207 
      56       29.780000       54.495207 
      56       29.860000       54.464230 
      56       29.810000       54.447743 
      56       29.820000       54.447743 
      56       29.790000       54.465572 
      56       29.850000       54.511821 
      56       29.750000       54.557460 
      56       29.840000       54.588854 
      56       29.930000       54.549404 
      57       29.960000       54.475068 
      57       30.040000       54.444157 
      57       29.990000       54.453099 
      57       30.080000       54.531563 
      57       30.080000       54.666871 
      57       30.030000       54.736735 
      57       30.050000       54.659301 
      57       30.030000       54.659301 
      57       30.060000       54.659301 
      57       30.040000       54.659301 
      57       30.070000       54.565145 
      57       30.040000       54.558900 
      57       30.040000       54.552988 
      57       30.000000       54.529330 
      57       30.040000       54.475830 
      58       30.090000       54.407432 
      58       30.010000       54.401065 
      58       30.060000       54.453985 
      58       30.040000       54.499224 
      58       30.030000       54.499224 
      58       30.070000       54.499224 
      58       30.050000       54.583499 
      58       29.980000       54.647976 
      58       29.990000       54.597367 
      58       30.100000       54.501523 
      58       29.990000       54.501523 
      58       30.020000       54.447244 
      58       30.000000       54.447244 
      58       30.020000       54.443740 
      58       30.000000       54.443740 
      59       30.010000       54.476358 
      59       30.050000       54.476358 
      59       30.060000       54.564754 
      59       29.990000       54.564754 
      59       30.010000       54.564754 
      59       30.040000       54.651977 
      59       30.050000       54.651977 
      59       29.970000       54.651977 
      59       30.100000       54.651977 
      59       30.040000       54.644972 
      59       30.010000       54.578088 
      59       30.050000       54.578088 
      59       30.000000       54.563439 
      59       30.000000       54.563439 
      59       30.030000       54.554747 
      60       29.990000       54.554747 
      60       30.040000       54.545983 
      60       30.020000       54.553834 
      60       30.080000       54.553834 
      60       30.030000       54.551728 
      60       30.020000       54.551728 
      60       30.000000       54.551728 
      60       30.020000       54.518023 
      60       29.990000       54.506462 
      60       30.010000       54.481712 
      60       30.060000       54.461655 
      60       30.040000       54.515365 
      60       30.060000       54.584368 
      60       30.080000       54.584368 
      60       29.990000       54.578556 
      60       30.000000       54.544061 
      61       30.090000       54.544061 
