

 time    ||    gripping force   ||   raspberry measurement 

      0       0.020000       -794.916279 
      0       0.070000       -794.916279 
      0       0.450000       -794.916279 
      0       0.170000       -794.916279 
      0       0.000000       -794.916279 
      0       0.110000       -794.916279 
      0       0.100000       -794.916279 
      0       0.050000       -794.916279 
      0       0.260000       -794.916279 
      0       0.140000       -794.916274 
      0       0.340000       -794.915096 
      0       0.060000       -794.809008 
      1       0.300000       -791.295869 
      1       0.590000       -748.496800 
      1       0.360000       -556.681637 
      1       14.730000       -240.420837 
      1       45.520000       -48.589118 
      1       60.800000       -5.777036 
      1       95.260000       -2.224418 
      1       146.300000       -2.087476 
      1       171.750000       -2.105455 
      1       168.810000       -2.096091 
      1       135.280000       -2.024815 
      1       113.760000       -1.980009 
      1       111.790000       -1.982706 
      2       115.600000       -2.040942 
      2       128.020000       -2.101435 
      2       128.280000       -2.112135 
      2       127.260000       -2.099969 
      2       126.480000       -2.020000 
      2       125.590000       -1.845497 
      2       125.380000       -1.479508 
      2       125.210000       -0.807591 
      2       124.970000       0.062892 
      2       124.620000       0.840048 
      2       124.000000       1.194242 
      3       122.870000       1.050074 
      3       122.100000       0.675172 
      3       121.790000       0.336774 
      3       121.310000       0.191685 
      3       121.100000       0.241267 
      3       119.720000       0.341171 
      3       119.440000       0.402110 
      4       118.750000       0.506069 
      4       118.680000       0.586296 
      4       118.700000       0.520837 
      4       118.550000       0.415663 
      4       118.080000       0.388598 
      4       117.540000       0.390922 
      5       114.350000       0.339747 
      5       113.850000       0.298993 
      5       112.780000       0.225849 
      5       112.300000       0.144411 
      6       110.630000       0.166687 
      6       110.590000       0.223646 
      6       110.000000       0.250031 
      6       109.600000       0.244246 
      7       108.480000       0.187256 
      7       108.470000       0.145699 
      7       108.400000       0.133906 
      7       108.330000       0.134471 
      7       108.310000       0.133006 
      7       108.290000       0.134444 
      7       108.120000       0.133006 
      8       108.110000       0.134418 
      8       108.020000       0.132119 
      8       108.010000       0.123619 
      8       107.860000       0.083725 
      8       107.880000       0.043831 
      8       107.780000       0.035331 
      8       107.690000       0.033033 
      9       107.390000       0.034445 
      9       107.430000       0.033033 
      9       107.360000       0.035331 
      9       107.380000       0.043804 
      10       106.730000       0.082839 
      10       106.670000       0.112821 
      10       106.560000       0.083725 
      10       106.550000       0.054602 
      10       106.500000       0.083725 
      10       106.430000       0.112848 
      11       103.420000       0.083725 
      11       103.330000       0.054602 
      11       103.270000       0.083725 
      11       103.120000       0.112848 
      11       103.100000       0.083725 
      11       103.110000       0.054602 
      11       102.920000       0.083725 
      11       102.850000       0.112821 
      12       102.870000       0.082839 
      12       102.750000       0.043804 
      12       102.750000       0.035331 
      13       102.680000       0.033033 
      13       102.700000       0.034445 
      13       102.520000       0.033006 
      14       102.490000       0.034445 
      14       102.510000       0.033033 
      14       102.440000       0.035331 
      14       102.370000       0.043791 
      14       102.410000       0.082382 
      15       102.370000       0.106965 
      15       102.410000       0.053672 
      15       102.290000       -0.015318 
      15       102.270000       -0.009533 
      15       102.280000       0.024103 
      15       102.220000       0.032133 
      15       102.230000       0.034418 
      15       102.220000       0.033006 
      15       102.180000       0.034444 
      16       102.190000       0.033006 
      16       102.230000       0.034444 
      16       102.180000       0.033006 
      16       102.220000       0.034444 
      16       102.110000       0.033006 
      16       102.200000       0.034444 
      16       102.230000       0.033006 
      16       102.090000       0.034113 
      16       102.100000       0.032787 
      16       102.140000       0.039188 
      16       102.100000       0.060038 
      17       102.070000       0.085199 
      17       102.160000       0.045703 
      17       102.100000       -0.018561 
      17       102.080000       -0.012235 
      17       102.010000       0.021199 
      17       102.030000       0.028938 
      17       102.010000       0.030910 
      17       102.010000       0.029203 
      17       102.020000       0.030335 
      17       101.970000       0.028608 
      18       101.730000       0.029746 
      18       101.750000       0.028024 
      19       101.500000       0.029168 
      19       101.440000       0.027452 
      19       101.470000       0.028602 
      19       101.450000       0.026892 
      19       101.390000       0.028047 
      19       101.320000       0.026342 
      19       101.260000       0.027503 
      19       101.130000       0.025804 
      19       101.080000       0.026970 
      19       100.920000       0.025276 
      20       100.730000       0.026447 
      20       100.480000       0.024759 
      20       96.540000       0.025935 
      20       96.930000       0.024252 
      20       96.890000       0.025407 
      20       96.860000       0.022878 
      20       97.010000       0.014260 
      21       96.960000       -0.024539 
      21       96.890000       -0.054376 
      21       96.950000       -0.029082 
      21       96.950000       -0.008757 
      21       97.030000       -0.015821 
      21       96.940000       0.002152 
      21       96.950000       0.019343 
      21       96.980000       0.025480 
      22       96.990000       0.024227 
      22       97.030000       0.025395 
      22       96.900000       0.022879 
      22       96.980000       0.014661 
      22       97.030000       -0.020061 
      22       96.960000       -0.040307 
      22       97.010000       -0.027460 
      22       96.950000       -0.021884 
      22       96.970000       -0.008795 
      22       96.990000       -0.024234 
      22       97.030000       -0.039519 
      22       96.960000       -0.026228 
      22       97.020000       -0.019813 
      23       96.940000       0.002668 
      23       97.020000       0.020266 
      23       96.930000       0.026407 
      23       97.000000       0.025145 
      23       97.010000       0.026330 
      23       96.940000       0.024643 
      23       96.950000       0.025821 
      23       96.940000       0.024125 
      24       97.040000       0.024882 
      24       96.960000       0.018290 
      24       97.000000       0.000482 
      24       96.900000       -0.021832 
      24       96.900000       -0.028591 
      24       96.980000       -0.050215 
      24       96.930000       -0.063270 
      25       96.840000       -0.059797 
      25       97.020000       -0.076238 
      25       96.870000       -0.119203 
      25       96.970000       -0.139062 
      25       96.890000       -0.144987 
      25       96.940000       -0.065220 
      25       97.500000       0.009711 
      25       97.500000       0.030265 
      25       97.520000       0.024921 
      26       97.740000       0.003045 
      26       97.880000       -0.028065 
      26       97.980000       -0.012245 
      26       97.880000       0.022028 
      26       97.910000       0.029771 
      26       97.910000       0.031310 
      26       98.390000       0.024692 
      26       98.490000       0.007260 
      26       98.510000       -0.009777 
      27       98.920000       0.007285 
      27       99.000000       0.024385 
      27       98.950000       0.030046 
      27       98.990000       0.023840 
      27       98.820000       0.006403 
      27       99.010000       -0.011477 
      27       98.910000       -0.004210 
      27       98.950000       -0.024202 
      27       98.910000       -0.048710 
      28       98.920000       -0.018155 
      28       98.870000       0.020245 
      28       98.890000       0.023087 
      28       98.950000       0.001176 
      28       98.840000       -0.039703 
      29       98.860000       -0.060985 
      29       98.920000       -0.057306 
      29       98.930000       -0.017676 
      29       98.840000       0.021983 
      29       98.900000       0.030178 
      29       98.920000       0.032151 
      29       98.910000       0.030432 
      29       98.870000       0.031552 
      30       98.850000       0.029812 
      30       98.910000       0.030938 
      30       98.870000       0.029205 
      30       98.890000       0.030337 
      30       98.850000       0.028610 
      30       98.910000       0.029747 
      30       98.860000       0.028026 
      30       98.860000       0.029170 
      30       98.810000       0.027454 
      30       98.880000       0.028577 
      30       98.760000       0.026016 
      31       98.790000       0.017367 
      31       98.820000       -0.021464 
      31       98.830000       -0.051331 
      31       99.030000       -0.026094 
      31       99.050000       -0.006663 
      31       99.030000       -0.023973 
      31       99.020000       -0.047646 
      31       99.110000       -0.075592 
      31       99.110000       -0.044194 
      31       99.090000       -0.014522 
      32       99.180000       -0.040950 
      32       99.200000       -0.060956 
      32       99.160000       -0.057238 
      32       99.200000       -0.017622 
      32       99.300000       0.021598 
      32       99.200000       0.024451 
      32       99.240000       0.002527 
      32       99.310000       -0.038365 
      33       99.260000       -0.059661 
      33       99.300000       -0.055994 
      33       99.240000       -0.016378 
      33       99.270000       0.023268 
      33       99.190000       0.031450 
      33       99.220000       0.033411 
      33       99.200000       0.031679 
      33       99.210000       0.032786 
      33       99.250000       0.031021 
      34       99.230000       0.031709 
      34       99.210000       0.025049 
      34       99.210000       0.007174 
      34       99.300000       -0.015181 
      34       99.220000       -0.021169 
      34       99.600000       -0.033427 
      34       99.820000       -0.012647 
      34       100.030000       0.022055 
      35       100.160000       0.029811 
      35       100.080000       0.031350 
      35       100.160000       0.024732 
      35       100.230000       0.007299 
      35       100.060000       -0.009738 
      35       100.170000       0.007323 
      35       100.080000       0.024436 
      36       100.290000       0.030522 
      36       100.440000       0.029218 
      36       100.490000       0.030337 
      36       100.380000       0.027771 
      36       100.510000       0.019504 
      36       100.480000       -0.015279 
      36       100.500000       -0.035986 
      37       100.580000       -0.027649 
      37       100.560000       -0.035349 
      37       100.440000       -0.014137 
      37       100.510000       0.020567 
      37       100.680000       0.027512 
      37       100.610000       0.020099 
      37       100.480000       -0.014226 
      37       100.600000       -0.029623 
      38       100.460000       0.001753 
      38       100.620000       0.023416 
      38       100.520000       0.029924 
      38       100.560000       0.028639 
      38       100.500000       0.029790 
      38       100.500000       0.028069 
      38       100.470000       0.029212 
      38       100.610000       0.027496 
      38       100.590000       0.028645 
      38       100.550000       0.026934 
      39       100.610000       0.028089 
      39       100.520000       0.026384 
      39       100.580000       0.027544 
      39       100.500000       0.025845 
      39       100.610000       0.027010 
      39       100.530000       0.025303 
      40       100.500000       0.026049 
      40       100.510000       0.019457 
      40       100.470000       0.002038 
      40       100.450000       -0.016211 
      40       100.500000       -0.013391 
      40       100.500000       -0.047407 
      40       100.510000       -0.073107 
      41       100.470000       -0.025330 
      41       100.540000       0.015226 
      41       100.520000       0.026697 
      41       100.470000       0.025032 
      41       100.530000       0.016832 
      41       100.510000       -0.017486 
      41       100.470000       -0.032865 
      41       100.510000       -0.001881 
      41       100.580000       0.014911 
      41       100.530000       0.002895 
      42       100.540000       -0.013660 
      42       100.500000       0.003454 
      42       100.460000       0.020606 
      42       100.480000       0.026730 
      42       100.480000       0.025464 
      42       100.460000       0.026647 
      42       100.490000       0.024956 
      43       100.450000       0.026131 
      43       100.450000       0.024445 
      43       100.460000       0.025625 
      43       100.530000       0.023945 
      43       100.420000       0.025129 
      43       100.460000       0.023441 
      43       100.420000       0.024205 
      44       100.450000       0.017632 
      44       100.460000       0.000270 
      44       100.440000       -0.016697 
      44       100.470000       0.000434 
      44       100.430000       0.017616 
      44       100.470000       0.023770 
      44       100.420000       0.022507 
      44       100.450000       0.022842 
      44       100.450000       0.010539 
      44       100.460000       -0.034762 
      45       100.420000       -0.099645 
      45       100.420000       -0.083109 
      45       100.460000       -0.013978 
      45       100.470000       0.017629 
      45       100.400000       0.024195 
      45       100.510000       0.013168 
      45       100.420000       -0.023172 
      46       100.440000       -0.060351 
      46       100.460000       -0.045853 
      46       100.470000       -0.025152 
      46       100.430000       0.001451 
      46       100.370000       0.014567 
      46       100.430000       0.002168 
      46       100.360000       -0.014392 
      46       100.430000       0.002729 
      47       100.430000       0.019888 
      47       100.370000       0.026020 
      47       100.430000       0.024761 
      47       100.430000       0.025951 
      47       100.390000       0.024267 
      47       100.390000       0.025449 
      47       100.400000       0.023770 
      47       100.400000       0.024956 
      48       100.400000       0.023283 
      48       100.390000       0.024474 
      48       100.400000       0.022805 
      48       100.400000       0.024001 
      48       100.410000       0.022337 
      48       100.390000       0.023538 
      48       100.380000       0.021878 
      48       100.420000       0.023084 
      49       100.350000       0.021429 
      49       100.430000       0.022639 
      49       100.350000       0.020988 
      49       100.400000       0.022202 
      49       100.400000       0.020556 
      49       100.440000       0.021775 
      49       100.380000       0.020120 
      49       100.450000       0.020917 
      49       100.380000       0.014377 
      49       100.430000       -0.002952 
      50       100.310000       -0.019887 
      50       100.350000       -0.002724 
      50       100.400000       0.014489 
      50       100.450000       0.020675 
      50       100.420000       0.019456 
      50       100.470000       0.020273 
      50       100.350000       0.013740 
      50       100.390000       -0.003610 
      50       100.360000       -0.021389 
      51       100.320000       -0.014023 
      51       100.410000       -0.033917 
      51       100.390000       -0.058354 
      51       100.420000       -0.028540 
      51       100.280000       0.000590 
      51       100.340000       -0.028260 
      51       100.320000       -0.057209 
      51       100.410000       -0.031861 
      51       100.380000       -0.011534 
      51       100.430000       -0.019408 
      52       100.410000       -0.010799 
      52       100.380000       -0.026205 
      52       100.320000       -0.036576 
      52       100.350000       -0.004705 
      52       100.350000       0.017035 
      52       100.350000       0.023581 
      52       100.330000       0.021509 
      52       100.440000       0.012918 
      52       100.320000       -0.025868 
      52       100.360000       -0.055691 
      53       100.380000       -0.030397 
      53       100.260000       -0.010498 
      53       100.310000       -0.022890 
      53       100.380000       -0.028801 
      53       100.370000       -0.050770 
      53       100.280000       -0.067048 
      53       100.370000       -0.063321 
      53       100.290000       -0.028937 
      53       100.350000       -0.012269 
      54       100.310000       -0.033388 
      54       100.370000       -0.016676 
      54       100.330000       0.017242 
      54       100.380000       0.020139 
      54       100.290000       0.003590 
      54       100.340000       -0.013384 
      54       100.320000       0.003714 
      54       100.350000       0.020850 
      54       100.300000       0.026546 
      54       100.290000       0.020376 
      54       100.280000       0.002973 
      54       100.340000       -0.014872 
      55       100.280000       -0.007598 
      55       100.350000       -0.028408 
      55       100.410000       -0.062713 
      55       100.240000       -0.070075 
      55       100.320000       -0.071636 
      55       100.360000       -0.069509 
      55       100.280000       -0.069826 
      55       100.290000       -0.063209 
      55       100.360000       -0.049885 
      55       100.280000       -0.046565 
      55       100.310000       -0.065312 
      55       100.270000       -0.073868 
      56       100.290000       -0.106046 
      56       100.370000       -0.103549 
      56       100.300000       -0.072019 
      56       100.330000       -0.054335 
      56       100.340000       -0.018790 
      56       100.250000       -0.002198 
      56       100.340000       -0.023882 
      56       100.270000       -0.013422 
      56       100.310000       -0.012041 
      56       100.340000       -0.071259 
      56       100.240000       -0.090594 
      57       100.270000       -0.048413 
      57       100.290000       -0.043065 
      57       100.280000       -0.063889 
      57       100.300000       -0.101017 
      57       100.330000       -0.106147 
      57       100.200000       -0.036798 
      57       100.310000       0.016356 
      57       100.290000       -0.007294 
      57       100.320000       -0.035613 
      57       100.270000       -0.006412 
      58       100.230000       0.022483 
      58       100.310000       -0.006599 
      58       100.300000       -0.036190 
      58       100.300000       -0.015984 
      58       100.230000       -0.015251 
      58       100.290000       -0.047603 
      58       100.250000       -0.050992 
      58       100.260000       -0.045740 
      58       100.310000       -0.002965 
      59       100.210000       0.033698 
      59       100.270000       0.044185 
      59       100.200000       0.037825 
      59       100.280000       0.014916 
      59       100.290000       -0.026990 
      59       100.300000       -0.058652 
      59       100.270000       -0.097586 
      59       100.270000       -0.113414 
      59       100.270000       -0.090175 
      59       100.230000       -0.095000 
      59       100.300000       -0.081155 
      59       100.280000       -0.018756 
      60       100.270000       -0.006511 
      60       100.260000       -0.021586 
      60       100.260000       -0.032416 
      60       100.290000       -0.070727 
      60       100.250000       -0.094370 
      60       100.290000       -0.105883 
      60       100.270000       -0.065755 
      60       100.250000       -0.009689 
      60       100.240000       0.005535 
      60       100.270000       0.013882 
      60       100.320000       -0.025287 
      60       100.230000       -0.075150 
      60       100.150000       -0.066834 
      61       100.280000       -0.049393 
