Human trial picking the raspberry twin 

 time    ||     output     ||     loadcell

      0.000000       -802.953125       0.080000 
      0.029781       -802.953125       0.060000 
      0.061695       -802.953125       0.140000 
      0.092300       -802.953125       0.060000 
      0.123547       -802.953125       0.340000 
      0.155436       -802.953125       0.070000 
      0.186512       -802.953125       0.200000 
      0.217309       -802.953125       0.220000 
      0.247678       -802.953125       0.080000 
      0.279834       -802.953120       0.080000 
      0.310467       -802.951926       0.070000 
      0.340564       -802.844461       0.240000 
      0.371238       -799.285686       0.010000 
      0.403485       -755.930954       0.370000 
      0.435373       -561.628892       0.160000 
      0.465996       -241.283210       0.030000 
      0.496958       -46.999973       0.260000 
      0.528203       -3.666739       0.190000 
      0.560180       -0.120977       0.150000 
      0.590720       -0.048007       0.430000 
      0.621009       -0.057568       0.300000 
      0.652846       -0.007384       0.390000 
      0.685051       0.029782       0.170000 
      0.716565       0.015940       0.140000 
      0.747740       -0.022638       0.040000 
      0.778360       -0.041410       0.080000 
      0.809287       -0.022624       0.090000 
      0.840007       0.016397       0.290000 
      0.872011       0.035624       0.260000 
      0.903201       0.022212       0.130000 
      0.934857       0.006528       0.140000 
      0.965423       0.017283       0.140000 
      0.996638       0.017283       0.130000 
      1.028381       0.006542       0.160000 
      1.060165       0.022669       0.050000 
      1.091111       0.041480       0.040000 
      1.121513       0.046436       0.030000 
      1.152432       0.046866       0.080000 
      1.183351       0.046879       0.150000 
      1.214960       0.046879       0.340000 
      1.245365       0.046879       0.190000 
      1.277176       0.046879       0.170000 
      1.308958       0.046879       0.070000 
      1.339363       0.046853       0.290000 
      1.370405       0.045993       0.230000 
      1.401886       0.036081       0.300000 
      1.432799       -0.001528       0.150000 
      1.464061       -0.033366       0.140000 
      1.495217       -0.007357       0.090000 
      1.525984       0.006472       0.120000 
      1.557864       -0.018542       0.040000 
      1.589070       -0.022638       0.260000 
      1.619859       -0.006914       0.150000 
      1.651148       0.001143       0.260000 
      1.683066       0.022226       0.020000 
      1.715012       0.041467       0.060000 
      1.744931       0.046436       0.060000 
      1.775844       0.046866       0.070000 
      1.806766       0.046879       0.110000 
      1.838696       0.046853       0.420000 
      1.869614       0.045993       0.230000 
      1.900499       0.036068       0.170000 
      1.931415       -0.001958       0.080000 
      1.961338       -0.038308       0.140000 
      1.992254       -0.025712       0.020000 
      2.023196       -0.003827       0.240000 
      2.054122       0.021339       0.030000 
      2.085911       0.035611       0.110000 
      2.115804       0.016839       0.080000 
      2.147745       -0.017266       0.040000 
      2.179634       -0.018542       0.010000 
      2.209949       0.001086       0.180000 
      2.240642       -0.031554       0.170000 
      2.271934       -0.073260       0.220000 
      2.303396       -0.025725       0.060000 
      2.334231       0.030682       0.160000 
      2.365282       0.045550       0.090000 
      2.395752       0.046826       0.020000 
      2.426682       0.046422       0.170000 
      2.457586       0.041037       0.150000 
      2.489142       0.017283       0.050000 
      2.520106       -0.017212       0.070000 
      2.551028       -0.017212       0.050000 
      2.582417       0.017283       0.150000 
      2.612290       0.041037       0.070000 
      2.643109       0.046423       0.080000 
      2.674043       0.046866       0.140000 
      2.705275       0.046879       0.030000 
      2.735088       0.046879       0.220000 
      2.766696       0.046879       0.030000 
      2.797244       0.046879       0.180000 
      2.827596       0.046866       0.120000 
      2.858987       0.046436       0.210000 
      2.889708       0.041480       0.110000 
      2.920398       0.022682       0.080000 
      2.951555       0.006985       0.140000 
      2.982344       0.022682       0.180000 
      3.012513       0.041467       0.050000 
      3.043096       0.045993       0.200000 
      3.073913       0.041467       0.090000 
      3.105826       0.022682       0.020000 
      3.135822       0.006972       0.040000 
      3.167768       0.022239       0.080000 
      3.199999       0.036081       0.130000 
      3.231894       0.022239       0.130000 
      3.263449       0.006972       0.200000 
      3.294321       0.022682       0.070000 
      3.324438       0.041480       0.050000 
      3.354704       0.046436       0.140000 
      3.385122       0.046839       0.140000 
      3.415194       0.045993       0.420000 
      3.445696       0.036081       0.210000 
      3.476496       -0.001515       0.020000 
      3.508361       -0.032909       0.110000 
      3.554162       -0.001515       0.160000 
      3.585241       0.036068       0.050000 
      3.615812       0.045550       0.050000 
      3.646654       0.041453       0.010000 
      3.677423       0.022682       0.070000 
      3.709201       0.006985       0.050000 
      3.739918       0.022682       0.010000 
      3.771623       0.041480       0.070000 
      3.802167       0.046436       0.050000 
      3.833405       0.046866       0.020000 
      3.864362       0.046879       0.010000 
      3.894992       0.046879       0.050000 
      3.925438       0.046866       0.040000 
      3.957441       0.046436       0.170000 
      3.989013       0.041480       0.310000 
      4.019777       0.022682       0.070000 
      4.050935       0.006985       0.130000 
      4.081240       0.022682       0.480000 
      4.112074       0.041467       0.020000 
      4.143688       0.045993       0.040000 
      4.175600       0.041467       0.010000 
      4.205822       0.022682       0.300000 
      4.235456       0.006985       0.070000 
      4.266243       0.022682       0.050000 
      4.297796       0.041467       0.040000 
      4.329215       0.045993       0.260000 
      4.359947       0.041467       0.070000 
      4.392092       0.022669       0.150000 
      4.423683       0.006542       0.150000 
      4.455220       0.017283       0.120000 
      4.486514       0.017283       0.020000 
      4.517414       0.006542       0.080000 
      4.548545       0.022669       0.110000 
      4.580384       0.041480       0.040000 
      4.611186       0.046423       0.150000 
      4.642672       0.046409       0.120000 
      4.673646       0.041023       0.060000 
      4.704407       0.016840       0.060000 
      4.735786       -0.022611       0.060000 
      4.766450       -0.041409       0.020000 
      4.797724       -0.022624       0.110000 
      4.844433       0.016397       0.020000 
      4.876250       0.035625       0.210000 
      4.906323       0.022226       0.010000 
      4.937335       0.006972       0.060000 
      4.969434       0.022682       0.220000 
      5.000647       0.041480       0.080000 
      5.031946       0.046436       0.100000 
      5.061572       0.046866       0.180000 
      5.092227       0.046879       0.070000 
      5.123902       0.046879       0.050000 
      5.154839       0.046879       0.080000 
      5.185760       0.046879       0.050000 
      5.216866       0.046879       0.130000 
      5.247510       0.046866       0.090000 
      5.278336       0.046436       0.120000 
      5.309554       0.041480       0.120000 
      5.341294       0.022682       0.030000 
      5.373014       0.006985       0.010000 
      5.404939       0.022682       0.100000 
      5.436512       0.041480       0.020000 
      5.467257       0.046436       0.180000 
      5.499270       0.046866       0.080000 
      5.530376       0.046879       0.110000 
      5.561144       0.046879       0.030000 
      5.592507       0.046879       0.110000 
      5.623672       0.046879       0.310000 
      5.654566       0.046879       0.050000 
      5.686180       0.046879       0.170000 
      5.717248       0.046879       0.160000 
      5.748697       0.046879       0.300000 
      5.780266       0.046879       0.060000 
      5.811833       0.046879       0.190000 
      5.842365       0.046866       0.070000 
      5.873455       0.046436       0.180000 
      5.904508       0.041480       0.140000 
      5.935024       0.022682       0.080000 
      5.966506       0.006985       0.150000 
      5.998081       0.022682       0.030000 
      6.029332       0.041480       0.070000 
      6.059912       0.046436       0.020000 
      6.090538       0.046866       0.430000 
      6.121227       0.046879       0.340000 
      6.152893       0.046879       0.640000 
      6.182812       0.046879       0.180000 
      6.214723       0.046879       0.030000 
      6.246662       0.046879       1.440000 
      6.277929       0.046879       1.260000 
      6.308705       0.046879       2.590000 
      6.339309       0.046879       2.280000 
      6.370194       0.046879       4.780000 
      6.401431       0.046879       8.160000 
      6.431594       0.046879       16.860000 
      6.462419       0.046879       24.400000 
      6.493445       0.046866       38.150000 
      6.524536       0.046436       54.230000 
      6.555706       0.041480       69.020000 
      6.587440       0.022682       80.530000 
      6.618987       0.006985       92.120000 
      6.649729       0.022682       98.040000 
      6.680680       0.041480       106.980000 
      6.711798       0.046436       116.440000 
      6.742924       0.046866       133.580000 
      6.773733       0.046879       147.170000 
      6.804517       0.046879       154.420000 
      6.835918       0.046893       169.870000 
      6.866891       0.047364       185.380000 
      6.897605       0.053690       198.880000 
      6.928526       0.090055       207.210000 
      6.959954       0.195883       174.110000 
      6.990530       0.389101       114.790000 
      7.021405       0.640567       1.360000 
      7.052566       0.868279       5.010000 
      7.083484       0.997862       5.520000 
      7.114737       1.039613       6.620000 
      7.147106       1.046423       6.190000 
      7.177099       1.048276       6.590000 
      7.207024       1.065844       6.700000 
      7.238227       1.155546       6.920000 
      7.269597       1.359503       6.620000 
      7.300018       1.610831       6.560000 
      7.330348       1.822970       6.110000 
      7.361505       1.901527       5.720000 
      7.392182       1.562577       5.690000 
      7.423751       0.503424       5.630000 
      7.454449       -0.693040       5.280000 
      7.485278       -1.082931       5.080000 
      7.516653       -1.075198       5.110000 
      7.547632       -1.273506       5.380000 
      7.578367       -1.637026       5.340000 
      7.609177       -1.875766       5.300000 
      7.639930       -1.943598       5.360000 
      7.671137       -1.952556       5.750000 
      7.700940       -1.953106       5.410000 
      7.731907       -1.953121       5.650000 
      7.762578       -1.953121       5.770000 
      7.794562       -1.953121       6.180000 
      7.826162       -1.953121       6.250000 
      7.857791       -1.953121       6.550000 
      7.888759       -1.953121       6.490000 
      7.919924       -1.953121       6.720000 
      7.950975       -1.953121       6.780000 
      7.982894       -1.953121       6.580000 
      8.013812       -1.953121       6.250000 
      8.044729       -1.953121       6.070000 
      8.075647       -1.953121       5.760000 
      8.106589       -1.953121       5.680000 
      8.138511       -1.953121       5.370000 
      8.168430       -1.953121       5.390000 
      8.200337       -1.953121       5.160000 
      8.232254       -1.953121       5.160000 
      8.262164       -1.953121       5.420000 
      8.294094       -1.953121       5.360000 
      8.325004       -1.953121       5.550000 
      8.354932       -1.953121       5.540000 
      8.385850       -1.953121       5.850000 
      8.415862       -1.953121       5.660000 
      8.446581       -1.953121       6.100000 
      8.478657       -1.953121       6.100000 
      8.510112       -1.953121       6.100000 
      8.540978       -1.953121       6.290000 
      8.572433       -1.953121       6.350000 
      8.603781       -1.953121       6.390000 
      8.635729       -1.953121       6.380000 
      8.667157       -1.953121       6.460000 
      8.697569       -1.953121       6.150000 
      8.728873       -1.953121       5.910000 
      8.760444       -1.953121       5.910000 
      8.792339       -1.953121       5.720000 
      8.822524       -1.953121       5.690000 
      8.853244       -1.953121       5.690000 
      8.884854       -1.953121       5.300000 
      8.915608       -1.953121       5.460000 
      8.946586       -1.953121       5.300000 
      8.977010       -1.953121       5.510000 
      9.007801       -1.953121       5.240000 
      9.038559       -1.953121       5.450000 
      9.070078       -1.953121       5.520000 
      9.101082       -1.953121       5.700000 
      9.132362       -1.953121       5.830000 
      9.162983       -1.953121       5.720000 
      9.194771       -1.953121       5.720000 
      9.225689       -1.953121       6.220000 
      9.256606       -1.953121       6.110000 
      9.287727       -1.953121       6.210000 
      9.319276       -1.953121       6.170000 
      9.350282       -1.953121       6.300000 
      9.381471       -1.953121       6.040000 
      9.412297       -1.953121       5.720000 
      9.444380       -1.953121       5.600000 
      9.474564       -1.953121       5.600000 
      9.505219       -1.953121       5.290000 
      9.537140       -1.953121       5.300000 
      9.567086       -1.953121       5.240000 
      9.599007       -1.953121       5.200000 
      9.630921       -1.953121       5.460000 
      9.660836       -1.953121       5.470000 
      9.690761       -1.953121       5.360000 
      9.722677       -1.953121       5.390000 
      9.752589       -1.953121       5.580000 
      9.784478       -1.953121       5.880000 
      9.816427       -1.953121       5.880000 
      9.846345       -1.953121       5.860000 
      9.878263       -1.953121       6.170000 
      9.910175       -1.953121       5.980000 
      9.940089       -1.953121       6.150000 
      9.970871       -1.953121       6.260000 
      10.001627       -1.953121       6.030000 
      10.031810       -1.953121       5.960000 
      10.062327       -1.953121       5.910000 
      10.108241       -1.953121       5.810000 
      10.139216       -1.953121       5.680000 
      10.170795       -1.953121       5.450000 
      10.201550       -1.953121       5.480000 
      10.231473       -1.953121       5.770000 
      10.261394       -1.953121       5.390000 
      10.292430       -1.953121       5.230000 
      10.323788       -1.953121       5.570000 
      10.354825       -1.953121       5.620000 
      10.385216       -1.953121       5.760000 
      10.415627       -1.953121       5.870000 
      10.461911       -1.953121       5.910000 
      10.493064       -1.953121       5.880000 
      10.541007       -1.953121       5.880000 
      10.572483       -1.953121       6.200000 
      10.603023       -1.953121       6.010000 
      10.634359       -1.953121       6.030000 
      10.665424       -1.953121       6.240000 
      10.696306       -1.953121       5.990000 
      10.726851       -1.953121       5.810000 
      10.757705       -1.953121       5.690000 
      10.788651       -1.953121       5.810000 
      10.820067       -1.953121       5.810000 
      10.850781       -1.953121       5.600000 
      10.881390       -1.953121       5.510000 
      10.912866       -1.953121       5.730000 
      10.944046       -1.953121       5.430000 
      10.974654       -1.953121       5.300000 
      11.005920       -1.953121       5.360000 
      11.037227       -1.953121       5.380000 
      11.099811       -1.953121       5.370000 
      11.131462       -1.953121       5.620000 
      11.163030       -1.953121       5.710000 
      11.194222       -1.953121       5.960000 
      11.226289       -1.953121       6.010000 
      11.258173       -1.953121       6.010000 
      11.288326       -1.953121       5.840000 
      11.320319       -1.953121       5.950000 
      11.352292       -1.953121       6.120000 
      11.383598       -1.953121       6.150000 
      11.415543       -1.953121       5.780000 
      11.445576       -1.953121       5.620000 
      11.476341       -1.953121       5.760000 
      11.507910       -1.953121       5.910000 
      11.538810       -1.953121       5.500000 
      11.569391       -1.953121       5.720000 
      11.600639       -1.953121       5.480000 
      11.632571       -1.953121       5.690000 
      11.664210       -1.953121       5.570000 
      11.695312       -1.953121       5.750000 
      11.725951       -1.953121       5.700000 
      11.772566       -1.953121       5.590000 
      11.803224       -1.953121       5.870000 
      11.849295       -1.953121       5.730000 
      11.880195       -1.953121       5.630000 
      11.911479       -1.953121       5.780000 
      11.942284       -1.953121       5.790000 
      11.973264       -1.953121       5.840000 
      12.004802       -1.953121       5.920000 
      12.035669       -1.953121       6.020000 
      12.067148       -1.953121       5.970000 
      12.099349       -1.953121       6.000000 
      12.129890       -1.953121       5.800000 
      12.160676       -1.953121       6.010000 
      12.191683       -1.953121       5.880000 
      12.222825       -1.953121       5.660000 
      12.253583       -1.953121       5.780000 
      12.284534       -1.953121       5.430000 
      12.316450       -1.953121       5.670000 
      12.347193       -1.953121       5.740000 
      12.377542       -1.953121       5.990000 
      12.407780       -1.953121       5.790000 
      12.438483       -1.953121       5.810000 
      12.469080       -1.953121       5.800000 
      12.499963       -1.953121       6.050000 
      12.531414       -1.953121       5.820000 
      12.562050       -1.953121       5.740000 
      12.593152       -1.953121       5.910000 
      12.624431       -1.953121       5.670000 
      12.655582       -1.953121       5.850000 
      12.686801       -1.953121       5.850000 
      12.718386       -1.953121       5.640000 
      12.749062       -1.953121       5.660000 
      12.780764       -1.953121       5.710000 
      12.811378       -1.953121       5.660000 
      12.841800       -1.953121       5.670000 
      12.889920       -1.953121       5.650000 
      12.921999       -1.953121       5.850000 
      12.953104       -1.953121       5.490000 
      12.984848       -1.953121       5.900000 
      13.015887       -1.953121       5.710000 
      13.046205       -1.953121       5.710000 
      13.077172       -1.953121       5.620000 
      13.108443       -1.953121       5.750000 
      13.139534       -1.953121       5.840000 
      13.171679       -1.953121       5.980000 
      13.202284       -1.953121       5.880000 
      13.234216       -1.953121       5.780000 
      13.266098       -1.953121       5.670000 
      13.296090       -1.953121       5.740000 
      13.326616       -1.953121       5.450000 
      13.356928       -1.953121       5.660000 
      13.389342       -1.953121       5.680000 
      13.420081       -1.953121       5.620000 
      13.450886       -1.953121       5.750000 
      13.482698       -1.953121       5.710000 
      13.513384       -1.953121       5.550000 
      13.544188       -1.953121       5.480000 
      13.590945       -1.953121       5.800000 
      13.622359       -1.953121       5.610000 
      13.653401       -1.953121       5.780000 
      13.684141       -1.953121       5.600000 
      13.715066       -1.953121       5.820000 
      13.746515       -1.953121       5.730000 
      13.793107       -1.953121       5.730000 
      13.824151       -1.953121       5.710000 
      13.855148       -1.953121       5.730000 
      13.886261       -1.953121       5.740000 
      13.918592       -1.953121       5.760000 
      13.949081       -1.953121       5.570000 
      13.980041       -1.953121       5.800000 
      14.011470       -1.953121       5.710000 
      14.042183       -1.953121       5.460000 
      14.074111       -1.953121       5.440000 
      14.104941       -1.953121       5.470000 
      14.136706       -1.953121       5.720000 
      14.168648       -1.953121       5.740000 
      14.200196       -1.953121       5.790000 
      14.231389       -1.953121       5.600000 
      14.262657       -1.953121       5.630000 
      14.294602       -1.953121       5.480000 
      14.324530       -1.953121       5.770000 
      14.355712       -1.953121       5.880000 
      14.387093       -1.953121       5.880000 
      14.418942       -1.953121       5.730000 
      14.449748       -1.953121       5.740000 
      14.481477       -1.953121       5.760000 
      14.511262       -1.953121       5.870000 
      14.541688       -1.953121       5.710000 
      14.573130       -1.953121       5.890000 
      14.604717       -1.953121       5.660000 
      14.636825       -1.953121       5.680000 
      14.666781       -1.953121       5.690000 
      14.697969       -1.953121       5.680000 
      14.729397       -1.953121       5.410000 
      14.760104       -1.953121       5.460000 
      14.790959       -1.953121       5.420000 
      14.821843       -1.953121       5.590000 
      14.853337       -1.953121       5.730000 
      14.884245       -1.953121       5.720000 
      14.915093       -1.953121       5.610000 
      14.945956       -1.953121       5.870000 
      14.977667       -1.953121       5.870000 
      15.008227       -1.953121       5.690000 
      15.040208       -1.953121       5.770000 
      15.070713       -1.953121       5.790000 
      15.101053       -1.953121       5.750000 
      15.131825       -1.953121       5.650000 
      15.162692       -1.953121       5.750000 
      15.194512       -1.953121       5.760000 
      15.225478       -1.953121       5.900000 
      15.257340       -1.953121       5.710000 
      15.288225       -1.953121       5.820000 
      15.334166       -1.953121       5.960000 
      15.366111       -1.953121       5.760000 
      15.396231       -1.953121       5.760000 
      15.426995       -1.953121       5.570000 
      15.458157       -1.953121       5.650000 
      15.488757       -1.953121       5.540000 
      15.520116       -1.953121       5.560000 
      15.551075       -1.953121       5.780000 
      15.582421       -1.953121       5.810000 
      15.613240       -1.953121       5.560000 
      15.644902       -1.953107       5.600000 
      15.675656       -1.952678       5.600000 
      15.706181       -1.947722       5.610000 
      15.738552       -1.928924       5.530000 
      15.769113       -1.913226       5.500000 
      15.800619       -1.928924       5.680000 
      15.831389       -1.947722       5.680000 
      15.861885       -1.952678       5.680000 
      15.892678       -1.953107       5.700000 
      15.924253       -1.953121       5.650000 
      15.955229       -1.953121       5.850000 
      15.986660       -1.953121       5.850000 
      16.018567       -1.953121       5.660000 
      16.049506       -1.953121       5.660000 
      16.080811       -1.953121       5.690000 
      16.111717       -1.953121       5.800000 
      16.142500       -1.953121       5.630000 
      16.173356       -1.953121       5.740000 
      16.204654       -1.953121       5.500000 
      16.236181       -1.953121       5.750000 
      16.268008       -1.953121       5.670000 
      16.299922       -1.953121       5.540000 
      16.330019       -1.953121       5.470000 
      16.360954       -1.953121       5.680000 
      16.392218       -1.953121       5.530000 
      16.423031       -1.953121       5.560000 
      16.453678       -1.953121       5.620000 
      16.485526       -1.953121       5.470000 
      16.516141       -1.953121       5.230000 
      16.547074       -1.953121       5.690000 
      16.578312       -1.953121       5.650000 
      16.610070       -1.953121       5.650000 
      16.640445       -1.953121       5.630000 
      16.670946       -1.953121       5.310000 
      16.702946       -1.953121       5.590000 
      16.735360       -1.953121       5.670000 
      16.767144       -1.953121       5.690000 
      16.797775       -1.953121       5.840000 
      16.828971       -1.953121       5.670000 
      16.859804       -1.953121       5.760000 
      16.890906       -1.953121       5.480000 
      16.921342       -1.953121       5.720000 
      16.951806       -1.953121       5.840000 
      16.983345       -1.953121       5.380000 
      17.014865       -1.953121       5.450000 
      17.046352       -1.953121       5.500000 
      17.077651       -1.953121       5.810000 
      17.108691       -1.953121       5.810000 
      17.139560       -1.953121       5.330000 
      17.170683       -1.953121       5.580000 
      17.201918       -1.953121       5.590000 
      17.231660       -1.953121       5.400000 
      17.277162       -1.953121       5.690000 
      17.308110       -1.953121       5.890000 
      17.339001       -1.953121       5.530000 
      17.370309       -1.953121       5.610000 
      17.401240       -1.953121       5.670000 
      17.432857       -1.953121       5.650000 
      17.463449       -1.953121       5.760000 
      17.494578       -1.953121       5.750000 
      17.525869       -1.953121       5.880000 
      17.556728       -1.953121       5.880000 
      17.587316       -1.953121       5.790000 
      17.617783       -1.953121       5.720000 
      17.649034       -1.953121       5.820000 
      17.679539       -1.953121       5.480000 
      17.709672       -1.953121       5.510000 
      17.740316       -1.953121       5.740000 
      17.771949       -1.953121       5.760000 
      17.803496       -1.953121       5.570000 
      17.835152       -1.953107       5.780000 
      17.866959       -1.952678       5.610000 
      17.897400       -1.947722       5.840000 
      17.928174       -1.928924       5.560000 
      17.958919       -1.913226       5.510000 
      17.990670       -1.928924       5.510000 
      18.022590       -1.947722       5.610000 
      18.052511       -1.952678       5.610000 
      18.084425       -1.953107       5.490000 
      18.114339       -1.953107       5.520000 
      18.146255       -1.952678       5.650000 
      18.176178       -1.947722       5.800000 
      18.208089       -1.928924       5.920000 
      18.238009       -1.913226       5.650000 
      18.269930       -1.928924       5.540000 
      18.300841       -1.947722       5.470000 
      18.331759       -1.952678       5.550000 
      18.361653       -1.953107       5.520000 
      18.392603       -1.953107       5.790000 
      18.423486       -1.952678       5.650000 
      18.453813       -1.947722       5.430000 
      18.484453       -1.928924       5.580000 
      18.515462       -1.913226       5.570000 
      18.545800       -1.928924       5.440000 
      18.576640       -1.947722       5.560000 
      18.607566       -1.952678       5.580000 
      18.638821       -1.953107       5.600000 
      18.669744       -1.953121       5.300000 
      18.701023       -1.953121       5.520000 
      18.731965       -1.953121       5.310000 
      18.762968       -1.953121       5.810000 
      18.794910       -1.953121       5.410000 
      18.826197       -1.953121       5.340000 
      18.856773       -1.953121       5.470000 
      18.888667       -1.953121       5.690000 
      18.920198       -1.953121       5.720000 
      18.952002       -1.953107       5.420000 
      18.982166       -1.952678       5.510000 
      19.013304       -1.947722       5.610000 
      19.044570       -1.928924       5.610000 
      19.090552       -1.913226       5.600000 
      19.121159       -1.928910       5.550000 
      19.151756       -1.947265       5.550000 
      19.182631       -1.946835       5.640000 
      19.214001       -1.923511       5.570000 
      19.245344       -1.889029       5.500000 
      19.275788       -1.889016       5.560000 
      19.307557       -1.923081       5.520000 
      19.338481       -1.941879       5.560000 
      19.369189       -1.928467       5.640000 
      19.400823       -1.913213       5.490000 
      19.432543       -1.928923       5.380000 
      19.462634       -1.947722       5.520000 
      19.493552       -1.952678       5.340000 
      19.525237       -1.953107       5.680000 
      19.556153       -1.953121       5.670000 
      19.587070       -1.953121       5.590000 
      19.617988       -1.953107       5.550000 
      19.648904       -1.952677       5.610000 
      19.680820       -1.947708       5.570000 
      19.711737       -1.928467       5.610000 
      19.742654       -1.907371       5.720000 
      19.774595       -1.898884       5.610000 
      19.805485       -1.878218       5.750000 
      19.836402       -1.863946       5.920000 
      19.867354       -1.878218       5.640000 
      19.898239       -1.898884       5.640000 
      19.930162       -1.907357       5.880000 
      19.960661       -1.928024       5.770000 
      19.992544       -1.942309       5.810000 
      20.023668       -1.928480       5.590000 
      20.054580       -1.913200       5.550000 
      20.085738       -1.928467       5.790000 
      20.117656       -1.941866       5.510000 
      20.149225       -1.922638       5.550000 
      20.180017       -1.883617       5.590000 
      20.211648       -1.864832       5.820000 
      20.242410       -1.883617       5.580000 
      20.273011       -1.922638       5.680000 
      20.304806       -1.941866       5.690000 
      20.334728       -1.928454       5.750000 
      20.366230       -1.912770       5.350000 
      20.397332       -1.923524       5.630000 
      20.428651       -1.923525       5.750000 
      20.459379       -1.912783       5.740000 
      20.490518       -1.928897       5.800000 
      20.521832       -1.947265       5.770000 
      20.552959       -1.946835       5.670000 
      20.583819       -1.923511       5.890000 
      20.614828       -1.889029       5.690000 
      20.645947       -1.889016       5.690000 
      20.676782       -1.923081       5.760000 
      20.708164       -1.941866       5.680000 
      20.738554       -1.928024       5.710000 
      20.770077       -1.907814       5.810000 
      20.800427       -1.904726       5.760000 
      20.831361       -1.907827       5.560000 
      20.861772       -1.928467       5.740000 
      20.892574       -1.947251       5.490000 
      20.923394       -1.946808       5.830000 
      20.955061       -1.922611       5.630000 
      20.985304       -1.877774       5.600000 
      21.016634       -1.834766       5.630000 
