Human trial picking the raspberry twin 

 time    ||     output     ||     loadcell

      0.000000       -799.001587       0.290000 
      0.030671       -799.001587       0.160000 
      0.061782       -799.001587       0.080000 
      0.093006       -799.001587       0.180000 
      0.139256       -799.001587       0.000000 
      0.170162       -799.001587       0.000000 
      0.200890       -799.001587       0.190000 
      0.231066       -799.001587       0.150000 
      0.261372       -799.001587       0.130000 
      0.291958       -799.001582       0.010000 
      0.322733       -799.000395       0.050000 
      0.353300       -798.893464       0.120000 
      0.383178       -795.352417       0.130000 
      0.414177       -752.213635       0.190000 
      0.445460       -558.879026       0.000000 
      0.476183       -240.124144       0.050000 
      0.506598       -46.789535       0.050000 
      0.538428       -3.650753       0.180000 
      0.569889       -0.109706       0.140000 
      0.599822       -0.002776       0.130000 
      0.630929       -0.001588       0.250000 
      0.661902       -0.001583       0.010000 
      0.693049       -0.001583       0.130000 
      0.724044       -0.001583       0.040000 
      0.755469       -0.001583       0.130000 
      0.786646       -0.001583       0.050000 
      0.816705       -0.001583       0.050000 
      0.847833       -0.001583       0.090000 
      0.879902       -0.001583       0.030000 
      0.911017       -0.001583       0.210000 
      0.942935       -0.001583       0.020000 
      0.972855       -0.001583       0.080000 
      1.004769       -0.001583       0.180000 
      1.036719       -0.001583       0.100000 
      1.066604       -0.001583       0.000000 
      1.098552       -0.001583       0.160000 
      1.130466       -0.001583       0.070000 
      1.160353       -0.001583       0.110000 
      1.190273       -0.001583       0.110000 
      1.222188       -0.001583       0.000000 
      1.252128       -0.001583       0.010000 
      1.284057       -0.001583       0.090000 
      1.315965       -0.001583       0.140000 
      1.345892       -0.001583       0.010000 
      1.377668       -0.001583       0.140000 
      1.408509       -0.001583       0.280000 
      1.439833       -0.001583       0.120000 
      1.470623       -0.001583       0.230000 
      1.502574       -0.001583       0.130000 
      1.532377       -0.001583       0.220000 
      1.563721       -0.001583       0.200000 
      1.594215       -0.001583       0.210000 
      1.625378       -0.001583       0.080000 
      1.656583       -0.001583       0.020000 
      1.688498       -0.001583       0.070000 
      1.718453       -0.001583       0.120000 
      1.749337       -0.001583       0.080000 
      1.780286       -0.001583       0.150000 
      1.810174       -0.001583       0.070000 
      1.840092       -0.001583       0.200000 
      1.872008       -0.001583       0.060000 
      1.901928       -0.001583       0.030000 
      1.932846       -0.001583       0.070000 
      1.962765       -0.001583       0.070000 
      1.993717       -0.001583       0.020000 
      2.024590       -0.001583       0.230000 
      2.056014       -0.001583       0.130000 
      2.087460       -0.001583       0.100000 
      2.119380       -0.001583       0.010000 
      2.150327       -0.001583       0.150000 
      2.180199       -0.001583       0.050000 
      2.211753       -0.001583       0.030000 
      2.243369       -0.001583       0.010000 
      2.274156       -0.001583       0.130000 
      2.305216       -0.001583       0.000000 
      2.336165       -0.001583       0.020000 
      2.367083       -0.001583       0.070000 
      2.398000       -0.001583       0.100000 
      2.428920       -0.001583       0.140000 
      2.458840       -0.001583       0.050000 
      2.489755       -0.001583       0.110000 
      2.520640       -0.001583       0.120000 
      2.552272       -0.001583       0.110000 
      2.583264       -0.001583       0.070000 
      2.614264       -0.001583       0.140000 
      2.646250       -0.001583       0.260000 
      2.677090       -0.001583       0.090000 
      2.707025       -0.001583       0.080000 
      2.736906       -0.001583       0.040000 
      2.767822       -0.001583       0.100000 
      2.799769       -0.001583       0.020000 
      2.829684       -0.001583       0.050000 
      2.861573       -0.001583       0.020000 
      2.893486       -0.001583       0.190000 
      2.923436       -0.001583       0.050000 
      2.953326       -0.001583       0.120000 
      2.984261       -0.001583       0.070000 
      3.015163       -0.001583       0.360000 
      3.045193       -0.001583       0.080000 
      3.076190       -0.001583       0.170000 
      3.108106       -0.001583       0.040000 
      3.139023       -0.001583       0.310000 
      3.169941       -0.001583       0.080000 
      3.201928       -0.001583       0.000000 
      3.233445       -0.001583       0.080000 
      3.264338       -0.001583       0.160000 
      3.295523       -0.001583       0.090000 
      3.326363       -0.001583       0.270000 
      3.357281       -0.001583       0.160000 
      3.388262       -0.001583       0.110000 
      3.420300       -0.001583       0.160000 
      3.452404       -0.001583       0.040000 
      3.483954       -0.001583       0.130000 
      3.515551       -0.001583       0.160000 
      3.546390       -0.001583       0.070000 
      3.577622       -0.001583       0.140000 
      3.608629       -0.001583       0.190000 
      3.639107       -0.001583       0.010000 
      3.669992       -0.001583       0.120000 
      3.700381       -0.001583       0.090000 
      3.731451       -0.001583       0.180000 
      3.763321       -0.001583       0.070000 
      3.809766       -0.001583       0.300000 
      3.840973       -0.001583       0.050000 
      3.871387       -0.001583       0.030000 
      3.903090       -0.001583       0.020000 
      3.934731       -0.001583       0.100000 
      3.966227       -0.001583       0.020000 
      3.996564       -0.001583       0.000000 
      4.027541       -0.001583       0.190000 
      4.058878       -0.001583       0.210000 
      4.090015       -0.001583       0.020000 
      4.121413       -0.001583       0.020000 
      4.153593       -0.001583       0.060000 
      4.184148       -0.001583       0.070000 
      4.215365       -0.001583       0.070000 
      4.246683       -0.001583       0.010000 
      4.277050       -0.001583       0.120000 
      4.308403       -0.001583       0.080000 
      4.340486       -0.001583       0.250000 
      4.372296       -0.001583       0.230000 
      4.403134       -0.001583       0.130000 
      4.434386       -0.001583       0.040000 
      4.464422       -0.001583       0.080000 
      4.496042       -0.001583       0.080000 
      4.526362       -0.001583       0.100000 
      4.556281       -0.001583       0.110000 
      4.587462       -0.001583       0.050000 
      4.618911       -0.001583       0.050000 
      4.649651       -0.001583       0.030000 
      4.680416       -0.001583       0.040000 
      4.711035       -0.001583       0.090000 
      4.741857       -0.001583       0.120000 
      4.789534       -0.001583       0.050000 
      4.820606       -0.001583       0.060000 
      4.851359       -0.001583       0.110000 
      4.882241       -0.001583       0.090000 
      4.913590       -0.001583       0.160000 
      4.945508       -0.001583       0.120000 
      4.976315       -0.001583       0.010000 
      5.007618       -0.001583       0.150000 
      5.039160       -0.001583       0.030000 
      5.070381       -0.001583       0.190000 
      5.101420       -0.001583       0.150000 
      5.132112       -0.001583       0.040000 
      5.162796       -0.001583       0.050000 
      5.193964       -0.001583       0.190000 
      5.225205       -0.001583       0.180000 
      5.256615       -0.001583       0.050000 
      5.287876       -0.001583       0.060000 
      5.319184       -0.001583       0.140000 
      5.351069       -0.001583       0.350000 
      5.381839       -0.001583       0.010000 
      5.413691       -0.001583       0.110000 
      5.444194       -0.001583       0.050000 
      5.475342       -0.001583       0.100000 
      5.506453       -0.001583       0.060000 
      5.537595       -0.001583       0.150000 
      5.569576       -0.001583       0.060000 
      5.601753       -0.001583       0.010000 
      5.648254       -0.001583       0.150000 
      5.679058       -0.001583       0.030000 
      5.709471       -0.001583       0.110000 
      5.741510       -0.001583       0.020000 
      5.773255       -0.001583       0.030000 
      5.803205       -0.001583       0.190000 
      5.833426       -0.001583       0.110000 
      5.865453       -0.001583       0.150000 
      5.896905       -0.001583       0.090000 
      5.928761       -0.001583       0.040000 
      5.958682       -0.001583       0.010000 
      5.990109       -0.001583       0.180000 
      6.020664       -0.001583       0.210000 
      6.051785       -0.001583       0.120000 
      6.083459       -0.001583       0.060000 
      6.114274       -0.001583       0.150000 
      6.145639       -0.001583       0.150000 
      6.177537       -0.001583       0.030000 
      6.208979       -0.001583       0.040000 
      6.239961       -0.001583       0.160000 
      6.270608       -0.001583       0.130000 
      6.302454       -0.001583       0.080000 
      6.333455       -0.001583       0.040000 
      6.364435       -0.001583       0.020000 
      6.395736       -0.001583       0.030000 
      6.427615       -0.001583       0.110000 
      6.458868       -0.001583       0.220000 
      6.490449       -0.001583       0.030000 
      6.522630       -0.001583       0.050000 
      6.554091       -0.001583       0.050000 
      6.585906       -0.001583       0.050000 
      6.617772       -0.001583       0.140000 
      6.648406       -0.001583       0.070000 
      6.679619       -0.001583       0.280000 
      6.711418       -0.001583       0.180000 
      6.758070       -0.001583       0.060000 
      6.789500       -0.001583       0.040000 
      6.820568       -0.001583       0.040000 
      6.852148       -0.001583       0.070000 
      6.883521       -0.001583       0.040000 
      6.929436       -0.001583       0.140000 
      6.976342       -0.001583       0.060000 
      7.006543       -0.001583       0.160000 
      7.036773       -0.001583       0.080000 
      7.068685       -0.001583       0.080000 
      7.101782       -0.001583       0.050000 
      7.131703       -0.001583       0.040000 
      7.163384       -0.001583       0.020000 
      7.194192       -0.001583       0.040000 
      7.225456       -0.001583       0.130000 
      7.256831       -0.001583       0.010000 
      7.288144       -0.001583       0.090000 
      7.318659       -0.001583       0.050000 
      7.349699       -0.001583       0.020000 
      7.380802       -0.001583       0.100000 
      7.412320       -0.001583       0.120000 
      7.443131       -0.001583       0.060000 
      7.474030       -0.001583       0.060000 
      7.504477       -0.001583       0.040000 
      7.535841       -0.001583       0.030000 
      7.567784       -0.001583       0.020000 
      7.598702       -0.001596       0.140000 
      7.629619       -0.002026       0.140000 
      7.660535       -0.006982       0.090000 
      7.692057       -0.025780       0.200000 
      7.723209       -0.041477       0.040000 
      7.754021       -0.025780       0.010000 
      7.784985       -0.006982       0.270000 
      7.816464       -0.002026       0.050000 
      7.847861       -0.001596       0.010000 
      7.878732       -0.001583       0.040000 
      7.910462       -0.001583       0.140000 
      7.942378       -0.001583       0.250000 
      7.972299       -0.001583       0.180000 
      8.004212       -0.001583       0.040000 
      8.035129       -0.001583       0.010000 
      8.066107       -0.001583       0.040000 
      8.097368       -0.001583       0.020000 
      8.128579       -0.001583       0.020000 
      8.159440       -0.001583       0.120000 
      8.190705       -0.001596       0.140000 
      8.237737       -0.002026       0.020000 
      8.268826       -0.006982       0.020000 
      8.315441       -0.025780       0.150000 
      8.347352       -0.041477       0.090000 
      8.378269       -0.025780       0.050000 
      8.410185       -0.006982       0.050000 
      8.441101       -0.002026       0.070000 
      8.472018       -0.001596       0.290000 
      8.502936       -0.001583       0.110000 
      8.533710       -0.001583       0.120000 
      8.565295       -0.001583       0.180000 
      8.596433       -0.001583       0.020000 
      8.627185       -0.001583       0.090000 
      8.673921       -0.001583       0.010000 
      8.705403       -0.001583       0.060000 
      8.736796       -0.001583       1.270000 
      8.768323       -0.001583       2.740000 
      8.800401       -0.001596       4.160000 
      8.831286       -0.002026       4.880000 
      8.863199       -0.006982       5.480000 
      8.894116       -0.025780       5.390000 
      8.926031       -0.041477       5.270000 
      8.956949       -0.025780       4.980000 
      8.987866       -0.006982       4.860000 
      9.019117       -0.002026       4.290000 
      9.049006       -0.001596       3.740000 
      9.079979       -0.001583       3.510000 
      9.111393       -0.001583       3.140000 
      9.141939       -0.001583       1.770000 
      9.173554       -0.001583       0.620000 
      9.204473       -0.001583       0.460000 
      9.236387       -0.001583       2.340000 
      9.267305       -0.001583       3.990000 
      9.299220       -0.001583       5.780000 
      9.330151       -0.001583       10.070000 
      9.361373       -0.001583       15.810000 
      9.391988       -0.001583       22.280000 
      9.422497       -0.001583       27.560000 
      9.453027       -0.001583       38.480000 
      9.484823       -0.001583       54.200000 
      9.515408       -0.001583       71.060000 
      9.547186       -0.001583       87.850000 
      9.577750       -0.001583       103.860000 
      9.609665       -0.001583       116.420000 
      9.640582       -0.001583       135.020000 
      9.672498       -0.001583       158.580000 
      9.703416       -0.001583       184.190000 
      9.734334       -0.001583       214.630000 
      9.765277       -0.001583       245.410000 
      9.797179       -0.001583       272.940000 
      9.828115       -0.001583       319.980000 
      9.858234       -0.001583       320.390000 
      9.889135       -0.001582       318.540000 
      9.921184       -0.001488       329.970000 
      9.953356       0.001655       310.190000 
      9.985339       0.040792       307.700000 
      10.015226       0.226826       308.010000 
      10.047527       0.584626       298.310000 
      10.078544       0.906832       308.590000 
      10.110270       1.124635       316.910000 
      10.141187       1.406075       344.220000 
      10.172107       1.811663       353.780000 
      10.203691       2.272434       356.760000 
      10.235608       2.826781       247.370000 
      10.266334       3.378954       25.050000 
      10.297517       3.875478       23.950000 
      10.328661       4.279869       24.220000 
      10.359267       4.615842       13.990000 
      10.391436       4.919753       18.640000 
      10.421500       5.207264       16.070000 
      10.452605       5.478329       16.940000 
      10.484099       5.513406       14.410000 
      10.515406       5.273789       19.560000 
      10.546322       5.098996       12.130000 
      10.577036       5.100153       7.110000 
      10.608403       5.255988       4.780000 
      10.639836       5.177204       0.210000 
      10.670674       3.943241       14.460000 
      10.702592       1.971306       9.570000 
      10.732512       0.875080       7.110000 
      10.763428       0.413604       1.120000 
      10.794869       -0.162050       2.970000 
      10.825784       -0.867934       8.410000 
      10.857322       -1.456372       8.850000 
      10.888293       -1.801707       5.330000 
      10.919427       -1.951086       5.390000 
      10.951380       -1.994274       5.230000 
      10.983287       -2.001085       5.660000 
      11.013211       -2.001569       6.770000 
      11.045115       -2.001583       5.170000 
      11.076018       -2.001583       6.100000 
      11.106945       -2.001556       6.580000 
      11.136876       -2.000697       5.480000 
      11.168794       -1.990785       5.530000 
      11.200709       -1.953176       6.650000 
      11.230657       -1.921351       5.610000 
      11.262544       -1.947790       6.910000 
      11.292464       -1.966588       5.960000 
      11.324378       -1.960802       5.510000 
      11.356295       -1.977359       5.470000 
      11.386357       -1.996184       6.470000 
      11.418239       -2.001140       5.720000 
      11.450154       -2.001570       6.030000 
      11.481070       -2.001583       4.990000 
      11.511988       -2.001583       5.880000 
      11.543902       -2.001556       5.550000 
      11.574288       -2.000670       6.280000 
      11.605533       -1.989885       5.620000 
      11.636016       -1.941934       5.570000 
      11.667495       -1.867558       6.000000 
      11.698087       -1.843791       5.990000 
      11.730129       -1.877829       5.860000 
      11.761994       -1.919481       5.960000 
      11.792986       -1.934736       5.860000 
      11.823589       -1.890785       5.870000 
      11.853546       -1.819137       6.380000 
      11.884917       -1.803440       5.970000 
      11.915474       -1.872000       6.180000 
      11.946199       -1.930249       5.820000 
      11.977097       -1.925310       6.420000 
      12.009042       -1.911911       5.720000 
      12.040511       -1.920811       6.210000 
      12.071790       -1.916850       5.770000 
      12.102319       -1.880473       5.980000 
      12.134255       -1.858131       5.480000 
      12.165407       -1.850890       5.660000 
      12.196332       -1.847320       5.610000 
      12.228404       -1.830723       5.860000 
      12.275279       -1.819964       5.690000 
      12.306194       -1.788557       5.940000 
      12.337112       -1.726764       5.870000 
      12.369025       -1.737492       5.880000 
      12.400353       -1.782715       5.970000 
      12.431782       -1.779184       6.230000 
      12.463498       -1.777346       5.740000 
      12.494100       -1.777372       6.350000 
      12.525286       -1.780017       5.850000 
      12.556548       -1.791727       6.080000 
      12.587694       -1.763846       6.000000 
      12.618934       -1.704351       6.020000 
      12.648858       -1.652720       6.000000 
      12.679808       -1.688210       6.060000 
      12.710694       -1.755279       6.180000 
      12.742635       -1.763459       6.170000 
      12.773524       -1.714526       6.230000 
      12.804442       -1.629891       6.060000 
      12.834396       -1.564016       5.980000 
      12.865279       -1.619150       5.940000 
      12.896198       -1.730666       5.970000 
      12.926119       -1.782713       6.110000 
      12.956038       -1.765647       5.820000 
      12.985956       -1.713214       5.750000 
      13.017873       -1.695811       5.570000 
      13.047791       -1.725723       5.360000 
      13.079774       -1.687241       5.650000 
      13.110388       -1.605197       5.700000 
      13.142339       -1.604741       6.090000 
      13.172906       -1.614982       5.910000 
      13.204381       -1.594438       5.590000 
      13.236319       -1.542794       5.640000 
      13.266098       -1.472957       5.760000 
      13.298051       -1.467545       5.730000 
      13.329235       -1.512351       5.990000 
      13.360194       -1.520408       6.090000 
      13.391660       -1.512341       6.070000 
      13.423233       -1.530709       5.970000 
      13.454021       -1.554432       5.770000 
      13.485348       -1.511398       6.040000 
      13.516321       -1.420452       5.920000 
      13.546688       -1.378299       6.230000 
      13.578494       -1.349146       6.260000 
      13.609239       -1.326791       6.110000 
      13.640460       -1.377843       6.060000 
      13.671623       -1.436964       6.320000 
      13.703218       -1.459876       6.000000 
      13.734428       -1.494814       5.950000 
      13.765581       -1.501055       5.820000 
      13.796574       -1.436578       5.710000 
      13.827431       -1.396644       5.920000 
      13.858236       -1.411438       5.750000 
      13.889149       -1.379570       5.540000 
      13.920417       -1.288614       5.500000 
      13.951848       -1.232566       5.610000 
      13.983136       -1.266131       5.450000 
      14.014493       -1.270157       5.550000 
      14.046557       -1.180057       5.620000 
      14.077603       -1.100339       5.580000 
      14.109298       -1.093541       5.580000 
      14.139262       -1.152786       5.640000 
      14.170405       -1.214942       5.780000 
      14.201988       -1.245076       5.660000 
      14.233070       -1.238682       5.940000 
      14.264409       -1.192223       6.000000 
      14.295547       -1.112326       6.010000 
      14.327192       -1.081111       5.930000 
      14.357819       -1.135637       5.930000 
      14.389380       -1.226732       5.960000 
      14.421100       -1.239609       6.030000 
      14.452843       -1.222696       5.920000 
      14.483925       -1.255363       6.040000 
      14.515265       -1.295227       6.280000 
      14.546154       -1.246447       6.110000 
      14.577745       -1.176018       6.080000 
      14.608444       -1.180127       6.200000 
      14.639173       -1.194342       6.100000 
      14.670115       -1.197167       6.020000 
      14.700672       -1.175531       6.130000 
      14.731604       -1.159057       5.880000 
      14.762907       -1.167934       5.770000 
      14.793712       -1.229863       5.840000 
      14.825669       -1.289345       5.690000 
      14.856215       -1.240577       6.080000 
      14.888160       -1.150934       5.680000 
      14.919803       -1.129864       5.620000 
      14.950816       -1.126694       5.740000 
      14.981464       -1.130347       5.840000 
      15.012615       -1.137408       5.560000 
      15.044532       -1.112865       5.870000 
      15.076114       -1.121794       5.670000 
      15.106785       -1.193486       5.730000 
      15.137702       -1.243222       5.840000 
      15.168425       -1.258489       5.930000 
      15.199733       -1.206898       6.000000 
      15.231328       -1.102996       6.120000 
      15.262363       -1.078773       6.000000 
      15.294289       -1.136562       5.910000 
      15.324202       -1.154917       5.920000 
      15.355581       -1.112395       5.950000 
      15.387174       -1.098013       6.120000 
      15.418423       -1.153175       6.080000 
      15.450343       -1.214109       5.910000 
      15.482245       -1.235595       6.080000 
      15.513422       -1.206055       5.910000 
      15.544157       -1.180043       6.030000 
      15.575311       -1.163930       5.940000 
      15.606661       -1.116409       5.780000 
      15.636789       -1.118237       5.680000 
      15.667690       -1.166574       5.800000 
      15.698728       -1.189885       5.720000 
      15.730089       -1.176016       5.910000 
      15.761232       -1.150434       5.750000 
      15.792179       -1.123592       5.810000 
      15.822945       -1.092171       5.790000 
      15.853030       -1.111952       5.630000 
      15.882951       -1.155320       5.730000 
      15.913868       -1.141061       5.610000 
      15.943650       -1.091701       5.910000 
      15.975566       -1.088171       6.070000 
      16.005559       -1.114995       6.040000 
      16.037351       -1.111465       6.090000 
      16.068542       -1.062105       5.910000 
      16.099327       -1.047847       6.120000 
      16.131424       -1.091228       5.950000 
      16.162891       -1.111451       6.140000 
      16.193663       -1.085416       6.010000 
      16.224935       -1.082328       6.100000 
      16.256178       -1.091214       6.090000 
      16.287282       -1.076513       5.950000 
      16.318274       -1.056263       5.750000 
      16.349516       -1.052732       6.010000 
      16.381414       -1.050447       5.950000 
      16.412011       -1.047346       5.900000 
      16.443400       -1.032066       5.830000 
      16.474636       -1.036592       6.000000 
      16.505770       -1.066118       5.870000 
      16.537630       -1.065701       5.770000 
      16.568425       -1.031649       5.900000 
      16.600292       -1.013711       5.970000 
      16.631651       -1.037062       5.930000 
      16.662779       -1.090771       5.810000 
      16.693992       -1.116367       5.950000 
      16.725451       -1.103770       5.610000 
      16.757091       -1.092613       5.870000 
      16.786888       -1.050877       5.850000 
      16.817488       -1.012408       5.800000 
      16.847927       -1.002470       5.920000 
      16.879118       -1.001610       5.910000 
      16.911036       -1.001597       5.950000 
      16.941911       -1.002026       5.880000 
      16.988970       -1.006996       6.120000 
      17.019824       -1.026223       6.120000 
      17.051312       -1.046876       5.970000 
      17.081552       -1.049977       5.920000 
      17.113626       -1.046876       5.890000 
      17.144441       -1.026224       5.830000 
      17.175786       -1.007022       6.190000 
      17.206714       -1.002913       6.090000 
      17.238337       -1.012395       5.840000 
      17.269004       -1.049977       5.820000 
      17.299633       -1.081371       5.710000 
      17.330500       -1.049977       5.740000 
      17.362296       -1.012381       5.960000 
      17.393513       -1.002469       6.010000 
      17.424465       -1.001610       5.850000 
      17.455919       -1.001583       5.910000 
      17.487513       -1.001596       5.940000 
      17.518680       -1.002026       5.920000 
      17.549158       -1.006982       5.750000 
      17.580483       -1.025780       6.270000 
      17.611668       -1.041477       6.040000 
      17.642438       -1.025780       5.890000 
      17.673190       -1.006982       5.900000 
      17.703907       -1.002053       6.020000 
      17.734436       -1.002483       5.950000 
      17.765530       -1.012381       6.110000 
      17.797285       -1.049977       5.910000 
      17.827912       -1.081398       6.010000 
      17.858708       -1.050864       5.920000 
      17.890162       -1.023179       5.700000 
      17.921899       -1.050864       5.800000 
      17.952045       -1.081398       6.010000 
      17.982294       -1.049977       5.950000 
      18.028629       -1.012381       6.030000 
      18.059829       -1.002470       5.940000 
      18.090714       -1.001623       5.880000 
      18.120674       -1.002027       5.960000 
      18.151094       -1.006982       6.100000 
      18.181388       -1.025780       5.770000 
      18.212385       -1.041477       6.010000 
      18.243665       -1.025780       5.790000 
      18.275105       -1.006982       5.850000 
      18.306022       -1.002026       5.850000 
      18.337601       -1.001596       5.640000 
      18.368471       -1.001583       6.160000 
      18.399494       -1.001583       5.970000 
      18.431184       -1.001583       5.930000 
      18.463148       -1.001583       5.760000 
      18.493469       -1.001583       5.770000 
      18.524177       -1.001583       5.880000 
      18.554839       -1.001583       5.980000 
      18.585844       -1.001583       5.780000 
      18.616515       -1.001583       5.910000 
      18.646908       -1.001583       6.030000 
      18.677568       -1.001583       5.770000 
      18.708540       -1.001583       5.900000 
      18.740118       -1.001583       5.830000 
      18.771782       -1.001583       5.830000 
      18.802578       -1.001596       5.870000 
      18.833169       -1.002026       5.840000 
      18.863688       -1.006982       6.100000 
      18.893820       -1.025780       5.560000 
      18.924740       -1.041477       5.980000 
      18.955657       -1.025780       5.780000 
      18.987460       -1.006982       5.860000 
      19.018536       -1.002026       5.850000 
      19.049298       -1.001596       5.880000 
      19.081251       -1.001583       5.910000 
      19.113314       -1.001583       5.750000 
      19.144627       -1.001583       5.870000 
      19.175564       -1.001583       6.060000 
      19.206468       -1.001583       5.980000 
      19.237561       -1.001583       5.990000 
      19.268443       -1.001583       5.940000 
      19.299844       -1.001583       6.130000 
      19.330851       -1.001583       5.910000 
      19.361588       -1.001583       5.710000 
      19.392863       -1.001583       5.790000 
      19.424425       -1.001583       5.930000 
      19.455822       -1.001583       5.750000 
      19.486433       -1.001583       5.870000 
      19.517474       -1.001583       5.970000 
      19.548167       -1.001583       5.700000 
      19.578970       -1.001583       5.780000 
      19.610550       -1.001583       5.970000 
      19.642284       -1.001583       5.880000 
      19.673818       -1.001583       6.050000 
      19.703596       -1.001583       5.740000 
      19.735056       -1.001583       5.750000 
      19.766383       -1.001583       5.790000 
      19.798371       -1.001583       5.810000 
      19.829714       -1.001583       5.750000 
      19.860671       -1.001583       5.620000 
      19.891575       -1.001583       5.750000 
      19.922632       -1.001583       5.920000 
      19.953682       -1.001583       5.920000 
      19.984515       -1.001583       5.990000 
      20.015708       -1.001583       5.890000 
      20.062764       -1.001583       6.040000 
      20.094683       -1.001583       5.840000 
      20.126304       -1.001583       5.840000 
      20.157007       -1.001583       6.010000 
      20.187602       -1.001583       5.870000 
      20.219324       -1.001583       5.670000 
      20.249241       -1.001583       5.960000 
      20.279990       -1.001583       5.850000 
      20.311668       -1.001583       5.940000 
      20.341886       -1.001583       5.790000 
      20.373690       -1.001583       6.010000 
      20.405450       -1.001583       5.850000 
      20.436460       -1.001583       5.860000 
      20.467739       -1.001583       5.780000 
      20.498040       -1.001583       5.830000 
      20.529335       -1.001583       5.830000 
      20.559923       -1.001583       5.610000 
      20.591564       -1.001583       5.730000 
      20.622812       -1.001583       5.650000 
      20.652624       -1.001583       5.970000 
      20.683725       -1.001583       5.980000 
      20.714438       -1.001583       5.790000 
      20.745574       -1.001583       5.610000 
      20.791828       -1.001583       5.920000 
      20.822167       -1.001583       5.820000 
      20.853308       -1.001583       5.770000 
      20.884396       -1.001583       5.860000 
      20.915091       -1.001583       5.740000 
      20.947039       -1.001583       5.910000 
      20.977956       -1.001583       5.940000 
      21.008839       -1.001583       6.000000 
