

 time    ||    gripping force   ||   raspberry measurement 

      0       139.950000       -797.102273 
      0       139.960000       -797.102273 
      0       88.160000       -797.102273 
      0       26.640000       -797.102273 
      0       10.850000       -797.102273 
      0       9.330000       -797.102273 
      0       10.530000       -797.102273 
      0       22.700000       -797.102273 
      0       90.780000       -797.102273 
      0       174.550000       -797.102268 
      0       212.730000       -797.101083 
      0       194.860000       -796.994393 
      0       134.160000       -793.461339 
      0       95.780000       -750.420332 
      0       105.190000       -557.531692 
      1       149.790000       -239.583395 
      1       158.540000       -47.050658 
      1       153.760000       -4.748589 
      1       138.790000       -1.967989 
      1       142.290000       -2.230574 
      2       139.450000       -2.231117 
      2       139.400000       -1.986309 
      2       140.330000       -1.371319 
      2       140.110000       -0.257218 
      2       140.080000       0.874774 
      3       140.030000       1.240215 
      3       140.000000       0.714742 
      4       139.890000       -0.109621 
      4       139.880000       -0.477453 
      4       139.830000       -0.194355 
      4       139.840000       0.154947 
      4       139.800000       0.163512 
      4       139.840000       0.026337 
      5       139.800000       -0.048905 
      5       139.750000       -0.100429 
      5       139.730000       -0.131767 
      5       139.780000       -0.107237 
      5       139.730000       -0.092400 
      5       139.710000       -0.123794 
      6       139.680000       -0.144834 
      6       139.750000       -0.141706 
      6       139.660000       -0.102255 
      6       139.660000       -0.062374 
      6       139.700000       -0.053874 
      6       139.740000       -0.051576 
      6       139.690000       -0.052988 
      6       139.660000       -0.051576 
      6       139.680000       -0.053874 
      7       139.640000       -0.062347 
      7       139.610000       -0.101382 
      7       139.640000       -0.131338 
      7       139.590000       -0.101382 
      7       139.670000       -0.062334 
      7       139.670000       -0.053431 
      7       139.630000       -0.046204 
      7       139.620000       -0.029664 
      7       139.590000       -0.022023 
      7       139.660000       -0.072216 
      8       139.540000       -0.106711 
      8       139.630000       -0.080272 
      8       139.610000       -0.058803 
      8       139.550000       -0.052006 
      9       139.710000       -0.053015 
      9       139.650000       -0.052006 
      9       139.660000       -0.058817 
      9       139.870000       -0.080715 
      9       139.850000       -0.112110 
      9       139.910000       -0.096413 
      10       139.880000       -0.061944 
      10       139.910000       -0.054721 
      10       139.900000       -0.061501 
      10       139.810000       -0.091041 
      10       139.920000       -0.088799 
      11       139.850000       -0.051619 
      11       139.780000       -0.083014 
      11       139.810000       -0.126395 
      12       139.760000       -0.100952 
      12       139.910000       -0.062361 
      13       139.860000       -0.054760 
      13       139.780000       -0.062374 
      14       139.760000       -0.101382 
      14       139.680000       -0.131338 
      14       139.890000       -0.101382 
      14       140.100000       -0.062347 
      15       139.840000       -0.053874 
      15       139.940000       -0.051603 
      15       139.860000       -0.053874 
      15       139.820000       -0.062347 
      15       139.900000       -0.101382 
      15       139.850000       -0.131338 
      15       139.800000       -0.101382 
      16       139.830000       -0.062347 
      16       139.850000       -0.053874 
      16       139.890000       -0.051576 
      16       139.910000       -0.052988 
      16       139.770000       -0.051549 
      16       139.910000       -0.052988 
      17       139.950000       -0.051549 
      17       139.890000       -0.053001 
      17       139.770000       -0.051992 
      18       139.870000       -0.058387 
      18       139.790000       -0.075733 
      18       139.960000       -0.092439 
      18       139.890000       -0.070347 
      19       139.880000       -0.034190 
      19       139.900000       -0.012098 
      19       139.880000       -0.028804 
      19       139.970000       -0.046150 
      19       139.740000       -0.052544 
      19       139.710000       -0.051536 
      19       139.960000       -0.052988 
      19       140.060000       -0.051549 
      19       140.000000       -0.052988 
      20       139.870000       -0.051549 
      20       139.960000       -0.052988 
      20       139.890000       -0.051576 
      20       139.850000       -0.053861 
      20       139.770000       -0.061298 
      20       139.810000       -0.094836 
      20       139.920000       -0.109428 
      20       140.060000       -0.077279 
      20       139.760000       -0.055678 
      21       139.910000       -0.058191 
      21       139.820000       -0.095814 
      21       139.790000       -0.124499 
      21       139.860000       -0.093598 
      21       139.950000       -0.054018 
      21       139.870000       -0.045089 
      21       139.880000       -0.042363 
      22       139.900000       -0.043337 
      22       139.810000       -0.041480 
      22       140.080000       -0.042489 
      22       139.890000       -0.040627 
      22       139.650000       -0.041219 
      22       140.150000       -0.034476 
      23       139.960000       -0.016959 
      23       139.900000       -0.000250 
      23       139.890000       -0.022119 
      23       140.120000       -0.057720 
      24       139.970000       -0.079864 
      24       139.930000       -0.072340 
      24       139.900000       -0.091663 
      24       139.800000       -0.115496 
      24       139.950000       -0.084234 
      24       140.120000       -0.043896 
      24       139.940000       -0.025668 
      25       139.710000       0.009590 
      25       139.860000       0.025060 
      25       140.150000       -0.006270 
      25       139.940000       -0.027888 
      25       139.860000       -0.034352 
      25       139.860000       -0.033023 
      25       140.030000       -0.034143 
      25       140.470000       -0.032816 
      25       140.480000       -0.039231 
      26       140.430000       -0.060532 
      26       140.390000       -0.091445 
      26       140.390000       -0.080296 
      26       140.360000       -0.068008 
      26       140.360000       -0.083690 
      26       140.280000       -0.043370 
      26       140.360000       0.020922 
      26       140.330000       0.015424 
      27       140.380000       -0.008230 
      27       140.360000       0.021096 
      27       140.410000       0.048853 
      27       140.350000       0.008869 
      27       140.340000       -0.067084 
      27       140.350000       -0.105882 
      27       140.330000       -0.076018 
      28       140.310000       -0.036640 
      28       140.260000       -0.027859 
      28       140.280000       -0.024454 
      28       140.330000       -0.015794 
      28       140.280000       0.023008 
      28       140.350000       0.052434 
      28       140.280000       0.022253 
      29       140.280000       -0.016613 
      29       140.270000       -0.024835 
      29       140.140000       -0.026836 
      29       140.370000       -0.024319 
      29       140.350000       -0.015687 
      29       140.420000       0.023114 
      29       140.180000       0.052539 
      29       140.310000       0.022357 
      30       139.980000       -0.016484 
      30       140.000000       -0.023857 
      30       140.070000       -0.016080 
      30       140.110000       0.022698 
      30       139.980000       0.052127 
      30       140.100000       0.021963 
      30       139.950000       -0.016462 
      30       140.110000       -0.019367 
      30       140.010000       0.001655 
      30       140.150000       0.032693 
      31       139.930000       0.016825 
      31       140.100000       -0.017493 
      31       140.040000       -0.025294 
      32       139.990000       -0.027304 
      32       140.020000       -0.025659 
      32       140.010000       -0.027678 
      32       140.020000       -0.035790 
      32       140.050000       -0.074089 
      32       140.060000       -0.103443 
      32       140.020000       -0.078071 
      32       140.050000       -0.061750 
      33       140.010000       -0.082400 
      33       140.030000       -0.065185 
      33       139.980000       -0.030357 
      33       139.980000       -0.022077 
      33       139.980000       -0.019594 
      33       139.990000       -0.020796 
      33       140.010000       -0.019164 
      33       140.050000       -0.020370 
      34       140.030000       -0.017904 
      34       139.990000       -0.009736 
      34       140.070000       0.024937 
      34       140.010000       0.045148 
      35       139.990000       0.032691 
      35       140.010000       0.032394 
      35       139.960000       0.042704 
      35       139.970000       0.091555 
      35       139.960000       0.102098 
      35       140.030000       0.044821 
      36       140.030000       0.031890 
      36       139.960000       0.036460 
      36       139.980000       0.004138 
      36       139.940000       -0.017609 
      36       139.980000       -0.024177 
      36       139.920000       -0.022949 
      36       139.930000       -0.024157 
      36       140.000000       -0.022492 
      37       139.970000       -0.023691 
      37       140.010000       -0.022056 
      37       139.990000       -0.024111 
      37       139.970000       -0.032258 
      37       140.020000       -0.070580 
      37       139.980000       -0.099530 
      37       139.970000       -0.068892 
      37       139.930000       -0.029998 
      37       139.940000       -0.026628 
      38       139.930000       -0.047190 
      38       139.970000       -0.077773 
      38       139.950000       -0.061454 
      38       139.990000       -0.026690 
      38       139.940000       -0.018447 
      38       139.970000       -0.016000 
      38       139.990000       -0.017238 
      38       139.980000       -0.015628 
      39       139.980000       -0.016457 
      39       139.980000       -0.009550 
      39       139.920000       0.012226 
      39       139.920000       0.043184 
      39       139.960000       0.027212 
      39       139.960000       -0.007211 
      39       139.970000       -0.015114 
      39       139.910000       -0.017199 
      40       139.980000       -0.014778 
      40       139.970000       -0.006242 
      40       139.840000       0.032464 
      40       139.890000       0.061796 
      40       139.990000       0.031522 
      40       139.960000       -0.007437 
      40       139.920000       -0.015752 
      40       139.970000       -0.017869 
      41       139.920000       -0.016293 
      41       139.940000       -0.017554 
      41       139.990000       -0.015954 
      41       139.930000       -0.017193 
      41       139.960000       -0.014758 
      41       139.870000       -0.006608 
      41       139.940000       0.028472 
      41       139.950000       0.053953 
      41       139.920000       0.064047 
      41       139.940000       0.086962 
      42       139.880000       0.050957 
      42       139.840000       0.011569 
      42       139.870000       0.050332 
      42       139.880000       0.084991 
      42       139.940000       0.061436 
      43       139.910000       0.060000 
      43       139.860000       0.070855 
      43       139.900000       0.066199 
      43       139.890000       0.026016 
      44       139.880000       -0.019045 
      44       139.890000       -0.050347 
      44       139.830000       -0.080937 
      44       139.930000       -0.055214 
      44       139.880000       0.012214 
      44       139.980000       0.037033 
      44       139.850000       0.006446 
      44       139.860000       -0.014421 
      44       139.950000       -0.011207 
      44       139.820000       0.027085 
      44       139.810000       0.055606 
      44       139.980000       0.015581 
      45       139.930000       -0.060413 
      45       139.880000       -0.098440 
      45       139.860000       -0.059250 
      45       139.870000       0.012687 
      45       139.930000       0.037912 
      45       139.920000       0.007304 
      46       139.950000       -0.014423 
      46       139.910000       -0.021021 
      46       139.910000       -0.019826 
      46       139.810000       -0.021078 
      46       139.920000       -0.019869 
      46       139.930000       -0.026000 
      46       140.000000       -0.042926 
      47       139.820000       -0.059461 
      47       139.930000       -0.041902 
      47       139.900000       -0.024298 
      47       139.870000       -0.017750 
      47       139.850000       -0.019409 
      47       139.940000       -0.027179 
      47       139.950000       -0.061083 
      47       139.910000       -0.076850 
      47       139.880000       -0.054402 
      48       139.900000       -0.064904 
      48       139.920000       -0.074476 
      48       139.930000       -0.042213 
      49       139.920000       -0.020097 
      49       139.830000       -0.013153 
      49       139.860000       -0.014007 
      49       139.950000       -0.012430 
      49       139.880000       -0.013730 
      49       139.920000       -0.012168 
      49       139.860000       -0.013471 
      49       139.970000       -0.011938 
      49       139.840000       -0.014094 
      50       139.860000       -0.022342 
      50       139.840000       -0.060762 
      50       139.940000       -0.089811 
      50       139.850000       -0.059257 
      50       139.910000       -0.020020 
      50       139.860000       -0.011405 
      50       139.920000       -0.008178 
      50       139.620000       -0.000093 
      51       140.150000       0.034084 
      51       139.870000       0.050122 
      51       140.000000       0.027953 
      51       139.980000       0.039146 
      51       140.130000       0.053882 
      51       139.890000       0.040421 
      52       139.820000       0.033438 
      52       140.020000       0.005914 
      52       139.970000       -0.030379 
      52       140.030000       -0.051959 
      52       139.740000       -0.034901 
      52       140.020000       -0.017379 
      52       139.960000       -0.010862 
      53       139.930000       -0.011326 
      53       140.170000       -0.004870 
      53       139.950000       0.012365 
      53       139.870000       0.029206 
      53       139.870000       0.011950 
      53       139.870000       -0.005356 
      53       139.870000       -0.011633 
      53       139.920000       -0.010518 
      54       140.260000       -0.011850 
      54       140.170000       -0.010307 
      54       139.980000       -0.011628 
      54       140.030000       -0.010088 
      54       139.890000       -0.011411 
      54       140.040000       -0.009873 
      54       139.890000       -0.011198 
      55       140.060000       -0.009662 
      55       139.950000       -0.010990 
      55       139.850000       -0.009456 
      55       140.010000       -0.010785 
      55       140.240000       -0.009253 
      56       139.880000       -0.010585 
      56       139.990000       -0.009055 
      56       139.800000       -0.010389 
      56       140.040000       -0.008861 
      56       140.100000       -0.010196 
      56       140.190000       -0.008670 
      57       140.040000       -0.010007 
      57       139.920000       -0.008483 
      57       139.970000       -0.009822 
      57       139.970000       -0.008300 
      57       140.160000       -0.009641 
      57       139.970000       -0.008121 
      57       139.960000       -0.009464 
      58       140.040000       -0.007945 
      58       139.890000       -0.009290 
      58       139.980000       -0.007773 
      58       139.980000       -0.009119 
      58       139.960000       -0.007604 
      58       139.990000       -0.008952 
      58       139.930000       -0.007438 
      59       140.140000       -0.008788 
      59       139.940000       -0.007263 
      59       139.810000       -0.008175 
      59       139.770000       -0.001351 
      59       139.970000       0.020343 
      59       140.090000       0.051246 
      59       140.180000       0.036031 
      59       140.120000       0.010921 
      59       140.130000       0.035562 
      59       140.020000       0.049908 
      59       139.940000       0.018303 
      59       139.900000       -0.003560 
      60       139.950000       -0.010268 
      60       140.130000       -0.009179 
      60       140.160000       -0.010525 
      60       140.020000       -0.008996 
      60       140.000000       -0.010330 
      60       139.980000       -0.008803 
      60       139.960000       -0.010139 
