Human trial picking the raspberry twin 

 time    ||     output compensated 

      0       -799.915909 
      0       -799.915909 
      0       -799.915909 
      0       -799.915909 
      0       -799.915909 
      0       -799.915909 
      0       -799.915909 
      0       -799.915909 
      0       -799.915909 
      0       -799.915904 
      0       -799.914715 
      0       -799.807651 
      0       -796.262212 
      0       -753.070728 
      0       -559.509030 
      0       -240.412029 
      0       -46.887524 
      0       -3.667330 
      0       -0.091523 
      0       0.002681 
      0       -0.036576 
      0       -0.058443 
      0       -0.055342 
      0       -0.015891 
      0       0.023990 
      0       0.032489 
      0       0.034787 
      0       0.033362 
      0       0.034371 
      0       0.027977 
      0       0.010617 
      0       -0.006518 
      0       0.010617 
      0       0.027964 
      0       0.033928 
      0       0.027964 
      0       0.010617 
      0       -0.006532 
      0       0.010161 
      0       0.022148 
      1       0.005205 
      1       -0.025760 
      1       -0.010049 
      1       0.024419 
      1       0.031616 
      1       0.023963 
      1       -0.015905 
      1       -0.055799 
      1       -0.064299 
      1       -0.066570 
      1       -0.064299 
      1       -0.055799 
      1       -0.015905 
      1       0.023989 
      1       0.032489 
      1       0.034761 
      1       0.032489 
      1       0.024016 
      1       -0.015032 
      1       -0.045430 
      1       -0.020847 
      1       -0.005150 
      1       -0.026659 
      1       -0.010949 
      1       0.014078 
      1       -0.010922 
      1       -0.025786 
      1       0.005205 
      1       0.022148 
      1       0.010161 
      1       -0.006532 
      1       0.010617 
      1       0.027977 
      1       0.034344 
      1       0.032476 
      1       0.023976 
      1       -0.016348 
      1       -0.061198 
      1       -0.088496 
      2       -0.106465 
      2       -0.088496 
      2       -0.061198 
      2       -0.016361 
      2       0.023533 
      2       0.027090 
      2       0.010591 
      2       -0.006519 
      2       0.010617 
      2       0.027977 
      2       0.034371 
      2       0.033349 
      2       0.034358 
      2       0.027547 
      2       0.005648 
      2       -0.025746 
      2       -0.010049 
      2       0.024446 
      2       0.032489 
      2       0.034331 
      2       0.027547 
      2       0.005648 
      2       -0.025746 
      2       -0.010076 
      3       0.023560 
      3       0.021705 
      3       -0.013606 
      3       -0.046413 
      3       -0.013580 
      3       0.022578 
      3       0.033928 
      3       0.033349 
      3       0.034814 
      3       0.033376 
      3       0.034814 
      3       0.033376 
      3       0.034814 
      3       0.033376 
      3       0.034814 
      3       0.033376 
      3       0.034814 
      3       0.033376 
      3       0.034440 
      3       0.031833 
      3       0.023539 
      3       -0.010847 
      3       -0.026278 
      3       0.005065 
      3       0.026694 
      3       0.033170 
      3       0.031853 
      3       0.032971 
      3       0.031205 
      3       0.031891 
      3       0.025242 
      3       0.007803 
      3       -0.009239 
      3       0.007818 
      3       0.024926 
      3       0.031006 
      3       0.029685 
      4       0.030400 
      4       0.023765 
      4       0.006342 
      4       -0.010686 
      4       0.006385 
      4       0.023507 
      4       0.029603 
      4       0.028308 
      4       0.029462 
      4       0.027744 
      4       0.028890 
      4       0.027177 
      4       0.028329 
      4       0.026609 
      4       0.027328 
      4       0.020286 
      4       -0.002448 
      4       -0.043317 
      4       -0.064563 
      4       -0.060848 
      4       -0.021183 
      4       0.018511 
      4       0.026741 
      4       0.028749 
      4       0.027063 
      4       0.028217 
      4       0.026511 
      4       0.027670 
      4       0.025969 
      4       0.027133 
      4       0.025425 
      4       0.026156 
      4       0.019151 
      4       -0.002720 
      4       -0.033773 
      4       -0.017895 
      4       0.016434 
      4       0.024246 
      5       0.026265 
      5       0.024605 
      5       0.025783 
      5       0.024101 
      5       0.025284 
      5       0.023581 
      5       0.023905 
      5       0.012017 
      5       -0.028393 
      5       -0.074730 
      5       -0.042902 
      5       0.010287 
      5       0.023053 
      5       0.025071 
      5       0.018078 
      5       -0.005059 
      5       -0.050808 
      5       -0.090590 
      5       -0.102181 
      5       -0.047400 
      5       0.001752 
      5       -0.018109 
      5       -0.037510 
      5       -0.029119 
      5       -0.036804 
      5       -0.015577 
      5       0.019168 
      5       0.026965 
      5       0.028958 
      5       0.027271 
      5       0.028422 
      5       0.026714 
      5       0.027871 
      5       0.026168 
      5       0.027330 
      5       0.025633 
      5       0.026801 
      5       0.025109 
      5       0.026282 
      5       0.024595 
      5       0.025773 
      5       0.024091 
      5       0.025274 
      6       0.023597 
      6       0.024785 
      6       0.023100 
      6       0.023855 
      6       0.016873 
      6       -0.004975 
      6       -0.036006 
      6       -0.020106 
      6       0.014246 
      6       0.022079 
      6       0.024121 
      6       0.022481 
      6       0.023681 
      6       0.022020 
      6       0.023224 
      6       0.021568 
      6       0.022776 
      6       0.021124 
      6       0.022337 
      6       0.020676 
      6       0.021455 
      6       0.014498 
      6       -0.007327 
      6       -0.038334 
      6       -0.022384 
      6       0.012841 
      6       0.030542 
      6       0.071062 
      6       0.116986 
      6       0.170045 
      6       0.312598 
      7       0.530027 
      7       0.739529 
      7       0.904875 
      7       1.016547 
      7       1.101904 
      7       1.254329 
      7       1.552927 
      7       1.832078 
      7       1.957301 
      7       1.979674 
      7       1.982953 
      7       1.981596 
      7       1.983935 
      7       1.993778 
      7       2.050366 
      7       2.170024 
      7       2.344000 
      7       2.555585 
      7       2.754588 
      7       2.864943 
      7       2.909808 
      7       2.953760 
      7       2.985638 
      7       3.020577 
      7       3.017919 
      7       2.970868 
      7       2.965526 
      7       2.987465 
      7       3.032315 
      7       3.078025 
      7       3.110762 
      7       3.153801 
      7       3.186122 
      7       3.227346 
      7       3.259697 
      7       3.301323 
      7       3.403621 
      7       3.482839 
      7       3.492782 
      7       3.450687 
      7       3.452026 
      7       3.447155 
      7       3.427028 
      7       3.547158 
      7       3.715634 
      7       3.837628 
      7       3.887799 
      7       3.875729 
      7       3.911703 
      8       3.946033 
      8       3.887533 
      8       3.831363 
      8       3.851117 
      8       3.852468 
      8       3.831789 
      8       3.741342 
      8       3.681695 
      8       3.778593 
      8       3.868526 
      8       3.932814 
      8       3.981488 
      8       4.030514 
      8       4.061331 
      8       4.031401 
      8       3.992367 
      8       3.983894 
      8       3.981637 
      8       3.984446 
      8       4.001420 
      8       4.102459 
      8       4.342158 
      8       4.621918 
      8       4.791798 
      8       4.899938 
      9       4.967172 
      9       4.991937 
      9       5.043141 
      9       5.123787 
      9       5.201945 
      9       5.348487 
      9       5.622875 
      9       5.862131 
      9       5.963157 
      9       5.980158 
      9       5.983852 
      9       5.992367 
      9       6.031402 
      9       6.061356 
      9       6.031264 
      9       5.987618 
      9       5.918885 
      9       5.587628 
      9       4.671847 
      9       3.011383 
      9       1.259840 
      9       0.645213 
      9       0.929040 
      9       1.185833 
      9       1.284443 
      9       1.261082 
      9       1.062449 
      9       0.705712 
      9       0.238033 
      9       -0.211941 
      9       -0.632135 
      9       -0.912325 
      9       -1.015621 
      9       -1.106821 
      9       -1.308036 
      9       -1.568166 
      9       -1.729437 
      9       -1.820160 
      9       -1.850652 
      9       -1.843900 
      9       -1.820009 
      10       -1.784650 
      10       -1.767514 
      10       -1.784650 
      10       -1.802010 
      10       -1.808404 
      10       -1.807395 
      10       -1.808847 
      10       -1.807409 
      10       -1.808847 
      10       -1.807435 
      10       -1.809734 
      10       -1.818234 
      10       -1.858128 
      10       -1.898022 
      10       -1.906509 
      10       -1.908364 
      10       -1.901579 
      10       -1.879681 
      10       -1.848260 
      10       -1.863097 
      10       -1.887654 
      10       -1.857255 
      10       -1.818234 
      10       -1.810620 
      10       -1.818274 
      11       -1.858571 
      11       -1.903394 
      11       -1.929832 
      11       -1.937890 
      11       -1.882325 
      11       -1.823660 
      11       -1.811064 
      11       -1.818274 
      11       -1.858128 
      11       -1.898022 
      11       -1.906509 
      11       -1.908364 
      11       -1.901553 
      11       -1.878795 
      11       -1.837488 
      11       -1.815589 
      11       -1.818664 
      11       -1.857255 
      11       -1.887224 
      11       -1.858128 
      11       -1.829032 
      11       -1.859014 
      11       -1.898022 
      12       -1.905636 
      12       -1.898022 
      12       -1.859014 
      12       -1.829059 
      12       -1.859015 
      12       -1.898049 
      12       -1.906522 
      12       -1.908820 
      12       -1.907408 
      12       -1.908847 
      13       -1.907409 
      13       -1.908847 
      13       -1.907408 
      13       -1.908820 
      13       -1.906522 
      13       -1.898022 
      13       -1.858128 
      13       -1.818234 
      13       -1.809734 
      13       -1.807462 
      13       -1.809734 
      13       -1.818234 
      13       -1.839547 
      13       -1.860646 
      13       -1.850455 
      14       -1.834226 
      14       -1.814486 
      14       -1.797765 
      14       -1.778363 
      14       -1.761977 
      14       -1.742082 
      14       -1.716273 
      14       -1.660466 
      14       -1.614205 
      15       -1.627720 
      15       -1.650086 
      15       -1.641974 
      15       -1.627803 
      15       -1.609276 
      15       -1.584795 
      15       -1.530303 
      15       -1.485344 
      15       -1.500146 
      15       -1.523763 
      15       -1.516062 
      15       -1.493338 
      15       -1.438935 
      15       -1.385051 
      15       -1.362786 
      15       -1.346909 
      15       -1.335689 
      15       -1.330747 
      15       -1.356934 
      15       -1.382860 
      16       -1.377447 
      16       -1.365948 
      16       -1.350890 
      16       -1.338806 
      16       -1.323994 
      16       -1.312178 
      16       -1.297632 
      16       -1.286080 
      16       -1.271794 
      16       -1.260474 
      16       -1.245595 
      16       -1.224750 
      16       -1.173845 
      16       -1.132011 
      16       -1.145003 
      16       -1.148242 
      17       -1.105679 
      17       -1.073793 
      17       -1.066151 
      17       -1.094547 
      17       -1.123083 
      17       -1.120267 
      17       -1.111313 
      17       -1.097951 
      17       -1.078584 
      17       -1.029154 
      17       -0.989206 
      17       -1.008970 
      17       -1.037524 
      17       -1.035538 
      17       -1.027431 
      17       -1.014908 
      17       -0.996370 
      17       -0.947763 
      17       -0.908629 
      17       -0.929199 
      17       -0.958551 
      18       -0.957354 
      18       -0.950055 
      18       -0.939157 
      18       -0.931163 
      18       -0.919577 
      18       -0.901992 
      18       -0.854328 
      18       -0.816102 
      18       -0.836747 
      18       -0.857210 
      18       -0.819807 
      18       -0.782804 
      18       -0.804658 
      18       -0.835229 
      18       -0.834415 
      18       -0.818533 
      18       -0.771730 
      18       -0.734356 
      18       -0.756656 
      18       -0.787308 
      18       -0.782917 
      18       -0.758753 
      19       -0.734227 
      19       -0.743850 
      19       -0.753597 
      19       -0.752392 
      19       -0.743869 
      19       -0.737868 
      19       -0.729065 
      19       -0.723198 
      19       -0.714542 
      19       -0.708821 
      19       -0.700308 
      19       -0.694703 
      19       -0.685481 
      19       -0.670238 
      19       -0.624891 
      19       -0.588986 
      20       -0.612752 
      20       -0.645242 
      20       -0.646328 
      20       -0.632327 
      20       -0.587386 
      20       -0.551856 
