Human trial picking the raspberry twin 

 time    ||     output compensated 

      0       -798.929412 
      0       -798.929412 
      0       -798.929412 
      0       -798.929412 
      0       -798.929412 
      0       -798.929412 
      0       -798.929412 
      0       -798.929412 
      0       -798.929412 
      0       -798.929407 
      0       -798.928219 
      0       -798.821302 
      0       -795.280685 
      0       -752.146872 
      0       -558.831491 
      0       -240.097275 
      0       -46.766197 
      0       -3.629283 
      0       -0.086811 
      0       0.018681 
      0       0.021307 
      0       0.019873 
      0       0.021312 
      0       0.019873 
      0       0.021312 
      0       0.019860 
      0       0.020855 
      1       0.014044 
      1       -0.007868 
      1       -0.039692 
      1       -0.028951 
      1       -0.013254 
      1       -0.020894 
      1       -0.002912 
      1       0.014474 
      1       0.020869 
      1       0.019860 
      1       0.021312 
      1       0.019873 
      1       0.021312 
      1       0.019873 
      1       0.021312 
      1       0.019873 
      1       0.021312 
      1       0.019873 
      1       0.021312 
      1       0.019873 
      1       0.021312 
      1       0.019873 
      2       0.021312 
      2       0.019873 
      2       0.021312 
      2       0.019873 
      2       0.021312 
      2       0.019873 
      2       0.021312 
      2       0.019873 
      2       0.021312 
      2       0.019873 
      2       0.021312 
      2       0.019873 
      2       0.021312 
      2       0.019873 
      2       0.021312 
      2       0.019873 
      2       0.021312 
      2       0.019860 
      2       0.020869 
      2       0.014501 
      3       -0.001999 
      3       -0.009223 
      3       0.045509 
      3       0.094263 
      3       0.069263 
      3       0.030658 
      3       0.022198 
      3       0.019900 
      3       0.021312 
      3       0.019873 
      3       0.021312 
      3       0.019873 
      3       0.021312 
      3       0.019873 
      3       0.021312 
      3       0.019873 
      3       0.021325 
      3       0.020330 
      3       0.027141 
      3       0.049040 
      4       0.080434 
      4       0.064737 
      4       0.030242 
      4       0.022185 
      4       0.019900 
      4       0.021312 
      4       0.019873 
      4       0.021312 
      4       0.019873 
      4       0.021312 
      4       0.019873 
      4       0.021312 
      4       0.019900 
      4       0.022171 
      4       0.029798 
      4       0.059338 
      4       0.056237 
      4       0.009145 
      4       0.002917 
      4       0.014058 
      4       0.010514 
      4       -0.023565 
      4       -0.039262 
      5       -0.008298 
      5       0.008645 
      5       -0.003342 
      5       -0.020034 
      5       -0.002886 
      5       0.014474 
      5       0.020660 
      5       0.019455 
      5       0.020698 
      5       0.019093 
      5       0.021177 
      5       0.029354 
      5       0.067704 
      5       0.096684 
      5       0.066061 
      5       0.026756 
      5       0.018100 
      5       0.015644 
      5       0.016885 
      5       0.015292 
      5       0.016563 
      5       0.014973 
      5       0.016248 
      5       0.014661 
      5       0.015939 
      5       0.014355 
      5       0.015636 
      5       0.014055 
      6       0.015339 
      6       0.013761 
      6       0.015048 
      6       0.013473 
      6       0.014762 
      6       0.013191 
      6       0.014483 
      6       0.012914 
      6       0.014209 
      6       0.012643 
      6       0.013940 
      6       0.012377 
      6       0.013678 
      6       0.012143 
      6       0.014283 
      6       0.022117 
      6       0.056072 
      6       0.071903 
      6       0.049956 
      6       0.066287 
      6       0.105159 
      6       0.136518 
      6       0.183611 
      6       0.245639 
      6       0.377361 
      6       0.587347 
      6       0.783953 
      6       0.886984 
      6       0.936411 
      6       0.951374 
      6       0.954081 
      6       0.969745 
      6       1.039429 
      6       1.199814 
      6       1.484113 
      7       1.748064 
      7       1.891683 
      7       1.966176 
      7       2.131694 
      7       2.433836 
      7       2.722939 
      7       2.884376 
      7       2.940470 
      7       2.987670 
      7       3.030748 
      7       3.072569 
      7       3.231735 
      7       3.528881 
      7       3.803685 
      7       3.962877 
      7       4.027914 
      7       4.059017 
      7       4.149576 
      7       4.286383 
      7       4.427136 
      7       4.614569 
      7       4.800558 
      7       4.944965 
      7       5.021185 
      7       5.036037 
      7       5.039719 
      7       5.049965 
      7       5.109280 
      8       5.220298 
      8       5.283639 
      8       5.257579 
      8       5.296795 
      8       5.428409 
      8       5.554987 
      8       5.655780 
      8       5.802883 
      8       5.911743 
      8       5.945936 
      8       5.987160 
      8       6.017625 
      8       5.993070 
      8       5.978259 
      8       6.010566 
      8       6.043237 
      8       6.097569 
      8       6.166007 
      8       6.172858 
      8       6.126627 
      8       6.120492 
      8       6.133849 
      8       6.157327 
      8       6.245121 
      8       6.439733 
      8       6.641394 
      8       6.780915 
      8       6.888086 
      8       6.994801 
      8       7.128051 
      8       7.295159 
      8       7.406842 
      8       7.413571 
      8       7.408727 
      8       7.384083 
      8       7.360706 
      8       7.412092 
      8       7.494283 
      8       7.282564 
      8       6.270151 
      8       4.296394 
      8       2.134995 
      8       1.466237 
      8       2.451393 
      8       3.466068 
      8       3.716092 
      8       3.437902 
      8       2.853698 
      8       2.137838 
      8       1.493208 
      8       0.946420 
      8       0.455596 
      8       0.012338 
      9       -0.409921 
      9       -0.809960 
      9       -1.036830 
      9       -1.180950 
      9       -1.363424 
      9       -1.549495 
      9       -1.701573 
      9       -1.808634 
      9       -1.901573 
      9       -1.949442 
      9       -1.961705 
      9       -1.961153 
      9       -1.962592 
      9       -1.940692 
      9       -1.932232 
      9       -1.893640 
      9       -1.869057 
      9       -1.922350 
      9       -1.991340 
      9       -1.985555 
      9       -1.951946 
      9       -1.944775 
      9       -1.952403 
      9       -1.991411 
      9       -2.021353 
      9       -1.990954 
      9       -1.946547 
      9       -1.914723 
      9       -1.882026 
      9       -1.892324 
      9       -1.903482 
      9       -1.881583 
      9       -1.898126 
      9       -1.932608 
      10       -1.939388 
      10       -1.927222 
      10       -1.873955 
      10       -1.842561 
      10       -1.889653 
      10       -1.930376 
      10       -1.943003 
      10       -1.952349 
      10       -1.991410 
      10       -2.021366 
      10       -1.991411 
      10       -1.952403 
      10       -1.944789 
      10       -1.952389 
      10       -1.990967 
      10       -2.015967 
      10       -1.967213 
      10       -1.912482 
      10       -1.919705 
      10       -1.936192 
      10       -1.942130 
      10       -1.936192 
      10       -1.919705 
      10       -1.912482 
      10       -1.967213 
      10       -2.015967 
      10       -1.990967 
      10       -1.952363 
      10       -1.943902 
      10       -1.941591 
      10       -1.942573 
      10       -1.936179 
      10       -1.918819 
      11       -1.901684 
      11       -1.918819 
      11       -1.936179 
      11       -1.942573 
      11       -1.941564 
      11       -1.943016 
      11       -1.941578 
      11       -1.943016 
      11       -1.941564 
      11       -1.942560 
      11       -1.935749 
      11       -1.913850 
      11       -1.882456 
      11       -1.898153 
      11       -1.932648 
      11       -1.940705 
      11       -1.942990 
      11       -1.941604 
      11       -1.943902 
      11       -1.952363 
      11       -1.990967 
      11       -2.015967 
      11       -1.947541 
      11       -1.873882 
      11       -1.862294 
      11       -1.860006 
      11       -1.847710 
      11       -1.828234 
      11       -1.811389 
      11       -1.791851 
      11       -1.775357 
      11       -1.756179 
      11       -1.740042 
      11       -1.721217 
      11       -1.705429 
      11       -1.686951 
      12       -1.671505 
      12       -1.653366 
      12       -1.638257 
      12       -1.620476 
      12       -1.606547 
      12       -1.598870 
      12       -1.621525 
      12       -1.634966 
      12       -1.588934 
      12       -1.533563 
      12       -1.500438 
      12       -1.450433 
      12       -1.420362 
      12       -1.437238 
      12       -1.444546 
      12       -1.436843 
      12       -1.421489 
      12       -1.408685 
      12       -1.392336 
      12       -1.370437 
      12       -1.322582 
      12       -1.293816 
      12       -1.311959 
      12       -1.320519 
      12       -1.314056 
      12       -1.299930 
      12       -1.288368 
      12       -1.274061 
      12       -1.262744 
      12       -1.248693 
      12       -1.237630 
      12       -1.223829 
      12       -1.213015 
      12       -1.199461 
      12       -1.188890 
      12       -1.175578 
      12       -1.165246 
      13       -1.152169 
      13       -1.142072 
      13       -1.129227 
      13       -1.119358 
      13       -1.106728 
      13       -1.096672 
      13       -1.079801 
      13       -1.056723 
      13       -1.047788 
      13       -1.069389 
      13       -1.055435 
      13       -1.013991 
      13       -0.982406 
      13       -0.989134 
      13       -0.996415 
      13       -0.992781 
      13       -0.981842 
      13       -0.973022 
      13       -0.956549 
      13       -0.925304 
      13       -0.884971 
      13       -0.891687 
      13       -0.917758 
      13       -0.925957 
      13       -0.951686 
      13       -0.957735 
      13       -0.917078 
      13       -0.886227 
      13       -0.870622 
      13       -0.862901 
      13       -0.852835 
      13       -0.845731 
      13       -0.835849 
      13       -0.828915 
      13       -0.819202 
      13       -0.812434 
      14       -0.802885 
      14       -0.796280 
      14       -0.786894 
      14       -0.780449 
      14       -0.771220 
      14       -0.764932 
      14       -0.755885 
      14       -0.750601 
      14       -0.751484 
      14       -0.782613 
      14       -0.804443 
      14       -0.766743 
      14       -0.720418 
      14       -0.704400 
      14       -0.690174 
      14       -0.666060 
      14       -0.642435 
      14       -0.652975 
      14       -0.663605 
      14       -0.662448 
      14       -0.645039 
      14       -0.603644 
      14       -0.574503 
      14       -0.633989 
      14       -0.680409 
      14       -0.652337 
      14       -0.624958 
      14       -0.611141 
      14       -0.596203 
      14       -0.551583 
      14       -0.516385 
      14       -0.540039 
      14       -0.563883 
      14       -0.533907 
      14       -0.513905 
      14       -0.540723 
      14       -0.566809 
      14       -0.605104 
      14       -0.629147 
      14       -0.593213 
      15       -0.548637 
      15       -0.534735 
      15       -0.526262 
      15       -0.512584 
      15       -0.468814 
      15       -0.434470 
      15       -0.459768 
      15       -0.493389 
      15       -0.491924 
      15       -0.470231 
      15       -0.443272 
      15       -0.432700 
      15       -0.415903 
      15       -0.432190 
      15       -0.462444 
      15       -0.465809 
      15       -0.463387 
      15       -0.456517 
      15       -0.443976 
      15       -0.405386 
      15       -0.385779 
      15       -0.412576 
      15       -0.425223 
      15       -0.409078 
      15       -0.387623 
      15       -0.391324 
      15       -0.371844 
      15       -0.356654 
      15       -0.375180 
      15       -0.359969 
      15       -0.341229 
      15       -0.350300 
      15       -0.348044 
      15       -0.348236 
      15       -0.346838 
      15       -0.365254 
      15       -0.379200 
      15       -0.381325 
      16       -0.371594 
      16       -0.350267 
      16       -0.324455 
      16       -0.314220 
      16       -0.288794 
      16       -0.269133 
      16       -0.269937 
      16       -0.306281 
      16       -0.341849 
      16       -0.337019 
      16       -0.298266 
      16       -0.257486 
      16       -0.264299 
      16       -0.267370 
      16       -0.285143 
      16       -0.298656 
      16       -0.287281 
      16       -0.292397 
      16       -0.269439 
      16       -0.241131 
      16       -0.258576 
      16       -0.252934 
      16       -0.213597 
      16       -0.243392 
      16       -0.293718 
      16       -0.302826 
      16       -0.293085 
      16       -0.256043 
      16       -0.237930 
      16       -0.266192 
      16       -0.279891 
      16       -0.260705 
      16       -0.226605 
      16       -0.230066 
      16       -0.224258 
      16       -0.193592 
      16       -0.201895 
      16       -0.206041 
      16       -0.229321 
      16       -0.261590 
      16       -0.261658 
      16       -0.238199 
      17       -0.204737 
      17       -0.217379 
      17       -0.239543 
      17       -0.207903 
      17       -0.177006 
      17       -0.204892 
      17       -0.240637 
      17       -0.236832 
      17       -0.200370 
      17       -0.175688 
      17       -0.243216 
      17       -0.302303 
      17       -0.255069 
      17       -0.170762 
      17       -0.123446 
      17       -0.122168 
      17       -0.167541 
      17       -0.174267 
      17       -0.167235 
      17       -0.197508 
      17       -0.217239 
      17       -0.221810 
      17       -0.218632 
      17       -0.218734 
      17       -0.224922 
      17       -0.260892 
      17       -0.283020 
      17       -0.231497 
      17       -0.170092 
      17       -0.156933 
      17       -0.156158 
      17       -0.176441 
      17       -0.192288 
      17       -0.196708 
      17       -0.193743 
      17       -0.193242 
      17       -0.189886 
      17       -0.189385 
      17       -0.185229 
      17       -0.175387 
      17       -0.139058 
      17       -0.117221 
      17       -0.128519 
      17       -0.133373 
      17       -0.154323 
      17       -0.170403 
      17       -0.175004 
      17       -0.170979 
      18       -0.155987 
      18       -0.097160 
      18       -0.050553 
      18       -0.089925 
      18       -0.123176 
      18       -0.105583 
      18       -0.121344 
      18       -0.154320 
      18       -0.160754 
      18       -0.161408 
      18       -0.158396 
      18       -0.158236 
      18       -0.155230 
      18       -0.155102 
      18       -0.152113 
      18       -0.151591 
      18       -0.143745 
      18       -0.125121 
      18       -0.106905 
      18       -0.122775 
      18       -0.137895 
      18       -0.133446 
      18       -0.098387 
      18       -0.081876 
      18       -0.112111 
      18       -0.131819 
      18       -0.127431 
      18       -0.087951 
      18       -0.057428 
      18       -0.086497 
      18       -0.123851 
      18       -0.126095 
      18       -0.108499 
      18       -0.090476 
      18       -0.106536 
      18       -0.122656 
      18       -0.127760 
      18       -0.125484 
      18       -0.125666 
      19       -0.122972 
      19       -0.122728 
      19       -0.114758 
      19       -0.091917 
      19       -0.059479 
      19       -0.069079 
      19       -0.078597 
      19       -0.046730 
      19       -0.029915 
      19       -0.046815 
      19       -0.086402 
      19       -0.103149 
      19       -0.090277 
      19       -0.072835 
      19       -0.088659 
      19       -0.100038 
      19       -0.086280 
      19       -0.062271 
      19       -0.040390 
      19       0.032809 
      19       0.072810 
      19       -0.006427 
      19       -0.072840 
      19       -0.039402 
      19       -0.009643 
      19       -0.056220 
      19       -0.095987 
      19       -0.107927 
      19       -0.120169 
      19       -0.166847 
      19       -0.177649 
      19       -0.113712 
      19       -0.087799 
      19       -0.093044 
      19       -0.088180 
      19       -0.053547 
      20       -0.037484 
      20       -0.068189 
      20       -0.089174 
      20       -0.094600 
      20       -0.087749 
      20       -0.069273 
      20       -0.046710 
      20       -0.044597 
      20       -0.045770 
      20       -0.066319 
      20       -0.073042 
      20       -0.036941 
      20       0.009649 
      20       -0.020702 
      20       -0.063842 
      20       -0.042935 
      20       -0.023322 
      20       -0.035559 
      20       -0.040080 
      20       -0.047656 
      20       -0.013468 
      20       0.012841 
      20       -0.033908 
      20       -0.068952 
      20       -0.060877 
      20       -0.039261 
      20       -0.037223 
      20       -0.037646 
      20       -0.049327 
      20       -0.029225 
      20       -0.004156 
      20       -0.032933 
      20       -0.056955 
      20       -0.013438 
      20       0.016926 
      20       -0.029890 
      20       -0.069881 
      20       -0.080832 
      20       -0.079450 
      20       -0.079680 
