Human trial picking the raspberry twin 

 time    ||     output compensated 

      0       -801.050000 
      0       -801.050000 
      0       -801.050000 
      0       -801.050000 
      0       -801.050000 
      0       -801.050000 
      0       -801.050000 
      0       -801.050000 
      0       -801.050000 
      0       -801.049995 
      0       -801.048804 
      0       -800.941606 
      0       -797.391709 
      0       -754.145375 
      0       -560.331767 
      0       -240.797369 
      0       -46.989573 
      0       -3.708743 
      0       -0.129280 
      0       -0.051192 
      0       -0.079123 
      0       -0.049996 
      0       -0.020900 
      0       -0.050869 
      0       -0.089460 
      0       -0.092534 
      1       -0.070636 
      1       -0.029356 
      1       -0.007457 
      1       -0.010531 
      1       -0.049123 
      1       -0.079065 
      1       -0.049109 
      1       -0.010075 
      1       -0.001601 
      1       0.000697 
      1       -0.000715 
      1       0.000723 
      1       -0.000715 
      1       0.000723 
      1       -0.000715 
      1       0.000723 
      1       -0.000715 
      1       0.000697 
      1       -0.001602 
      1       -0.010101 
      1       -0.049995 
      1       -0.089863 
      1       -0.097503 
      1       -0.089863 
      2       -0.049995 
      2       -0.010101 
      2       -0.001602 
      2       0.000670 
      2       -0.001602 
      2       -0.010075 
      2       -0.049109 
      2       -0.079065 
      2       -0.049109 
      2       -0.010075 
      2       -0.001601 
      2       0.000697 
      2       -0.000729 
      2       0.000267 
      2       -0.006544 
      2       -0.028443 
      2       -0.059864 
      2       -0.045026 
      2       -0.020443 
      2       -0.049982 
      2       -0.079118 
      2       -0.049982 
      2       -0.020443 
      2       -0.045026 
      2       -0.059864 
      2       -0.028443 
      2       -0.006544 
      2       0.000240 
      3       -0.001615 
      3       -0.010075 
      3       -0.049109 
      3       -0.079092 
      3       -0.049995 
      3       -0.020873 
      3       -0.049995 
      3       -0.079092 
      3       -0.049110 
      3       -0.010101 
      4       -0.002488 
      4       -0.010128 
      4       -0.049996 
      4       -0.089863 
      4       -0.097503 
      4       -0.089863 
      4       -0.049995 
      4       -0.010101 
      5       -0.001602 
      5       0.000697 
      5       -0.000715 
      5       0.000697 
      5       -0.001602 
      5       -0.010101 
      5       -0.049982 
      5       -0.089433 
      5       -0.092534 
      5       -0.070635 
      5       -0.029329 
      5       -0.006571 
      5       0.000267 
      5       -0.000728 
      5       0.000723 
      5       -0.000715 
      5       0.000723 
      5       -0.000715 
      6       0.000723 
      6       -0.000715 
      6       0.000697 
      6       -0.001602 
      6       -0.010000 
      6       -0.049395 
      6       -0.088371 
      6       -0.095064 
      6       -0.086988 
      6       -0.051968 
      6       -0.035057 
      6       -0.055948 
      6       -0.038997 
      6       -0.004431 
      6       0.003590 
      6       0.005816 
      6       0.004360 
      6       0.005741 
      6       0.004259 
      6       0.005641 
      6       0.004160 
      6       0.005543 
      6       0.004103 
      6       0.006777 
      6       0.020496 
      6       0.084645 
      6       0.174384 
      6       0.264515 
      7       0.407958 
      7       0.588421 
      7       0.769490 
      7       0.899371 
      7       0.959722 
      7       1.032013 
      7       1.244525 
      7       1.557369 
      7       1.782007 
      7       1.899508 
      7       1.964141 
      7       2.032841 
      7       2.165135 
      7       2.313946 
      7       2.476764 
      7       2.670811 
      7       2.810705 
      7       2.865025 
      7       2.912092 
      7       2.952523 
      7       2.962366 
      7       2.980836 
      7       3.051169 
      7       3.162794 
      7       3.200837 
      7       3.199591 
      7       3.211578 
      7       3.146681 
      7       3.032814 
      7       2.981736 
      7       2.991990 
      7       3.022471 
      7       3.006720 
      8       2.971365 
      8       2.953370 
      8       2.912629 
      8       2.872735 
      8       2.865082 
      8       2.872278 
      8       2.906747 
      8       2.922444 
      8       2.891076 
      8       2.870024 
      8       2.872708 
      8       2.906760 
      8       2.922444 
      8       2.891050 
      8       2.869151 
      8       2.862340 
      8       2.863335 
      8       2.861883 
      8       2.863317 
      8       2.861486 
      8       2.849672 
      8       2.678433 
      8       1.818615 
      8       -0.031503 
      8       -1.718670 
      8       -1.986678 
      8       -1.293411 
      8       -0.825394 
      9       -0.884314 
      9       -1.111603 
      9       -1.472467 
      9       -2.087304 
      9       -2.699213 
      9       -3.025159 
      9       -3.122616 
      9       -3.135655 
      9       -3.138088 
      9       -3.136678 
      9       -3.138117 
      9       -3.136678 
      9       -3.138117 
      9       -3.105312 
      9       -3.075709 
      9       -3.044405 
      9       -3.026049 
      9       -3.041397 
      9       -3.080708 
      9       -3.048477 
      9       -2.980938 
      9       -2.932435 
      9       -2.928515 
      9       -2.950817 
      9       -2.997079 
      9       -3.038635 
      9       -3.061170 
      9       -3.044464 
      9       -3.026675 
      9       -3.014922 
      9       -2.993063 
      9       -2.967914 
      9       -3.017720 
      9       -3.129679 
      9       -3.192480 
      9       -3.159261 
      9       -3.087210 
      9       -3.056659 
      9       -3.068396 
      9       -3.074571 
      9       -3.097079 
      9       -3.114868 
      9       -3.120832 
      9       -3.114425 
      9       -3.091693 
      9       -3.050803 
      9       -3.033404 
      9       -3.049460 
      9       -3.075012 
      10       -3.035105 
      10       -2.960755 
      10       -2.929778 
      10       -2.936572 
      10       -2.990321 
      10       -3.033763 
      10       -3.049087 
      10       -3.135064 
      10       -3.185256 
      10       -3.126161 
      10       -3.068772 
      10       -3.008251 
      10       -2.995777 
      10       -3.052132 
      10       -3.059355 
      10       -3.030663 
      10       -3.028448 
      10       -3.050360 
      10       -3.091223 
      10       -3.108569 
      10       -3.090766 
      10       -3.044504 
      10       -2.998422 
      10       -2.961629 
      10       -2.976909 
      10       -3.012237 
      10       -3.029803 
      10       -3.065587 
      10       -3.086683 
      10       -3.078627 
      10       -3.086710 
      10       -3.066500 
      10       -3.041461 
      10       -3.070570 
      10       -3.095166 
      10       -3.051759 
      10       -3.020364 
      10       -3.057530 
      10       -3.059342 
      10       -3.024820 
      10       -2.998408 
      10       -2.980883 
      10       -3.003364 
      10       -3.044034 
      10       -3.079539 
      10       -3.054829 
      11       -2.959120 
      11       -2.924214 
      11       -2.999654 
      11       -3.053472 
      11       -2.967519 
      11       -2.862418 
      11       -2.815619 
      11       -2.784749 
      11       -2.762741 
      11       -2.746980 
      11       -2.713357 
      11       -2.639165 
      11       -2.604384 
      11       -2.584481 
      11       -2.536544 
      11       -2.527982 
      11       -2.542197 
      11       -2.547855 
      11       -2.554295 
      11       -2.513238 
      11       -2.453982 
      11       -2.422291 
      11       -2.404781 
      11       -2.409977 
      11       -2.383632 
      11       -2.322149 
      11       -2.320595 
      11       -2.307185 
      11       -2.237041 
      11       -2.189894 
      11       -2.158990 
      11       -2.134877 
      11       -2.091658 
      11       -2.054007 
      11       -2.037788 
      11       -2.065480 
      11       -2.112992 
      11       -2.108856 
      11       -2.083712 
      11       -2.101944 
      11       -2.062698 
      11       -1.988472 
      11       -1.933426 
      11       -1.886242 
      11       -1.896584 
      12       -1.908698 
      12       -1.866507 
      12       -1.847047 
      12       -1.841308 
      12       -1.833707 
      12       -1.832968 
      12       -1.831589 
      12       -1.795471 
      12       -1.750930 
      12       -1.694364 
      12       -1.661455 
      12       -1.675908 
      12       -1.680815 
      12       -1.670311 
      12       -1.647277 
      12       -1.608287 
      12       -1.551311 
      12       -1.514105 
      12       -1.501595 
      12       -1.520330 
      12       -1.521930 
      12       -1.490349 
      12       -1.509596 
      12       -1.534404 
      12       -1.474263 
      12       -1.411653 
      12       -1.416968 
      12       -1.417062 
      12       -1.371798 
      12       -1.337278 
      12       -1.327852 
      12       -1.363429 
      12       -1.426058 
      12       -1.445948 
      12       -1.378741 
      12       -1.287267 
      12       -1.246970 
      12       -1.245929 
      12       -1.255314 
      12       -1.249738 
      12       -1.259524 
      12       -1.263702 
      12       -1.247596 
      13       -1.196902 
      13       -1.155289 
      13       -1.173380 
      13       -1.199851 
      13       -1.190896 
      13       -1.157307 
      13       -1.104841 
      13       -1.071262 
      13       -1.053780 
      13       -1.044241 
      13       -1.032800 
      13       -1.029214 
      13       -1.040602 
      13       -1.061276 
      13       -1.035124 
      13       -0.990648 
      13       -0.973617 
      13       -0.971458 
      13       -1.001212 
      13       -1.030669 
      13       -1.027926 
      13       -1.010083 
      13       -0.960513 
      13       -0.911413 
      13       -0.893884 
      13       -0.882696 
      13       -0.876105 
      13       -0.875320 
      13       -0.900717 
      13       -0.907250 
      13       -0.867097 
      13       -0.836746 
      13       -0.821636 
      13       -0.814405 
      13       -0.804824 
      13       -0.798199 
      13       -0.788793 
      13       -0.782329 
      13       -0.773082 
      13       -0.766776 
      13       -0.757723 
      13       -0.752847 
      13       -0.758639 
      13       -0.809145 
      13       -0.855651 
      13       -0.834650 
      13       -0.786865 
      13       -0.743009 
      13       -0.749856 
      13       -0.767094 
      14       -0.734647 
      14       -0.711747 
      14       -0.725897 
      14       -0.702247 
      14       -0.661048 
      14       -0.646461 
      14       -0.637761 
      14       -0.633619 
      14       -0.635259 
      14       -0.663057 
      14       -0.671966 
      14       -0.634166 
      14       -0.606145 
      14       -0.593340 
      14       -0.588392 
      14       -0.581071 
      14       -0.576684 
      14       -0.569494 
      14       -0.565236 
      14       -0.558598 
      14       -0.559755 
      14       -0.575837 
      14       -0.601159 
      14       -0.579608 
      14       -0.539688 
      14       -0.527166 
      14       -0.529471 
      14       -0.563645 
      14       -0.597478 
      14       -0.599067 
      14       -0.585512 
      14       -0.540188 
      14       -0.495291 
      14       -0.481937 
      14       -0.475281 
      14       -0.477245 
      14       -0.494165 
      14       -0.520742 
      14       -0.505340 
      14       -0.490091 
      14       -0.516683 
      14       -0.532371 
      14       -0.524390 
      15       -0.485409 
      15       -0.464176 
      15       -0.480776 
      15       -0.459577 
      15       -0.420805 
      15       -0.408633 
      15       -0.402711 
      15       -0.404988 
      15       -0.418124 
      15       -0.430906 
      15       -0.409633 
      15       -0.388351 
      15       -0.378137 
      15       -0.375354 
      15       -0.370164 
      15       -0.367899 
      15       -0.363235 
      15       -0.366372 
      15       -0.385239 
      15       -0.422306 
      15       -0.440614 
      15       -0.442951 
      15       -0.436698 
      15       -0.424368 
      15       -0.385974 
      15       -0.366561 
      15       -0.393537 
      15       -0.405963 
      15       -0.385542 
      15       -0.351045 
      15       -0.363075 
      15       -0.393169 
      15       -0.392306 
      15       -0.372009 
      15       -0.350500 
      15       -0.354120 
      15       -0.329707 
      15       -0.292247 
      15       -0.286254 
      15       -0.300165 
      15       -0.319008 
      16       -0.317463 
      16       -0.312656 
      16       -0.288085 
      16       -0.272499 
      16       -0.282040 
      16       -0.295758 
      16       -0.275823 
      16       -0.255879 
      16       -0.246990 
      16       -0.245532 
      16       -0.242078 
      16       -0.246426 
      16       -0.266480 
      16       -0.304296 
      16       -0.318439 
      16       -0.298081 
      16       -0.255046 
      16       -0.234884 
      16       -0.244376 
      16       -0.258471 
      16       -0.239334 
      16       -0.224661 
      16       -0.234734 
      16       -0.250215 
      16       -0.245893 
      16       -0.287397 
      16       -0.347917 
      16       -0.328472 
      16       -0.253804 
      16       -0.202397 
      16       -0.191120 
      16       -0.186908 
      16       -0.186449 
      16       -0.183586 
      17       -0.188080 
      17       -0.203386 
      17       -0.218329 
      17       -0.199607 
      17       -0.185331 
      17       -0.195758 
      17       -0.210339 
      17       -0.191258 
      17       -0.172159 
      17       -0.164108 
      17       -0.163465 
      17       -0.160393 
      17       -0.160213 
      17       -0.157213 
      17       -0.157916 
      17       -0.164726 
      17       -0.201723 
      17       -0.229362 
      17       -0.197412 
      17       -0.156794 
      17       -0.146837 
      17       -0.143094 
      17       -0.143060 
      17       -0.140206 
      17       -0.140228 
      18       -0.137401 
      18       -0.137451 
      18       -0.134653 
      18       -0.134743 
      18       -0.132398 
      18       -0.137404 
      18       -0.153216 
      18       -0.168648 
      18       -0.149997 
      18       -0.131311 
      18       -0.123668 
      18       -0.123430 
      18       -0.120758 
      18       -0.120974 
      18       -0.118341 
      18       -0.118595 
      18       -0.116410 
      18       -0.121576 
      18       -0.137547 
      18       -0.153135 
      18       -0.134640 
      18       -0.116108 
      18       -0.108642 
      18       -0.109406 
      18       -0.116714 
      18       -0.155042 
      18       -0.192986 
      18       -0.199458 
      18       -0.199300 
      18       -0.190564 
      18       -0.166141 
      19       -0.123986 
      19       -0.105121 
      19       -0.115911 
      19       -0.131277 
      19       -0.112987 
      19       -0.094671 
      19       -0.087394 
      19       -0.087518 
      19       -0.085206 
      19       -0.085778 
      19       -0.083496 
      19       -0.084085 
      19       -0.081821 
      19       -0.082439 
      19       -0.080617 
      19       -0.086141 
      19       -0.102465 
      19       -0.118405 
      19       -0.100257 
      19       -0.082068 
      19       -0.074917 
      19       -0.075193 
      19       -0.073855 
      19       -0.084353 
      19       -0.119305 
      19       -0.150617 
      19       -0.116606 
      19       -0.079644 
      19       -0.067611 
      20       -0.067508 
      20       -0.065382 
      20       -0.066152 
      20       -0.064067 
      20       -0.064863 
      20       -0.063216 
      20       -0.068915 
      20       -0.085438 
      20       -0.102386 
      20       -0.093798 
      20       -0.108400 
      20       -0.117963 
      20       -0.085703 
      20       -0.068060 
      20       -0.079272 
      20       -0.095843 
      20       -0.087307 
      20       -0.101974 
      20       -0.111588 
      20       -0.078967 
      20       -0.056484 
      20       -0.049176 
      20       -0.049683 
      20       -0.048175 
      20       -0.054023 
      20       -0.070669 
      20       -0.086926 
      20       -0.069093 
