Human trial picking the raspberry twin 

 time    ||     output compensated 

      0       -799.409259 
      0       -799.409259 
      0       -799.409259 
      0       -799.409259 
      0       -799.409259 
      0       -799.409259 
      0       -799.409259 
      0       -799.409259 
      0       -799.409259 
      0       -799.409254 
      0       -799.408066 
      0       -799.301108 
      0       -795.759122 
      0       -752.607809 
      0       -559.204499 
      0       -240.287975 
      0       -46.803938 
      0       -3.629494 
      0       -0.114622 
      0       -0.049124 
      0       -0.045501 
      0       -0.081057 
      0       -0.098873 
      0       -0.092658 
      0       -0.105241 
      0       -0.096601 
      0       -0.062233 
      0       -0.026268 
      0       -0.041106 
      0       -0.004272 
      0       0.042723 
      0       0.034683 
      0       0.080919 
      0       0.152037 
      0       0.116284 
      0       0.005144 
      0       0.002886 
      0       0.042307 
      0       0.023066 
      0       0.023513 
      0       0.045854 
      0       0.088999 
      0       0.114859 
      0       0.071530 
      0       0.041439 
      0       0.093930 
      0       0.157963 
      0       0.199647 
      0       0.183546 
      0       0.134626 
      0       0.074689 
      0       0.038711 
      0       0.078715 
      0       0.078106 
      0       0.052316 
      0       0.053014 
      0       0.106136 
      0       0.194179 
      1       0.231151 
      1       0.220620 
      1       0.222651 
      1       0.152026 
      1       0.060430 
      1       0.015374 
      1       0.057645 
      1       0.074508 
      1       0.048661 
      1       0.032372 
      1       0.001596 
      1       0.000145 
      1       0.033407 
      1       0.043127 
      1       0.067060 
      1       0.078038 
      1       0.061674 
      1       0.018929 
      1       -0.006500 
      1       -0.024482 
      1       -0.008811 
      1       0.011412 
      1       0.013114 
      1       0.014610 
      1       0.009517 
      1       0.072889 
      1       0.141257 
      1       0.139178 
      1       0.045868 
      1       -0.026210 
      1       0.002443 
      1       0.068249 
      1       0.069245 
      1       -0.004811 
      1       -0.053481 
      1       -0.008810 
      1       0.126652 
      1       0.210317 
      1       0.198800 
      1       0.121631 
      1       0.067531 
      1       0.092062 
      1       0.129820 
      1       0.129214 
      1       0.103385 
      1       0.102776 
      1       0.142833 
      1       0.108575 
      1       0.068487 
      1       0.095619 
      1       0.152219 
      1       0.168763 
      1       0.190718 
      1       0.211814 
      1       0.217586 
      1       0.226639 
      1       0.183477 
      1       0.128079 
      2       0.101018 
      2       0.117294 
      2       0.134627 
      2       0.141021 
      2       0.139999 
      2       0.141020 
      2       0.133241 
      2       0.113432 
      2       0.080176 
      2       0.035137 
      2       -0.019455 
      2       -0.015618 
      2       -0.021818 
      2       -0.042281 
      2       -0.015806 
      2       0.010582 
      2       0.036241 
      2       0.120544 
      2       0.152651 
      2       0.080536 
      2       -0.008004 
      2       -0.079011 
      2       -0.092771 
      2       -0.034230 
      2       0.107220 
      2       0.157514 
      2       0.060257 
      2       0.024533 
      2       0.039850 
      2       0.015457 
      2       0.018923 
      2       0.044344 
      2       0.042721 
      2       0.002747 
      2       0.039652 
      2       0.179821 
      2       0.326698 
      2       0.386855 
      2       0.326197 
      2       0.207230 
      2       0.132772 
      2       0.127085 
      2       0.165613 
      2       0.219525 
      2       0.214494 
      2       0.162863 
      2       0.119356 
      2       0.131645 
      2       0.150571 
      2       0.175802 
      2       0.190818 
      2       0.180959 
      2       0.126789 
      2       0.093603 
      2       0.129449 
      2       0.130399 
      2       0.100650 
      3       0.101080 
      3       0.126053 
      3       0.129025 
      3       0.091943 
      3       0.083785 
      3       0.050222 
      3       0.008344 
      3       -0.050582 
      3       -0.044966 
      3       0.015182 
      3       0.096773 
      3       0.125475 
      3       0.051917 
      3       -0.032799 
      3       -0.015246 
      3       0.093649 
      3       0.160973 
      3       0.161611 
      3       0.097821 
      3       0.016629 
      3       -0.030174 
      3       -0.087565 
      3       -0.103902 
      3       -0.004042 
      3       0.079482 
      3       0.090163 
      3       0.127563 
      3       0.148281 
      3       0.107099 
      3       0.076593 
      3       0.129572 
      3       0.128208 
      3       0.073314 
      3       0.018809 
      3       -0.029662 
      3       -0.003204 
      3       0.031829 
      3       0.038665 
      3       0.093740 
      3       0.141573 
      3       0.121591 
      3       0.115511 
      3       0.178176 
      3       0.214214 
      3       0.177362 
      3       0.127325 
      3       0.129079 
      3       0.194440 
      3       0.153265 
      3       0.059271 
      3       0.111686 
      3       0.205591 
      3       0.171125 
      3       0.117039 
      3       0.042632 
      3       -0.035377 
      3       -0.058552 
      4       -0.085579 
      4       -0.045967 
      4       0.064316 
      4       0.080663 
      4       -0.028907 
      4       -0.068869 
      4       -0.016422 
      4       0.012725 
      4       0.006272 
      4       0.024076 
      4       0.041898 
      4       0.057583 
      4       0.091939 
      4       0.108380 
      4       0.013616 
      4       -0.092918 
      4       -0.096937 
      4       -0.072855 
      4       -0.094827 
      4       -0.084848 
      4       0.032033 
      4       0.113100 
      4       0.080289 
      4       0.069070 
      4       0.033088 
      4       -0.015357 
      4       -0.029124 
      4       0.035573 
      4       0.069780 
      4       0.032699 
      4       0.031564 
      4       0.056832 
      4       0.058648 
      4       0.020664 
      4       -0.003854 
      4       -0.016272 
      4       0.022960 
      4       0.078192 
      4       0.094239 
      4       0.121364 
      4       0.156836 
      4       0.182032 
      4       0.181432 
      4       0.168133 
      4       0.106071 
      4       0.041161 
      4       0.004351 
      4       -0.026800 
      4       0.002810 
      4       0.082098 
      5       0.088841 
      5       -0.024732 
      5       -0.082551 
      5       -0.036120 
      5       -0.024126 
      5       -0.027923 
      5       0.014977 
      5       0.083540 
      5       0.156936 
      5       0.145819 
      5       0.054133 
      5       0.019659 
      5       0.046237 
      5       -0.010234 
      5       -0.014005 
      5       0.076965 
      5       0.174699 
      5       0.189890 
      5       0.088884 
      5       -0.022666 
      5       -0.053740 
      5       0.006023 
      5       0.014148 
      5       0.013827 
      5       0.046719 
      5       0.096172 
      5       0.136725 
      5       0.156829 
      5       0.128896 
      5       0.072376 
      5       0.024829 
      5       0.023494 
      5       0.036746 
      5       0.056577 
      5       0.040692 
      5       0.040063 
      5       0.031882 
      5       0.017568 
      5       0.000811 
      5       -0.044833 
      5       -0.110505 
      5       -0.104524 
      5       -0.082237 
      5       -0.119047 
      5       -0.119225 
      5       -0.078112 
      5       -0.023186 
      5       0.042263 
      5       0.016926 
      5       -0.084243 
      5       -0.130980 
      6       -0.094109 
      6       -0.025332 
      6       0.045523 
      6       0.032080 
      6       -0.012395 
      6       0.045258 
      6       0.106966 
      6       0.060673 
      6       0.050245 
      6       0.054219 
      6       0.014578 
      6       -0.031612 
      6       -0.081590 
      6       -0.047296 
      6       -0.001778 
      6       -0.003350 
      6       -0.003873 
      6       0.073919 
      6       0.156022 
      6       0.134645 
      6       0.080417 
      6       0.073899 
      6       0.096221 
      6       0.136946 
      6       0.101773 
      6       0.037877 
      6       0.031112 
      6       -0.052523 
      6       -0.173127 
      6       -0.178934 
      6       -0.152369 
      6       -0.087296 
      6       0.025267 
      6       0.082746 
      6       0.035329 
      6       -0.033259 
      6       -0.031214 
      6       -0.005549 
      6       0.033975 
      6       0.120576 
      6       0.146008 
      6       0.116129 
      6       0.092850 
      6       0.077198 
      6       0.043675 
      6       -0.034449 
      6       -0.016263 
      7       0.072525 
      7       0.141581 
      7       0.225764 
      7       0.288286 
      7       0.309016 
      7       0.346711 
      7       0.382780 
      7       0.387447 
      7       0.388520 
      7       0.416651 
      7       0.574580 
      7       0.896850 
      7       1.224588 
      7       1.484200 
      7       1.764461 
      7       2.071517 
      7       2.286356 
      7       2.372556 
      7       2.443931 
      7       2.585252 
      7       2.845246 
      7       3.168041 
      7       3.384930 
      7       3.479313 
      7       3.564433 
      7       3.698192 
      7       3.828565 
      7       3.974411 
      7       4.103397 
      7       4.175727 
      7       4.244319 
      7       4.365358 
      7       4.459087 
      7       4.503065 
      7       4.552846 
      7       4.615192 
      7       4.724564 
      7       4.828550 
      7       4.861246 
      7       4.844720 
      8       4.797612 
      8       4.740718 
      8       4.655061 
      8       4.584281 
      8       4.536703 
      8       4.461856 
      8       4.431391 
      8       4.489583 
      8       4.518276 
      8       4.455155 
      8       4.409893 
      8       4.484823 
      8       4.674396 
      8       4.869411 
      8       4.973375 
      8       5.069458 
      8       5.202940 
      8       5.274770 
      8       5.268073 
      8       5.306196 
      8       5.359973 
      8       5.373066 
      8       5.377970 
      8       5.402680 
      8       5.514307 
      8       5.663985 
      8       5.707923 
      8       5.700370 
      8       5.754107 
      8       5.811519 
      8       5.748731 
      8       5.613009 
      9       5.586513 
      9       5.669854 
      9       5.666643 
      9       5.564556 
      9       5.492285 
      9       5.482536 
      9       5.499009 
      9       5.521477 
      9       5.527679 
      9       5.540275 
      9       5.519622 
      9       5.484697 
      9       5.476600 
      9       5.473456 
      9       5.464956 
      9       5.425921 
      9       5.395965 
      9       5.425921 
      9       5.464983 
      9       5.474396 
      9       5.489266 
      9       5.557898 
      9       5.737659 
      9       5.964902 
      9       6.159929 
      9       6.292504 
      9       6.314858 
      9       6.266744 
      9       6.040549 
      9       5.240628 
      9       3.572468 
      9       1.782117 
      9       1.309779 
      9       1.779675 
      9       2.076900 
      9       1.851273 
      9       1.249870 
      9       0.539917 
      9       -0.035208 
      9       -0.382785 
      9       -0.573392 
      9       -0.742671 
      9       -0.936231 
      9       -1.022056 
      10       -1.022921 
      10       -1.162951 
      10       -1.313003 
      10       -1.334844 
      10       -1.282157 
      10       -1.239864 
      10       -1.202436 
      10       -1.227321 
      10       -1.212220 
      10       -1.147076 
      10       -1.099791 
      10       -1.108427 
      10       -1.113729 
      10       -1.128983 
      10       -1.121370 
      10       -1.074721 
      10       -1.078419 
      10       -1.128041 
      10       -1.166689 
      10       -1.149571 
      10       -1.174790 
      10       -1.229825 
      10       -1.206089 
      10       -1.175277 
      10       -1.243671 
      10       -1.270689 
      10       -1.176479 
      10       -1.129984 
      10       -1.134354 
      10       -1.151489 
      10       -1.147370 
      10       -1.183760 
      10       -1.280465 
      10       -1.293114 
      10       -1.249598 
      10       -1.249238 
      10       -1.287676 
      10       -1.341110 
      10       -1.326671 
      10       -1.286377 
      10       -1.246067 
      10       -1.233454 
      10       -1.224125 
      10       -1.183261 
      10       -1.219225 
      10       -1.279567 
      10       -1.332649 
      10       -1.359798 
      10       -1.321386 
      10       -1.307917 
      11       -1.350465 
      11       -1.294874 
      11       -1.200857 
      11       -1.218230 
      11       -1.270273 
      11       -1.283663 
      11       -1.290864 
      11       -1.302031 
      11       -1.285944 
      11       -1.202103 
      11       -1.177076 
      11       -1.270207 
      11       -1.322654 
      11       -1.264448 
      11       -1.213304 
      11       -1.251923 
      11       -1.337023 
      11       -1.355838 
      11       -1.289536 
      11       -1.299900 
      11       -1.346839 
      11       -1.299874 
      11       -1.288703 
      11       -1.346839 
      11       -1.311098 
      11       -1.279238 
      11       -1.366179 
      11       -1.390746 
      11       -1.290958 
      11       -1.198077 
      11       -1.228638 
      11       -1.318655 
      11       -1.363465 
      11       -1.339741 
      11       -1.319571 
      11       -1.327655 
      11       -1.319598 
      11       -1.340614 
      11       -1.373833 
      11       -1.348446 
      11       -1.262358 
      11       -1.181256 
      11       -1.213980 
      11       -1.253997 
      11       -1.254929 
      11       -1.231173 
      11       -1.234041 
      11       -1.233147 
      11       -1.198284 
      11       -1.192428 
      11       -1.172115 
      11       -1.113322 
      11       -1.095597 
      11       -1.091202 
      12       -1.063504 
      12       -1.027081 
      12       -1.050135 
      12       -1.079950 
      12       -1.029699 
      12       -0.995503 
      12       -1.044913 
      12       -1.078028 
      12       -1.065428 
      12       -1.072975 
      12       -1.077781 
      12       -1.054108 
      12       -0.972184 
      12       -0.910496 
      12       -0.939158 
      12       -0.943813 
      12       -0.902621 
      12       -0.844564 
      12       -0.804391 
      12       -0.811271 
      12       -0.851576 
      12       -0.837689 
      12       -0.820937 
      12       -0.777644 
      12       -0.699362 
      12       -0.738580 
      12       -0.869454 
      12       -0.929237 
      12       -0.875013 
      12       -0.807841 
      12       -0.772574 
      12       -0.780549 
      12       -0.785861 
      12       -0.775948 
      12       -0.793377 
      12       -0.848043 
      12       -0.832011 
      12       -0.794886 
      12       -0.795340 
      12       -0.792302 
      12       -0.797687 
      12       -0.779927 
      12       -0.784572 
      12       -0.836612 
      12       -0.821103 
      12       -0.728231 
      12       -0.666751 
      12       -0.703205 
      12       -0.739493 
      12       -0.698086 
      12       -0.669274 
      12       -0.678573 
      12       -0.637199 
      12       -0.651273 
      12       -0.701442 
      12       -0.679899 
      12       -0.671268 
      13       -0.675241 
      13       -0.656031 
      13       -0.653530 
      13       -0.666426 
      13       -0.687333 
      13       -0.644473 
      13       -0.585282 
      13       -0.571878 
      13       -0.587427 
      13       -0.622433 
      13       -0.638739 
      13       -0.639094 
      13       -0.630867 
      13       -0.616183 
      13       -0.571404 
      13       -0.536884 
      13       -0.570985 
      13       -0.641152 
      13       -0.674648 
      13       -0.644401 
      13       -0.621952 
      13       -0.629954 
      13       -0.563709 
      13       -0.410798 
      13       -0.321998 
      13       -0.406084 
      13       -0.495211 
      13       -0.484931 
      13       -0.491210 
      13       -0.480459 
      13       -0.455412 
      13       -0.481778 
      13       -0.520536 
      13       -0.542317 
      13       -0.554283 
      13       -0.526896 
      13       -0.485832 
      13       -0.459102 
      13       -0.471011 
      13       -0.482197 
      13       -0.468986 
      13       -0.407494 
      13       -0.359060 
      14       -0.409641 
      14       -0.490619 
      14       -0.497362 
      14       -0.447044 
      14       -0.436473 
      14       -0.443976 
      14       -0.445428 
      14       -0.439989 
      14       -0.437877 
      14       -0.441913 
      14       -0.476989 
      14       -0.511715 
      14       -0.514999 
      14       -0.511699 
      14       -0.500265 
      14       -0.477651 
      14       -0.450991 
      14       -0.444409 
      14       -0.436705 
      14       -0.435598 
      14       -0.433287 
      14       -0.449987 
      14       -0.453286 
      14       -0.417876 
      14       -0.381606 
      14       -0.409869 
      14       -0.436247 
      14       -0.420018 
      14       -0.385588 
      14       -0.397299 
      14       -0.427476 
      14       -0.431177 
      14       -0.429128 
      14       -0.423425 
      14       -0.420177 
      14       -0.409232 
      14       -0.383460 
      15       -0.348545 
      15       -0.360600 
      15       -0.391144 
      15       -0.395235 
      15       -0.394396 
      15       -0.398867 
      15       -0.433522 
      15       -0.458843 
      16       -0.424599 
      16       -0.381735 
      16       -0.370380 
      16       -0.374214 
      16       -0.409090 
      16       -0.434681 
      16       -0.401529 
      16       -0.368709 
      16       -0.394705 
      16       -0.429402 
      16       -0.433496 
      16       -0.431436 
      17       -0.425724 
      17       -0.422891 
      17       -0.417238 
      17       -0.414464 
      17       -0.408044 
      17       -0.395548 
      17       -0.352098 
      17       -0.309108 
      18       -0.298453 
      18       -0.303032 
      18       -0.339471 
      18       -0.375545 
      18       -0.379353 
      18       -0.368022 
      18       -0.325724 
      18       -0.292784 
      18       -0.318662 
      18       -0.344307 
      18       -0.312032 
      18       -0.280107 
      18       -0.306988 
      18       -0.342562 
      18       -0.347525 
      18       -0.346299 
      18       -0.340587 
      18       -0.328793 
      19       -0.286848 
      19       -0.253897 
      19       -0.276108 
      19       -0.293381 
      19       -0.283296 
      19       -0.298278 
      19       -0.312508 
      19       -0.315713 
      19       -0.311557 
      19       -0.309852 
      19       -0.304479 
      19       -0.293019 
      19       -0.250594 
      19       -0.208619 
      20       -0.198969 
      20       -0.204543 
      20       -0.241967 
      20       -0.279042 
      20       -0.284667 
      20       -0.284095 
      20       -0.279856 
      20       -0.278456 
      20       -0.273396 
      20       -0.262273 
      20       -0.221007 
      21       -0.189140 
