

 time    ||    gripping force   ||   raspberry measurement 

      0       0.040000       -795.104167 
      0       0.020000       -795.104167 
      0       0.340000       -795.104167 
      0       0.390000       -795.104167 
      0       0.080000       -795.104167 
      0       0.220000       -795.104167 
      0       0.020000       -795.104167 
      0       0.120000       -795.104167 
      0       0.100000       -795.104167 
      0       0.130000       -795.104162 
      1       0.020000       -787.151952 
      1       0.060000       -779.175234 
      1       0.330000       -775.656359 
      1       0.080000       -732.787948 
      1       0.700000       -540.667719 
      1       3.840000       -223.921377 
      2       15.720000       -31.793091 
      2       45.240000       11.112100 
      2       48.670000       14.653316 
      2       58.760000       14.766402 
      2       68.550000       14.766586 
      2       82.840000       14.768017 
      2       84.530000       14.765719 
      2       83.910000       14.757245 
      2       82.430000       14.718211 
      3       82.020000       14.688228 
      3       81.620000       14.717326 
      3       81.580000       14.746542 
      3       81.470000       14.720549 
      3       81.340000       14.730133 
      3       81.230000       14.940320 
      4       80.320000       15.307976 
      4       80.050000       15.579115 
      4       76.740000       15.749692 
      4       76.650000       16.002489 
      4       76.630000       16.355320 
      5       75.840000       16.591117 
      5       75.190000       16.657082 
      5       74.990000       16.667022 
      5       74.760000       16.660735 
      5       74.680000       16.637991 
      5       74.640000       16.596685 
      5       74.640000       16.574786 
      5       74.550000       16.577887 
      5       74.300000       16.617338 
      5       74.260000       16.657192 
      5       74.210000       16.664832 
      5       74.190000       16.657192 
      5       74.190000       16.617324 
      6       74.090000       16.577417 
      6       74.030000       16.568487 
      6       73.990000       16.561260 
      6       73.340000       16.544733 
      6       73.240000       16.537536 
      6       73.260000       16.593127 
      6       73.200000       16.651819 
      6       73.280000       16.665275 
      6       73.150000       16.667976 
      6       73.170000       16.665692 
      6       73.010000       16.656359 
      6       73.010000       16.607413 
      7       72.930000       16.539861 
      7       72.400000       16.538423 
      7       71.980000       16.608851 
      7       71.790000       16.654920 
      7       71.710000       16.667090 
      7       71.710000       16.665234 
      7       71.690000       16.651336 
      7       71.730000       16.586398 
      7       71.310000       16.497128 
      7       70.150000       16.431764 
      7       69.950000       16.410624 
      8       69.880000       16.449176 
      8       69.870000       16.436150 
      8       69.860000       16.407053 
      8       69.810000       16.420952 
      8       69.800000       16.450948 
      8       69.870000       16.513311 
      8       68.720000       16.554450 
      8       68.210000       16.556345 
      8       67.640000       16.518157 
      8       67.060000       16.487342 
      8       66.680000       16.506526 
      9       66.420000       16.498012 
      9       66.320000       16.436153 
      9       66.340000       16.421837 
      9       66.360000       16.412311 
      9       66.330000       16.328150 
      9       66.330000       16.272532 
      9       66.330000       16.304352 
      9       66.290000       16.307493 
      9       66.350000       16.294514 
      9       66.390000       16.363520 
      9       66.290000       16.488032 
      9       66.240000       16.518110 
      9       66.170000       16.384019 
      9       66.230000       16.220566 
      10       66.170000       16.133923 
      10       66.170000       16.114761 
      10       66.060000       16.091743 
      10       65.670000       16.079312 
      10       65.400000       16.097101 
      10       65.090000       16.137978 
      10       64.530000       16.159890 
      10       63.400000       16.157675 
      10       62.240000       16.129022 
      10       61.750000       16.137496 
      10       61.740000       16.207508 
      10       61.750000       16.239166 
      10       61.800000       16.199938 
      11       61.800000       16.171092 
      11       61.850000       16.235306 
      11       61.840000       16.273275 
      11       61.810000       16.255915 
      11       61.870000       16.194363 
      11       61.820000       16.146601 
      11       61.880000       16.172377 
      11       61.880000       16.153687 
      11       61.860000       16.088104 
      11       61.850000       16.080156 
      11       61.910000       16.023912 
      11       61.900000       15.929588 
      11       61.910000       15.858080 
      11       61.850000       15.849742 
      12       61.930000       15.861663 
      12       61.920000       15.867627 
      12       61.890000       15.867048 
      12       61.910000       15.873859 
      12       61.900000       15.895328 
      12       61.890000       15.921793 
      12       61.900000       15.888158 
      12       61.960000       15.847877 
      12       61.890000       15.893114 
      12       61.910000       15.941021 
      12       61.950000       15.915995 
      12       61.940000       15.877390 
      12       61.920000       15.868903 
      13       61.860000       15.865759 
      13       61.920000       15.857662 
      13       61.920000       15.822724 
      13       61.910000       15.801667 
      13       61.710000       15.810154 
      13       61.010000       15.807066 
      13       60.990000       15.847364 
      13       60.990000       15.902929 
      13       61.050000       15.913266 
      13       61.100000       15.903399 
      13       61.060000       15.853689 
      13       61.020000       15.843405 
      13       61.020000       15.915096 
      13       61.030000       15.984073 
      14       61.040000       16.025379 
      14       61.090000       16.001059 
      14       61.200000       15.933065 
      14       60.990000       15.901614 
      14       61.080000       15.898053 
      14       61.050000       15.842435 
      14       61.020000       15.793654 
      14       61.120000       15.818641 
      14       61.110000       15.856816 
      14       61.000000       15.860320 
      14       61.150000       15.843820 
      14       61.000000       15.826697 
      15       61.100000       15.843390 
      15       61.070000       15.855351 
      15       61.080000       15.837574 
      15       61.090000       15.797558 
      15       60.980000       15.785610 
      15       61.080000       15.827141 
      15       61.050000       15.907038 
      15       61.040000       15.943209 
      15       61.080000       15.907911 
      15       61.030000       15.837535 
      15       61.060000       15.829908 
      15       61.110000       15.868474 
      15       61.040000       15.908324 
      15       61.050000       15.919082 
      15       61.030000       15.861276 
      16       60.990000       15.858202 
      16       61.100000       15.899369 
      16       61.050000       15.901640 
      16       61.030000       15.932582 
      16       61.080000       15.994344 
      16       61.100000       15.985455 
      16       61.000000       15.877860 
      16       60.830000       15.805769 
      16       60.420000       15.848304 
      16       60.300000       15.916838 
      17       60.490000       15.916008 
      17       60.310000       15.902030 
      17       60.380000       15.919622 
      17       60.400000       15.939666 
      17       60.390000       15.958630 
      17       60.400000       15.939640 
      17       60.440000       15.918750 
      17       60.380000       15.891729 
      17       60.360000       15.874786 
      18       60.390000       15.882816 
      18       60.430000       15.935679 
      18       60.380000       15.967060 
      18       60.360000       15.919968 
      18       60.380000       15.879272 
      18       60.380000       15.867504 
      18       60.380000       15.868044 
      18       60.380000       15.865719 
      18       60.370000       15.857259 
      18       60.410000       15.818641 
      18       60.380000       15.793198 
      18       60.370000       15.836619 
      19       60.380000       15.869303 
      19       60.400000       15.846991 
      19       60.340000       15.901130 
      19       60.350000       15.977358 
      19       60.410000       15.932938 
      19       60.390000       15.860030 
      19       60.320000       15.828470 
      19       60.380000       15.848842 
      19       60.420000       15.880004 
      19       60.390000       15.883271 
      19       60.390000       15.850008 
      19       60.360000       15.838421 
      20       60.340000       15.812382 
      20       60.280000       15.777444 
      20       60.460000       15.774343 
      20       60.270000       15.791729 
      20       60.420000       15.819193 
      20       60.400000       15.845039 
      20       60.330000       15.882854 
      20       60.370000       15.880434 
      20       60.380000       15.854201 
      20       60.240000       15.851338 
      20       60.450000       15.883754 
      20       60.290000       15.885403 
      20       60.440000       15.872999 
      21       60.410000       15.867035 
      21       60.270000       15.868057 
      21       60.470000       15.866605 
      21       60.260000       15.868017 
      21       60.450000       15.865745 
      21       60.320000       15.858118 
      21       60.410000       15.828552 
      21       60.340000       15.830794 
      21       60.400000       15.867974 
      21       60.420000       15.836619 
      21       60.280000       15.794514 
      21       60.420000       15.834408 
      22       60.430000       15.924881 
      22       60.350000       15.966174 
      22       60.340000       15.919942 
      22       60.440000       15.879271 
      22       60.350000       15.867505 
      22       60.390000       15.868070 
      22       60.380000       15.866592 
      22       60.310000       15.867587 
      22       60.430000       15.860749 
      22       60.380000       15.838004 
      22       60.370000       15.797101 
      22       60.340000       15.779299 
      23       60.440000       15.791286 
      23       60.330000       15.808838 
      23       60.390000       15.801601 
      23       60.390000       15.821837 
      23       60.300000       15.846864 
      23       60.350000       15.817338 
      23       60.430000       15.788255 
      23       60.390000       15.819097 
      23       60.380000       15.868017 
      23       60.390000       15.913240 
      23       60.370000       15.937423 
      23       60.390000       15.871118 
      24       60.400000       15.812479 
      24       60.350000       15.811511 
      24       60.350000       15.813392 
      24       60.290000       15.882829 
      24       60.330000       15.997529 
      24       60.390000       16.053107 
      24       60.330000       16.055405 
      24       60.030000       16.006928 
      24       59.900000       15.933965 
      24       59.940000       15.907040 
      25       59.910000       15.922680 
      25       59.970000       15.887298 
      25       60.060000       15.837066 
      25       59.780000       15.844290 
      25       59.950000       15.856277 
      25       59.910000       15.848816 
      25       59.830000       15.851351 
      26       59.930000       15.889556 
      26       59.950000       15.914113 
      26       59.850000       15.926266 
      26       59.870000       15.881845 
      26       59.970000       15.807039 
      26       59.950000       15.774773 
      26       59.940000       15.767115 
      26       59.980000       15.768944 
      26       59.910000       15.777403 
      26       59.880000       15.816438 
      27       59.880000       15.846394 
      27       59.920000       15.816438 
      27       59.920000       15.777430 
      27       59.930000       15.769843 
      27       59.920000       15.778317 
      27       59.800000       15.827250 
      27       59.890000       15.895231 
      27       59.900000       15.901625 
      27       59.910000       15.850021 
      27       59.860000       15.820496 
      28       60.010000       15.802097 
      28       59.860000       15.817352 
      28       59.910000       15.833478 
      28       59.980000       15.826280 
      28       59.940000       15.849192 
      28       59.920000       15.884530 
      28       59.870000       15.897113 
      28       59.970000       15.846907 
      29       59.930000       15.807053 
      29       59.900000       15.810154 
      29       59.990000       15.801641 
      29       59.980000       15.821837 
      29       59.830000       15.846837 
      29       59.920000       15.816451 
      29       59.920000       15.777430 
      29       59.880000       15.769816 
      29       59.970000       15.777430 
      30       59.920000       15.816438 
      30       59.900000       15.846394 
      30       59.940000       15.816451 
      30       59.920000       15.777860 
      30       60.000000       15.774786 
      30       59.880000       15.796684 
      30       59.900000       15.837964 
      31       59.980000       15.859863 
      31       59.940000       15.856789 
      31       59.880000       15.818197 
      31       59.950000       15.788228 
      31       59.870000       15.817338 
      31       59.960000       15.846864 
      31       60.010000       15.821837 
      32       59.910000       15.801600 
      32       59.940000       15.808824 
      32       59.920000       15.790829 
      32       59.910000       15.773443 
      32       59.930000       15.767048 
      32       59.930000       15.768030 
      32       59.920000       15.765719 
      32       59.970000       15.757245 
      32       59.900000       15.718211 
      33       59.940000       15.688269 
      33       59.990000       15.718667 
      33       59.860000       15.763074 
      33       59.870000       15.794885 
      33       59.950000       15.827139 
      33       59.870000       15.811468 
      33       59.860000       15.777000 
      33       59.930000       15.769803 
      33       59.900000       15.777430 
      33       59.960000       15.816438 
      33       59.830000       15.846394 
      33       59.940000       15.816438 
      33       59.910000       15.777403 
      34       59.980000       15.768943 
      34       59.820000       15.767075 
      34       59.980000       15.773416 
      34       60.040000       15.789942 
      34       59.910000       15.798013 
      34       59.950000       15.752777 
      34       59.940000       15.737106 
      35       59.920000       15.780088 
      35       59.910000       15.795368 
      35       59.840000       15.816868 
      35       59.870000       15.833424 
      35       59.950000       15.824951 
      35       59.900000       15.832995 
      35       59.890000       15.811925 
      35       59.880000       15.776987 
      35       59.830000       15.768930 
      36       59.910000       15.767075 
      36       59.870000       15.773443 
      36       59.910000       15.790802 
      36       59.820000       15.807951 
      36       59.920000       15.791259 
      36       59.900000       15.779272 
      36       59.830000       15.796215 
      36       59.830000       15.827219 
      36       59.840000       15.812785 
      36       59.890000       15.792754 
      37       59.890000       15.836982 
      37       59.810000       15.872499 
      37       59.950000       15.844622 
      37       59.800000       15.824995 
      37       59.870000       15.820868 
      37       59.870000       15.832592 
      37       59.830000       15.811912 
      37       59.840000       15.776987 
      37       59.860000       15.768944 
      37       59.890000       15.767518 
      38       59.880000       15.778842 
      38       59.840000       15.814999 
      38       59.830000       15.847832 
      38       59.930000       15.815026 
      38       59.800000       15.779715 
      38       59.930000       15.777860 
      38       59.850000       15.811522 
      38       59.870000       15.828039 
      38       59.900000       15.806140 
      38       59.880000       15.817298 
      38       59.860000       15.827662 
      38       59.880000       15.797114 
      38       59.850000       15.790070 
      39       59.870000       15.839679 
      39       59.870000       15.888613 
      39       59.860000       15.849565 
      39       59.840000       15.827666 
      39       59.900000       15.828495 
      39       59.820000       15.795812 
      39       59.850000       15.773886 
      39       59.860000       15.767505 
      39       59.870000       15.773457 
      40       59.880000       15.790842 
      40       59.810000       15.809268 
      40       59.840000       15.807026 
      40       59.860000       15.846907 
      40       59.840000       15.897099 
      40       59.900000       15.884073 
      40       59.860000       15.843363 
      40       59.820000       15.797101 
      40       59.850000       15.773913 
      40       59.800000       15.767062 
      41       59.840000       15.768057 
      41       59.860000       15.766632 
      41       59.860000       15.768917 
      41       59.850000       15.777000 
      41       59.910000       15.812368 
      41       59.880000       15.838394 
      41       59.900000       15.849162 
      42       59.870000       15.873789 
      42       59.840000       15.847390 
      42       59.900000       15.837079 
      42       59.850000       15.884574 
      42       59.820000       15.908297 
      42       59.890000       15.902056 
      42       59.840000       15.841964 
      42       59.890000       15.783286 
      42       59.840000       15.774773 
      42       59.840000       15.790842 
      43       59.880000       15.807938 
      43       59.900000       15.790789 
      43       59.930000       15.772986 
      43       59.790000       15.761219 
      43       59.810000       15.738891 
      44       59.800000       15.707483 
      44       59.890000       15.723167 
      44       59.850000       15.757245 
      44       59.860000       15.760776 
      44       59.840000       15.749219 
      44       59.840000       15.750908 
      44       59.830000       15.783741 
      44       59.830000       15.785403 
      44       59.900000       15.772999 
      44       59.880000       15.767035 
      45       59.850000       15.768057 
      45       59.870000       15.766605 
      45       59.870000       15.768043 
      45       59.880000       15.766605 
      45       59.800000       15.768043 
      45       59.840000       15.766605 
      45       59.780000       15.768057 
      45       59.870000       15.767062 
      45       59.900000       15.773873 
      46       59.890000       15.795771 
      46       59.860000       15.827166 
      46       59.830000       15.811482 
      46       59.800000       15.777417 
      46       59.830000       15.774316 
      46       59.870000       15.790829 
      46       59.790000       15.807938 
      46       59.830000       15.790802 
      47       59.890000       15.773443 
      47       59.810000       15.767048 
      47       59.830000       15.768057 
      47       59.830000       15.766592 
      47       59.860000       15.767587 
      47       59.800000       15.760749 
      47       59.860000       15.737991 
      47       59.880000       15.696658 
      47       59.810000       15.673900 
      47       59.850000       15.667089 
      47       59.840000       15.668943 
      47       59.840000       15.677403 
      48       59.830000       15.716438 
      48       59.810000       15.746421 
      48       59.820000       15.717351 
      48       59.820000       15.689101 
      48       59.860000       15.728579 
      48       59.830000       15.800670 
      48       59.790000       15.826280 
      48       59.810000       15.795771 
      48       59.870000       15.774758 
      49       59.800000       15.777846 
      49       59.860000       15.815995 
      49       59.790000       15.840565 
      49       59.830000       15.787271 
      49       59.870000       15.718281 
      49       59.810000       15.724066 
      49       59.830000       15.757702 
      49       59.840000       15.765759 
      49       59.820000       15.768890 
      49       59.820000       15.776973 
      50       59.840000       15.811468 
      50       59.890000       15.827166 
      50       59.770000       15.795771 
      50       59.820000       15.773886 
      50       59.860000       15.767491 
      50       59.780000       15.773000 
      50       59.760000       15.784973 
      50       59.840000       15.778772 
      51       59.930000       15.731680 
      51       59.740000       15.728579 
      51       59.850000       15.758132 
      51       59.720000       15.766189 
      51       59.870000       15.773416 
      51       59.880000       15.790802 
      51       59.760000       15.807938 
      51       59.810000       15.790802 
      51       59.790000       15.773443 
      52       59.740000       15.767088 
      52       59.820000       15.769386 
      52       59.920000       15.782803 
      52       59.690000       15.840635 
      52       59.890000       15.886288 
      52       59.770000       15.840648 
      52       59.770000       15.783246 
      53       59.900000       15.774786 
      53       59.740000       15.791285 
      53       59.920000       15.813310 
      53       59.810000       15.814113 
      53       59.890000       15.802552 
      53       59.750000       15.743294 
      53       59.850000       15.699067 
      53       59.900000       15.742851 
      53       59.770000       15.797153 
      53       59.870000       15.789943 
      54       59.860000       15.774289 
      54       59.810000       15.777416 
      54       59.870000       15.811482 
      54       59.860000       15.827166 
      54       59.860000       15.795798 
      54       59.870000       15.774746 
      54       59.820000       15.777430 
      54       59.800000       15.811482 
      55       59.730000       15.827139 
      55       59.640000       15.794885 
      55       59.850000       15.763074 
      55       59.790000       15.718667 
      55       59.860000       15.688269 
      55       59.790000       15.718211 
      55       59.850000       15.757245 
      55       59.860000       15.765719 
      56       59.830000       15.768017 
      56       59.870000       15.766591 
      56       59.810000       15.767601 
      56       59.880000       15.761233 
      56       59.790000       15.744720 
      56       59.820000       15.737079 
      56       59.770000       15.787272 
      56       59.840000       15.821780 
      56       59.840000       15.795771 
      56       59.860000       15.779258 
      57       59.760000       15.791258 
      57       59.810000       15.807951 
      57       59.800000       15.790802 
      57       59.840000       15.773443 
      57       59.820000       15.767048 
      57       59.830000       15.768057 
      57       59.860000       15.766605 
      57       59.820000       15.768043 
      58       59.840000       15.766605 
      58       59.830000       15.768043 
      58       59.810000       15.766605 
      58       59.860000       15.768057 
      58       59.830000       15.767048 
      58       59.820000       15.773443 
      58       59.820000       15.790802 
      58       59.840000       15.807938 
      58       59.830000       15.790802 
      58       59.840000       15.773443 
      59       59.790000       15.767048 
      59       59.900000       15.768057 
      59       59.860000       15.766605 
      59       59.870000       15.768017 
      59       59.830000       15.765745 
      59       59.820000       15.758118 
      60       59.810000       15.728579 
      60       59.840000       15.731680 
      60       59.770000       15.778772 
      60       59.820000       15.784973 
      60       59.730000       15.772986 
      60       59.850000       15.767035 
      60       59.780000       15.768057 
      61       59.810000       15.766605 
