Human trial picking the raspberry twin 

 time    ||     output     ||     loadcell

      0.000000       -797.956250       0.090000 
      0.017254       -797.956250       0.140000 
      0.031211       -797.956250       0.040000 
      0.047000       -797.956250       0.120000 
      0.062476       -797.956250       0.000000 
      0.078168       -797.956250       0.100000 
      0.092227       -797.956250       0.010000 
      0.109267       -797.956250       0.100000 
      0.124641       -797.956250       0.170000 
      0.138772       -797.956245       0.140000 
      0.154243       -797.955059       0.170000 
      0.170468       -797.848276       0.090000 
      0.185839       -794.312091       0.040000 
      0.200929       -751.232268       0.080000 
      0.217385       -558.158858       0.070000 
      0.232401       -239.823585       0.050000 
      0.246991       -46.734491       0.040000 
      0.263306       -3.651984       0.070000 
      0.278274       -0.118470       0.050000 
      0.292210       -0.026954       0.060000 
      0.309339       -0.021229       0.020000 
      0.324351       0.008719       0.000000 
      0.339265       0.012828       0.000000 
      0.353984       -0.007395       0.010000 
      0.369428       -0.028850       0.080000 
      0.386045       -0.041433       0.100000 
      0.400408       -0.005083       0.080000 
      0.417088       0.032943       0.040000 
      0.432039       0.042868       0.180000 
      0.447185       0.043727       0.150000 
      0.462266       0.043741       0.010000 
      0.478203       0.043311       0.010000 
      0.494301       0.038355       0.050000 
      0.509210       0.019544       0.090000 
      0.524222       0.003417       0.100000 
      0.539658       0.014131       0.010000 
      0.554940       0.013258       0.000000 
      0.570442       -0.007838       0.020000 
      0.584736       -0.034706       0.140000 
      0.601426       -0.071473       0.090000 
      0.617526       -0.074587       0.090000 
      0.633065       -0.055802       0.010000 
      0.648393       -0.032478       0.020000 
      0.663269       -0.016365       0.060000 
      0.679519       -0.032049       0.030000 
      0.694761       -0.050833       0.110000 
      0.711288       -0.055360       0.130000 
      0.726918       -0.050846       0.000000 
      0.741878       -0.032478       0.030000 
      0.756899       -0.021307       0.060000 
      0.772087       -0.050847       0.090000 
      0.787716       -0.066544       0.020000 
      0.802818       -0.040105       0.010000 
      0.818638       -0.037421       0.030000 
      0.832721       -0.050846       0.010000 
      0.849371       -0.050403       0.060000 
      0.865527       -0.031579       0.000000 
      0.880845       -0.010509       0.050000 
      0.894875       -0.002439       0.000000 
      0.910472       0.013688       0.060000 
      0.927400       0.013701       0.120000 
      0.944093       -0.001982       0.020000 
      0.959013       -0.004653       0.060000 
      0.973995       -0.001539       0.080000 
      0.990416       0.019114       0.070000 
      1.006039       0.038315       0.080000 
      1.021170       0.042424       0.100000 
      1.036435       0.032929       0.050000 
      1.051690       -0.005110       0.030000 
      1.066532       -0.042320       0.100000 
      1.083325       -0.039635       0.010000 
      1.099134       -0.055346       0.160000 
      1.114232       -0.061574       0.130000 
      1.128820       -0.015921       0.030000 
      1.144951       0.002473       0.030000 
      1.160484       -0.026636       0.020000 
      1.175856       -0.044561       0.000000 
      1.191872       -0.025736       0.030000 
      1.205956       0.013715       0.020000 
      1.220951       0.037872       0.120000 
      1.237223       0.042398       0.030000 
      1.251616       0.032499       0.030000 
      1.267166       -0.010039       0.020000 
      1.283322       -0.060231       0.040000 
      1.313416       -0.044547       0.020000 
      1.328268       0.008316       0.080000 
      1.343235       0.032056       0.000000 
      1.359437       0.018644       0.040000 
      1.375285       -0.001553       0.120000 
      1.389969       -0.004640       0.030000 
      1.405206       -0.001553       0.140000 
      1.421578       0.018657       0.200000 
      1.437127       0.032486       0.140000 
      1.452166       0.013258       0.110000 
      1.467246       -0.026193       0.070000 
      1.482381       -0.049933       0.080000 
      1.498013       -0.049933       0.040000 
      1.512969       -0.026179       0.080000 
      1.528284       0.013688       0.000000 
      1.543406       0.037455       0.100000 
      1.559189       0.037885       0.080000 
      1.575162       0.019100       0.050000 
      1.590692       -0.001539       0.000000 
      1.606175       -0.004640       0.050000 
      1.621159       -0.001539       0.220000 
      1.637235       0.019114       0.200000 
      1.652393       0.038328       0.070000 
      1.667275       0.042867       0.050000 
      1.683170       0.038315       0.170000 
      1.698271       0.018671       0.110000 
      1.713228       -0.006938       0.010000 
      1.729141       -0.028851       0.300000 
      1.745556       -0.041917       0.060000 
      1.759809       -0.011825       0.300000 
      1.775761       -0.007895       0.020000 
      1.791493       -0.075044       0.400000 
      1.806405       -0.125236       0.080000 
      1.821589       -0.084956       0.440000 
      1.837531       -0.046391       0.250000 
      1.852320       -0.054474       0.300000 
      1.868739       -0.064759       0.180000 
      1.883286       -0.100653       0.260000 
      1.899420       -0.109982       0.200000 
      1.915339       -0.061685       0.320000 
      1.929404       -0.028479       0.270000 
      1.945794       -0.067943       0.030000 
      1.960753       -0.144534       0.200000 
      1.976828       -0.183555       0.080000 
      1.993403       -0.144951       0.290000 
      2.008789       -0.072443       0.250000 
      2.024152       -0.041462       0.440000 
      2.040110       -0.048646       0.210000 
      2.055184       -0.040119       0.480000 
      2.069344       -0.055816       0.220000 
      2.085683       -0.067403       0.310000 
      2.100943       -0.045074       0.030000 
      2.115089       -0.056219       0.350000 
      2.131206       -0.066530       0.050000 
      2.146028       -0.034290       0.250000 
      2.161176       -0.008268       0.010000 
      2.177435       0.007859       0.260000 
      2.193214       -0.010079       0.040000 
      2.207939       -0.036921       0.250000 
      2.224070       -0.010066       0.300000 
      2.241043       0.008316       0.360000 
      2.254845       -0.002439       0.160000 
      2.269825       -0.005137       0.410000 
      2.285790       -0.007825       0.170000 
      2.300856       -0.015895       0.440000 
      2.316042       -0.050390       0.120000 
      2.331244       -0.066101       0.260000 
      2.348181       -0.035149       0.080000 
      2.363580       -0.018623       0.340000 
      2.379186       -0.035149       0.050000 
      2.395072       -0.066127       0.280000 
      2.409996       -0.051276       0.080000 
      2.426181       -0.026693       0.290000 
      2.441182       -0.056219       0.060000 
      2.457244       -0.084912       0.190000 
      2.472274       -0.050404       0.020000 
      2.488097       0.002447       0.160000 
      2.503607       0.006973       0.040000 
      2.518633       -0.031632       0.170000 
      2.533732       -0.069645       0.050000 
      2.549733       -0.076899       0.120000 
      2.565434       -0.065162       0.040000 
      2.581394       -0.082285       0.030000 
      2.597645       -0.093855       0.020000 
      2.613072       -0.071970       0.030000 
      2.628418       -0.022610       0.060000 
      2.643581       -0.026706       0.020000 
      2.659655       -0.085342       0.000000 
      2.675192       -0.084912       0.050000 
      2.690478       -0.021281       0.070000 
      2.706118       0.002474       0.160000 
      2.721044       -0.021250       0.050000 
      2.737009       -0.020364       0.040000 
      2.752630       0.014131       0.180000 
      2.767389       0.037012       0.120000 
      2.783099       0.032043       0.040000 
      2.799560       -0.010509       0.090000 
      2.814843       -0.066074       0.050000 
      2.829667       -0.074157       0.070000 
      2.845286       -0.056219       0.040000 
      2.860993       -0.037448       0.040000 
      2.876200       -0.035619       0.020000 
      2.892226       -0.053575       0.100000 
      2.908005       -0.064302       0.070000 
      2.923009       -0.095683       0.100000 
      2.938155       -0.090727       0.070000 
      2.953695       -0.040119       0.090000 
      2.969006       -0.013680       0.050000 
      2.984133       -0.011395       0.130000 
      3.001176       -0.031176       0.010000 
      3.016889       -0.045448       0.190000 
      3.031996       -0.032062       0.020000 
      3.047129       -0.022194       0.110000 
      3.062239       -0.062101       0.000000 
      3.079113       -0.120767       0.050000 
      3.094335       -0.149060       0.000000 
      3.109791       -0.144964       0.120000 
      3.124790       -0.107381       0.010000 
      3.140631       -0.070601       0.020000 
      3.156713       -0.077785       0.050000 
      3.171788       -0.075057       0.070000 
      3.185880       -0.055829       0.010000 
      3.202198       -0.032908       0.060000 
      3.216900       -0.021307       0.080000 
      3.233773       -0.050390       0.010000 
      3.249617       -0.060701       0.050000 
      3.280314       -0.010496       0.030000 
      3.296233       0.027114       0.040000 
      3.311101       0.018657       0.020000 
      3.327157       0.003819       0.060000 
      3.341381       0.019074       0.020000 
      3.357277       0.031626       0.150000 
      3.372500       0.002903       0.090000 
      3.388711       -0.069215       0.060000 
      3.403215       -0.106425       0.100000 
      3.420184       -0.069688       0.150000 
      3.434394       -0.067030       0.200000 
      3.450669       -0.091614       0.170000 
      3.466253       -0.079570       0.030000 
      3.480931       -0.055789       0.310000 
      3.496929       -0.027092       0.120000 
      3.512649       0.007846       0.110000 
      3.528643       0.008302       0.080000 
      3.543427       -0.020794       0.250000 
      3.559551       -0.020351       0.110000 
      3.590176       0.014131       0.130000 
      3.606120       0.037025       0.190000 
      3.621173       0.032486       0.050000 
      3.637190       -0.005110       0.100000 
      3.652188       -0.041890       0.050000 
      3.668146       -0.034706       0.000000 
      3.684103       -0.037434       0.030000 
      3.700060       -0.056662       0.160000 
      3.716018       -0.079570       0.130000 
      3.731975       -0.090714       0.130000 
      3.748116       -0.055789       0.010000 
      3.763051       -0.015895       0.120000 
      3.777070       -0.002439       0.030000 
      3.794024       0.019074       0.110000 
      3.809983       0.037884       0.090000 
      3.825075       0.037428       0.010000 
      3.842036       0.012801       0.040000 
      3.856989       -0.037004       0.020000 
      3.870952       -0.099214       0.060000 
      3.887009       -0.140547       0.090000 
      3.904864       -0.123867       0.050000 
      3.919076       -0.088126       0.050000 
      3.933026       -0.065176       0.040000 
      3.948117       -0.071540       0.090000 
      3.964576       -0.046348       0.070000 
      3.980119       -0.002966       0.090000 
      3.995079       -0.022194       0.040000 
      4.010262       -0.091184       0.100000 
      4.027914       -0.119451       0.030000 
      4.057348       -0.104197       0.010000 
      4.072275       -0.078228       0.030000 
      4.088952       -0.046847       0.040000 
      4.103857       -0.067044       0.170000 
      4.117867       -0.114951       0.030000 
      4.134317       -0.114951       0.070000 
      4.150557       -0.067017       0.010000 
      4.165784       -0.045934       0.010000 
      4.180942       -0.066571       0.050000 
      4.196528       -0.045904       0.080000 
      4.211640       -0.002509       0.110000 
      4.226486       -0.016768       0.060000 
      4.242679       -0.066100       0.030000 
      4.258257       -0.068758       0.150000 
      4.273998       -0.031579       0.080000 
      4.288952       0.007872       0.140000 
      4.304937       0.013648       0.010000 
      4.321896       0.002060       0.030000 
      4.337515       0.002903       0.000000 
      4.353172       -0.039662       0.160000 
      4.368131       -0.101455       0.040000 
      4.385087       -0.079543       0.110000 
      4.400336       -0.045048       0.040000 
      4.416178       -0.043206       0.050000 
      4.430210       -0.010522       0.070000 
      4.447160       0.008731       0.050000 
      4.463239       0.002503       0.000000 
      4.478160       0.013218       0.000000 
      4.494827       0.002460       0.080000 
      4.509788       -0.056245       0.020000 
      4.525320       -0.114924       0.030000 
      4.542306       -0.124823       0.070000 
      4.558170       -0.104183       0.060000 
      4.572734       -0.072373       0.060000 
      4.588610       -0.016365       0.010000 
      4.604287       0.007819       0.030000 
      4.620879       -0.003339       0.020000 
      4.635718       -0.015908       0.110000 
      4.650736       -0.055360       0.080000 
      4.667213       -0.085771       0.080000 
      4.682358       -0.061202       0.160000 
      4.697891       -0.045948       0.040000 
      4.712940       -0.072829       0.050000 
      4.728260       -0.080456       0.020000 
      4.743852       -0.085386       0.010000 
      4.760459       -0.096140       0.150000 
      4.776017       -0.075500       0.180000 
      4.791581       -0.042833       0.010000 
      4.807718       -0.040535       0.080000 
      4.821793       -0.066128       0.010000 
      4.837367       -0.045918       0.010000 
      4.853618       -0.003396       0.040000 
      4.869238       -0.027579       0.000000 
      4.883268       -0.114938       0.040000 
      4.898589       -0.153946       0.060000 
      4.914150       -0.104223       0.030000 
      4.930291       -0.044606       0.110000 
      4.946449       -0.033435       0.060000 
      4.961714       -0.104250       0.100000 
      4.976592       -0.166004       0.040000 
      4.991770       -0.114592       0.020000 
      5.007444       -0.076847       0.010000 
      5.023570       -0.104750       0.070000 
      5.039687       -0.127452       0.110000 
      5.055739       -0.148245       0.000000 
      5.071416       -0.127398       0.040000 
      5.086113       -0.102978       0.040000 
      5.103134       -0.055264       0.040000 
      5.118817       -0.018246       0.070000 
      5.133525       -0.011812       0.030000 
      5.148557       -0.031189       0.020000 
      5.164558       -0.045448       0.060000 
      5.179312       -0.032035       0.050000 
      5.195769       -0.021294       0.000000 
      5.210240       -0.050833       0.010000 
      5.225374       -0.066101       0.030000 
      5.241780       -0.034706       0.010000 
      5.256794       -0.013224       0.020000 
      5.271918       -0.010952       0.000000 
      5.288134       -0.026220       0.050000 
      5.303140       -0.026650       0.010000 
      5.318825       -0.016365       0.130000 
      5.334885       -0.037891       0.050000 
      5.350797       -0.080872       0.100000 
      5.365580       -0.124836       0.040000 
      5.381067       -0.138678       0.020000 
      5.397366       -0.096140       0.030000 
      5.412256       -0.022181       0.010000 
      5.428667       0.002420       0.160000 
      5.443589       -0.022150       0.100000 
      5.459282       -0.031606       0.050000 
      5.474994       -0.039663       0.070000 
      5.490179       -0.066987       0.040000 
      5.505618       -0.056702       0.040000 
      5.520940       -0.051347       0.040000 
      5.536738       -0.101969       0.020000 
      5.552722       -0.139162       0.050000 
      5.568271       -0.125750       0.010000 
      5.583711       -0.092114       0.040000 
      5.599383       -0.091711       0.010000 
      5.615669       -0.121224       0.050000 
      5.631358       -0.125320       0.060000 
      5.646159       -0.105070       0.060000 
      5.661698       -0.082741       0.020000 
      5.677825       -0.059790       0.010000 
      5.692812       -0.052742       0.030000 
      5.707206       -0.031080       0.060000 
      5.722342       -0.023606       0.030000 
      5.737755       -0.059333       0.110000 
      5.754191       -0.106008       0.040000 
      5.783631       -0.075030       0.040000 
      5.800298       -0.026693       0.000000 
      5.815686       -0.032492       0.160000 
      5.830399       -0.045904       0.150000 
      5.845397       -0.036549       0.050000 
      5.860730       -0.034720       0.070000 
      5.877395       -0.043219       0.070000 
      5.891947       -0.021294       0.030000 
      5.907218       -0.039676       0.120000 
      5.922807       -0.077742       0.100000 
      5.937673       -0.041018       0.060000 
      5.952781       -0.037935       0.000000 
      5.968728       -0.121223       0.050000 
      5.985098       -0.179042       0.090000 
      6.000113       -0.154419       0.050000 
      6.015973       -0.110012       0.020000 
      6.030200       -0.072426       0.110000 
      6.045402       -0.012295       0.120000 
      6.060721       0.016288       0.050000 
      6.077034       -0.029764       0.130000 
      6.092321       -0.076855       0.020000 
      6.107145       -0.040106       0.220000 
      6.122115       -0.027150       0.030000 
      6.137194       -0.073273       0.110000 
      6.153170       -0.104707       0.040000 
      6.168016       -0.132022       0.260000 
      6.183020       -0.161617       0.100000 
      6.199574       -0.204170       0.240000 
      6.215001       -0.235134       0.060000 
      6.230035       -0.193828       0.200000 
      6.245356       -0.118233       0.090000 
      6.260752       -0.072831       0.140000 
      6.277493       -0.094466       0.050000 
      6.292736       -0.153478       0.170000 
      6.307700       -0.204639       0.020000 
      6.323293       -0.163360       0.190000 
      6.338783       -0.068440       0.050000 
      6.353192       -0.016840       0.200000 
      6.369781       -0.086382       0.060000 
      6.385507       -0.237762       0.060000 
      6.401492       -0.259288       0.110000 
      6.417332       -0.140578       0.020000 
      6.433147       -0.114583       0.200000 
      6.449199       -0.185811       0.210000 
      6.463695       -0.203294       0.200000 
      6.479793       -0.136951       0.060000 
      6.494945       -0.081373       0.210000 
      6.510354       -0.096623       0.070000 
      6.526460       -0.086255       0.110000 
      6.543387       -0.026720       0.050000 
      6.559262       -0.022207       0.120000 
      6.574971       -0.067900       0.200000 
      6.591019       -0.085855       0.170000 
      6.606086       -0.114968       0.170000 
      6.620763       -0.160218       0.090000 
      6.636634       -0.139149       0.030000 
      6.652143       -0.067071       0.000000 
      6.669093       -0.023537       0.000000 
      6.683409       -0.043760       0.030000 
      6.699574       -0.104667       0.000000 
      6.715119       -0.160232       0.030000 
      6.729682       -0.149934       0.080000 
      6.745809       -0.115908       0.070000 
      6.760281       -0.108764       0.070000 
      6.777161       -0.117681       0.100000 
      6.792176       -0.171543       0.160000 
      6.808171       -0.257463       0.200000 
      6.823499       -0.269643       0.140000 
      6.838706       -0.164719       0.070000 
      6.853922       -0.084128       0.100000 
      6.871562       -0.081813       0.030000 
      6.884820       -0.091238       0.140000 
      6.900323       -0.061672       0.140000 
      6.914842       -0.046861       0.050000 
      6.931534       -0.084071       0.090000 
      6.946165       -0.134250       0.040000 
      6.963078       -0.189398       0.090000 
      6.979158       -0.185302       0.130000 
      6.994605       -0.120877       0.000000 
      7.010569       -0.093014       0.060000 
      7.025838       -0.107851       0.080000 
      7.039773       -0.128878       0.030000 
      7.056174       -0.141890       0.000000 
      7.071935       -0.110925       0.050000 
      7.086302       -0.096667       0.030000 
      7.102928       -0.121680       0.080000 
      7.118743       -0.126193       0.070000 
      7.132760       -0.114982       0.150000 
      7.149172       -0.120337       0.010000 
      7.164818       -0.091198       0.100000 
      7.179807       -0.021778       0.070000 
      7.194471       0.001560       0.090000 
      7.210639       -0.032519       0.020000 
      7.225176       -0.075070       0.050000 
      7.241604       -0.101512       0.030000 
      7.256129       -0.109569       0.080000 
      7.272986       -0.119920       0.020000 
      7.288658       -0.092057       0.160000 
      7.302911       -0.032133       0.100000 
      7.319079       -0.041448       0.040000 
      7.333647       -0.088540       0.090000 
      7.348938       -0.088526       0.030000 
      7.366077       -0.106925       0.090000 
      7.381612       -0.121223       0.110000 
      7.397538       -0.110066       0.080000 
      7.411816       -0.107395       0.120000 
      7.428393       -0.105970       0.070000 
      7.443672       -0.111948       0.030000 
      7.459806       -0.125198       0.020000 
      7.474336       -0.133044       0.010000 
      7.490551       -0.133724       0.020000 
      7.506790       -0.155000       0.020000 
      7.522758       -0.162864       0.070000 
      7.538386       -0.197109       0.140000 
      7.553491       -0.188873       0.000000 
      7.569590       -0.137044       0.000000 
      7.585166       -0.098856       0.000000 
      7.600827       -0.121750       0.130000 
      7.616230       -0.189855       0.120000 
      7.631713       -0.203683       0.020000 
      7.647137       -0.136548       0.150000 
      7.662257       -0.076860       0.050000 
      7.678154       -0.083251       0.060000 
      7.693890       -0.095668       0.070000 
      7.709352       -0.094010       0.010000 
      7.724811       -0.124811       0.060000 
      7.739211       -0.210950       0.050000 
      7.756068       -0.228310       0.130000 
      7.770427       -0.165727       0.080000 
      7.786412       -0.117641       0.050000 
      7.801500       -0.113277       0.040000 
      7.816882       -0.129764       0.120000 
      7.832900       -0.147290       0.030000 
      7.848622       -0.134706       0.030000 
      7.864574       -0.132048       0.030000 
      7.894766       -0.132465       0.040000 
      7.910714       -0.139702       0.090000 
      7.940649       -0.167404       0.070000 
      7.957093       -0.161228       0.040000 
      7.972348       -0.165175       0.030000 
      7.987546       -0.198411       0.020000 
      8.003561       -0.201912       0.030000 
      8.019904       -0.192623       0.010000 
      8.049712       -0.136909       0.010000 
      8.066628       -0.113321       0.040000 
      8.080533       -0.175474       0.030000 
      8.096200       -0.224806       0.010000 
      8.111291       -0.179570       0.040000 
      8.126303       -0.122650       0.100000 
      8.140475       -0.120423       0.110000 
      8.157423       -0.170198       0.090000 
      8.172617       -0.260675       0.040000 
      8.187862       -0.289801       0.010000 
      8.203962       -0.262973       0.040000 
      8.219333       -0.243206       0.090000 
      8.233945       -0.192597       0.020000 
      8.249196       -0.180970       0.010000 
      8.265189       -0.236948       0.010000 
      8.281484       -0.240075       0.110000 
      8.295233       -0.202510       0.080000 
      8.311330       -0.222623       0.070000 
      8.327394       -0.296596       0.150000 
      8.343184       -0.344064       0.050000 
      8.359350       -0.348577       0.050000 
      8.375476       -0.314898       0.010000 
      8.391070       -0.231632       0.120000 
      8.406271       -0.147747       0.100000 
      8.420852       -0.124962       0.050000 
      8.437360       -0.159790       0.100000 
      8.453492       -0.210535       0.050000 
      8.469699       -0.188913       0.070000 
      8.484459       -0.124975       0.070000 
      8.500340       -0.119054       0.140000 
      8.517282       -0.236561       0.060000 
      8.532383       -0.361905       0.010000 
      8.548023       -0.352576       0.130000 
      8.563123       -0.239635       0.060000 
      8.579644       -0.145076       0.170000 
      8.593930       -0.104322       0.230000 
      8.609163       -0.140576       0.020000 
      8.624647       -0.206009       0.050000 
      8.641218       -0.193828       0.090000 
      8.656623       -0.147346       0.140000 
      8.671985       -0.135996       0.040000 
      8.688593       -0.146886       0.130000 
      8.702699       -0.124352       0.060000 
      8.718944       -0.088624       0.140000 
      8.734191       -0.071932       0.070000 
      8.749866       -0.112875       0.070000 
      8.765159       -0.171431       0.000000 
      8.780746       -0.217763       0.010000 
      8.797732       -0.288929       0.060000 
      8.810775       -0.381717       0.060000 
      8.827013       -0.396971       0.130000 
      8.842948       -0.367858       0.050000 
      8.858167       -0.289372       0.060000 
      8.872530       -0.171141       0.050000 
      8.889245       -0.167931       0.070000 
      8.903771       -0.201536       0.070000 
      8.920178       -0.154001       0.160000 
      8.934129       -0.105681       0.070000 
      8.950370       -0.126207       0.140000 
      8.966039       -0.217706       0.110000 
      8.980103       -0.268704       0.050000 
      8.997056       -0.278173       0.110000 
      9.012237       -0.260205       0.000000 
      9.027226       -0.175527       0.020000 
      9.042342       -0.079656       0.070000 
      9.058369       -0.058586       0.170000 
      9.074274       -0.127536       0.110000 
      9.089874       -0.194837       0.090000 
      9.105595       -0.218012       0.040000 
      9.121027       -0.203367       0.050000 
      9.135684       -0.168290       0.030000 
      9.150956       -0.174295       0.020000 
      9.166821       -0.156150       0.040000 
      9.181766       -0.157728       0.130000 
      9.198053       -0.218482       0.070000 
      9.213424       -0.246815       0.060000 
      9.227197       -0.175987       0.030000 
      9.242522       -0.162602       0.110000 
      9.258728       -0.237834       0.020000 
      9.274849       -0.269228       0.110000 
      9.290407       -0.266131       0.160000 
      9.305939       -0.280872       0.060000 
      9.321981       -0.296556       0.120000 
      9.336143       -0.284512       0.090000 
      9.351412       -0.269645       0.170000 
      9.368095       -0.223992       0.080000 
      9.383095       -0.160760       0.110000 
      9.398413       -0.188584       0.080000 
      9.413990       -0.234206       0.010000 
      9.428662       -0.219908       0.010000 
      9.444804       -0.167071       0.080000 
      9.459933       -0.142804       0.090000 
      9.475077       -0.170685       0.030000 
      9.490248       -0.242750       0.020000 
      9.505219       -0.345016       0.020000 
      9.521751       -0.329223       0.030000 
      9.536161       -0.243320       0.040000 
      9.552270       -0.257149       0.000000 
      9.567986       -0.344074       0.040000 
      9.584447       -0.324820       0.030000 
      9.599185       -0.211452       0.010000 
      9.614449       -0.185431       0.090000 
      9.630093       -0.250444       0.060000 
      9.645053       -0.298338       0.060000 
      9.660016       -0.253132       0.090000 
      9.675004       -0.196198       1.250000 
      9.690972       -0.259417       2.830000 
      9.706268       -0.333749       3.960000 
      9.722181       -0.343218       3.340000 
      9.738062       -0.301942       2.460000 
      9.753021       -0.246404       2.050000 
      9.768980       -0.237944       5.870000 
      9.784543       -0.252619       7.420000 
      9.799472       -0.271544       6.320000 
      9.814459       -0.322552       3.800000 
      9.830323       -0.341376       0.450000 
      9.846116       -0.245921       6.960000 
      9.861105       -0.191782       12.140000 
      9.877169       -0.233322       27.200000 
      9.894012       -0.226300       36.460000 
      9.909003       -0.206913       55.910000 
      9.924956       -0.269315       66.470000 
      9.940915       -0.361046       92.570000 
      9.958290       -0.396098       107.950000 
      9.973249       -0.312186       142.340000 
      9.990293       -0.236091       159.300000 
      10.005261       -0.162461       175.060000 
      10.021300       -0.046015       205.360000 
      10.037228       0.026213       220.400000 
      10.054219       0.042841       250.030000 
      10.068214       0.049611       263.210000 
      10.084698       0.075231       282.370000 
      10.100394       0.133123       288.960000 
      10.116410       0.252394       294.220000 
      10.131633       0.485063       303.890000 
      10.146223       0.766136       309.660000 
      10.162142       0.961193       322.360000 
      10.179068       1.061295       327.890000 
      10.193596       1.216931       335.260000 
      10.209325       1.519598       338.580000 
      10.226350       1.826668       347.940000 
      10.241993       2.019559       351.780000 
      10.258032       2.215669       354.550000 
      10.273896       2.547367       355.430000 
      10.289311       2.917356       354.970000 
      10.305310       3.288523       355.620000 
      10.321557       3.700980       355.220000 
      10.337388       3.960931       350.200000 
      10.352376       4.033787       345.880000 
      10.367943       4.043176       340.500000 
      10.382861       4.043739       330.330000 
      10.398904       4.043754       329.050000 
      10.413831       4.043754       334.320000 
      10.429333       4.043755       338.420000 
      10.444273       4.043809       342.850000 
      10.458486       4.045636       354.720000 
      10.474887       4.069031       361.650000 
      10.490231       4.188303       368.790000 
      10.505995       4.455520       380.780000 
      10.521073       4.762066       384.470000 
      10.536375       4.982319       386.060000 
      10.551124       5.157599       384.280000 
      10.567508       5.370222       381.770000 
      10.583203       5.581309       374.720000 
      10.598395       5.757168       371.940000 
      10.614269       5.879926       367.870000 
      10.629844       5.952225       365.600000 
      10.643904       5.962512       365.450000 
      10.659822       5.954552       369.850000 
      10.675879       5.974237       371.160000 
      10.691430       6.013729       372.350000 
      10.708891       6.038410       372.800000 
      10.722950       6.051008       370.230000 
      10.738724       6.098171       366.780000 
      10.753819       6.246968       361.260000 
      10.768798       6.494474       367.580000 
      10.784348       6.739129       371.940000 
      10.800739       6.891649       365.470000 
      10.816074       6.945431       358.120000 
      10.830992       6.993963       336.890000 
      10.846887       7.032957       328.890000 
      10.863232       7.044319       326.510000 
      10.876937       7.064035       338.350000 
      10.893011       7.169061       346.200000 
      10.909158       7.434370       354.220000 
      10.925363       7.751726       356.680000 
      10.939529       7.937316       358.520000 
      10.954551       8.011364       356.970000 
      10.970554       8.043216       337.940000 
      10.985910       8.067494       316.400000 
      11.000122       8.083635       281.780000 
      11.016017       8.067937       240.870000 
      11.031806       8.048657       88.000000 
      11.046764       8.037026       20.280000 
      11.062761       7.997974       15.110000 
      11.078545       7.907059       5.250000 
      11.094534       7.859537       1.890000 
      11.109139       7.936183       7.150000 
      11.125456       7.998081       13.210000 
      11.141370       8.011460       9.720000 
      11.156550       8.092149       1.290000 
      11.171651       8.290667       1.500000 
      11.186897       8.341217       11.430000 
      11.203388       7.617283       7.490000 
      11.218234       5.541156       0.300000 
      11.233581       2.643215       3.150000 
      11.250132       1.382507       10.610000 
      11.265055       2.417222       6.540000 
      11.281300       3.589582       1.960000 
      11.296227       3.945003       5.440000 
      11.312398       3.815377       10.020000 
      11.328407       3.369263       6.140000 
      11.344288       2.732831       3.160000 
      11.359311       2.021498       3.940000 
      11.375240       1.243339       11.270000 
      11.390554       0.438797       10.150000 
      11.405729       -0.372597       3.800000 
      11.420244       -1.202977       4.950000 
      11.436793       -1.746677       8.110000 
      11.452460       -1.925929       8.680000 
      11.466902       -1.954215       4.710000 
      11.482180       -1.956189       4.100000 
      11.498192       -1.956245       7.090000 
      11.514365       -1.956246       8.840000 
      11.528526       -1.956246       3.830000 
      11.544628       -1.956246       2.440000 
      11.560475       -1.956246       7.040000 
      11.577116       -1.956246       8.400000 
      11.593139       -1.956246       3.620000 
      11.608156       -1.956246       2.890000 
      11.624025       -1.956246       4.820000 
      11.639765       -1.956246       8.200000 
      11.655458       -1.956246       5.870000 
      11.670797       -1.956246       3.870000 
      11.686812       -1.956246       6.100000 
      11.701540       -1.956232       8.680000 
      11.717156       -1.955776       6.020000 
      11.732043       -1.949947       4.180000 
      11.747681       -1.920781       7.240000 
      11.762780       -1.861672       9.290000 
      11.778438       -1.817251       6.050000 
      11.794283       -1.813708       4.560000 
      11.809574       -1.835177       5.270000 
      11.824850       -1.871957       8.510000 
      11.840767       -1.880886       7.360000 
      11.856312       -1.891254       4.040000 
      11.870607       -1.926623       4.960000 
      11.886097       -1.950403       6.910000 
      11.902241       -1.955789       6.130000 
      11.918098       -1.956232       4.360000 
      11.933427       -1.956246       5.140000 
      11.948456       -1.956246       6.820000 
      11.963980       -1.956246       7.270000 
      11.978862       -1.956246       4.340000 
      11.995519       -1.956246       4.320000 
      12.010994       -1.956246       7.270000 
      12.025195       -1.956246       7.360000 
      12.040796       -1.956246       6.030000 
      12.056819       -1.956246       4.920000 
      12.072772       -1.956246       6.300000 
      12.087381       -1.956246       7.650000 
      12.103486       -1.956246       6.260000 
      12.117793       -1.956246       5.200000 
      12.133394       -1.956246       6.730000 
      12.150368       -1.956246       7.750000 
      12.164821       -1.956246       5.990000 
      12.180999       -1.956246       5.150000 
      12.196159       -1.956246       5.430000 
      12.212451       -1.956246       7.290000 
      12.227742       -1.956246       6.700000 
      12.242334       -1.956246       4.650000 
      12.257415       -1.956246       5.120000 
      12.272804       -1.956246       6.190000 
      12.288181       -1.956232       6.510000 
      12.303701       -1.955803       5.300000 
      12.318903       -1.950847       5.120000 
      12.334295       -1.932049       6.380000 
      12.349808       -1.916352       7.040000 
      12.364758       -1.932049       5.350000 
      12.381297       -1.950847       4.880000 
      12.397191       -1.955803       6.910000 
      12.412831       -1.956232       7.240000 
      12.427433       -1.956246       5.350000 
      12.442924       -1.956246       5.300000 
      12.458880       -1.956232       6.250000 
      12.474838       -1.955803       7.200000 
      12.490400       -1.950847       6.240000 
      12.505928       -1.932049       5.770000 
      12.521926       -1.916352       6.420000 
      12.537649       -1.932049       7.060000 
      12.551901       -1.950847       6.150000 
      12.567140       -1.955803       5.480000 
      12.583454       -1.956232       6.380000 
      12.598687       -1.956246       6.890000 
      12.614122       -1.956246       6.680000 
      12.629459       -1.956246       5.190000 
      12.644902       -1.956246       5.330000 
      12.660150       -1.956232       6.810000 
      12.676325       -1.955803       6.490000 
      12.691365       -1.950847       5.620000 
      12.706199       -1.932049       5.580000 
      12.721113       -1.916352       6.500000 
      12.738029       -1.932049       6.450000 
      12.753899       -1.950847       5.710000 
      12.769865       -1.955803       5.960000 
      12.784406       -1.956232       6.710000 
      12.799808       -1.956246       6.920000 
      12.815761       -1.956246       5.950000 
      12.831366       -1.956246       5.780000 
      12.847305       -1.956246       6.650000 
      12.862607       -1.956246       6.780000 
      12.877847       -1.956246       6.470000 
      12.893395       -1.956246       5.720000 
      12.908211       -1.956246       6.020000 
      12.923420       -1.956246       6.790000 
      12.939708       -1.956246       6.410000 
      12.955082       -1.956246       5.780000 
      12.970044       -1.956246       5.850000 
      12.984869       -1.956246       6.480000 
      12.999929       -1.956246       6.640000 
      13.016348       -1.956246       5.720000 
      13.030756       -1.956246       5.650000 
      13.047088       -1.956246       6.690000 
      13.062236       -1.956246       6.680000 
      13.078333       -1.956246       6.060000 
      13.094850       -1.956246       5.890000 
      13.107953       -1.956246       6.480000 
      13.123910       -1.956246       6.460000 
      13.140173       -1.956246       5.940000 
      13.155132       -1.956246       6.020000 
      13.171046       -1.956246       6.510000 
      13.188002       -1.956246       6.490000 
      13.203153       -1.956246       6.100000 
      13.217705       -1.956246       5.800000 
      13.232806       -1.956246       6.380000 
      13.249900       -1.956246       6.600000 
      13.264103       -1.956246       6.040000 
      13.280933       -1.956246       5.690000 
      13.295985       -1.956246       5.860000 
      13.311078       -1.956246       6.510000 
      13.325308       -1.956246       6.450000 
      13.340551       -1.956246       5.730000 
      13.357349       -1.956246       6.020000 
      13.371365       -1.956246       6.430000 
      13.388217       -1.956246       6.220000 
      13.403350       -1.956246       5.900000 
      13.418496       -1.956246       5.860000 
      13.433743       -1.956246       6.490000 
      13.449465       -1.956246       6.520000 
      13.464805       -1.956246       5.930000 
      13.479806       -1.956232       5.940000 
      13.495646       -1.955803       6.240000 
      13.511367       -1.950847       6.540000 
      13.526775       -1.932049       6.270000 
      13.541962       -1.916352       5.940000 
      13.557570       -1.932049       6.190000 
      13.573483       -1.950847       6.450000 
      13.589350       -1.955803       6.170000 
      13.604915       -1.956232       5.970000 
      13.619646       -1.956246       6.270000 
      13.635942       -1.956246       6.460000 
      13.650468       -1.956246       6.020000 
      13.666957       -1.956246       5.900000 
      13.681672       -1.956246       6.120000 
      13.697170       -1.956246       6.210000 
      13.713127       -1.956246       6.140000 
      13.729085       -1.956246       5.950000 
      13.745042       -1.956246       6.070000 
      13.761057       -1.956246       6.360000 
      13.777293       -1.956246       6.320000 
      13.792182       -1.956246       6.150000 
      13.807604       -1.956246       6.010000 
      13.823023       -1.956246       6.340000 
      13.837874       -1.956246       6.380000 
      13.852815       -1.956246       6.110000 
      13.868062       -1.956246       5.920000 
      13.883969       -1.956246       6.320000 
      13.900881       -1.956246       6.470000 
      13.915325       -1.956246       5.950000 
      13.931092       -1.956246       5.860000 
      13.945051       -1.956246       6.090000 
      13.960017       -1.956246       6.450000 
      13.977014       -1.956246       6.140000 
      13.991982       -1.956246       5.820000 
      14.007086       -1.956246       6.290000 
      14.021049       -1.956246       6.490000 
      14.037006       -1.956246       6.030000 
      14.052964       -1.956246       5.800000 
      14.068374       -1.956246       6.350000 
      14.097944       -1.956246       6.220000 
      14.114061       -1.956246       6.070000 
      14.129164       -1.956246       6.120000 
      14.145269       -1.956246       6.300000 
      14.160321       -1.956246       6.280000 
      14.176278       -1.956232       6.100000 
      14.193407       -1.955789       6.150000 
      14.209235       -1.950363       6.260000 
      14.224459       -1.925320       6.320000 
      14.239291       -1.875957       6.090000 
      14.255353       -1.819563       5.990000 
      14.270819       -1.806967       6.210000 
      14.287402       -1.877812       6.400000 
      14.301101       -1.939592       6.120000 
      14.317297       -1.954903       6.030000 
      14.331733       -1.956205       6.230000 
      14.348449       -1.956219       6.360000 
      14.362969       -1.955359       6.180000 
      14.378440       -1.945434       6.050000 
      14.394281       -1.907408       6.250000 
      14.409477       -1.871058       6.390000 
      14.426059       -1.883655       6.210000 
      14.442017       -1.905553       6.060000 
      14.457973       -1.931162       6.180000 
      14.472934       -1.950820       6.280000 
      14.488891       -1.955802       6.250000 
      14.504632       -1.956232       6.160000 
      14.521302       -1.956246       6.220000 
      14.537166       -1.956246       6.240000 
      14.553048       -1.956246       6.160000 
      14.568551       -1.956245       6.080000 
      14.583023       -1.956219       5.980000 
      14.599184       -1.955359       6.180000 
      14.614644       -1.945448       6.340000 
      14.630275       -1.907852       6.280000 
      14.645042       -1.876457       6.120000 
      14.659817       -1.907852       6.140000 
      14.675942       -1.945448       6.240000 
      14.690898       -1.955359       6.210000 
      14.707404       -1.956219       5.930000 
      14.722773       -1.956246       6.070000 
      14.738146       -1.956259       6.240000 
      14.753048       -1.956689       6.200000 
      14.769507       -1.961645       6.040000 
      14.785794       -1.980443       6.200000 
      14.801378       -1.996140       6.300000 
      14.817119       -1.980429       6.150000 
      14.833281       -1.961202       6.030000 
      14.848674       -1.951290       6.020000 
      14.863250       -1.932062       6.330000 
      14.878859       -1.916352       6.360000 
      14.894816       -1.932049       5.970000 
      14.910931       -1.950847       6.010000 
      14.926441       -1.955803       6.340000 
      14.942928       -1.956232       6.180000 
      14.958407       -1.956246       6.070000 
      14.973983       -1.956246       6.110000 
      14.990987       -1.956246       6.320000 
      15.004948       -1.956246       6.120000 
      15.021059       -1.956246       6.000000 
      15.036952       -1.956246       6.200000 
      15.051943       -1.956246       6.300000 
      15.066963       -1.956246       6.200000 
      15.082801       -1.956246       6.130000 
      15.098843       -1.956246       6.270000 
      15.114490       -1.956246       6.310000 
      15.129374       -1.956246       6.130000 
      15.146005       -1.956232       6.060000 
      15.162164       -1.955803       6.210000 
      15.176816       -1.950847       6.280000 
      15.193432       -1.932049       6.210000 
      15.210020       -1.916352       6.180000 
      15.224039       -1.932049       6.140000 
      15.238265       -1.950847       6.220000 
      15.252964       -1.955803       6.210000 
      15.269334       -1.956232       6.150000 
      15.284266       -1.956246       6.210000 
      15.300791       -1.956246       6.250000 
      15.315130       -1.956246       6.060000 
      15.330600       -1.956246       6.020000 
      15.346368       -1.956246       6.120000 
      15.362397       -1.956246       6.160000 
      15.377810       -1.956232       6.090000 
      15.393657       -1.955803       6.180000 
      15.408956       -1.950847       6.200000 
      15.424200       -1.932049       6.080000 
      15.438831       -1.916352       6.110000 
      15.455786       -1.932049       6.340000 
      15.470875       -1.950847       6.220000 
      15.486838       -1.955803       5.910000 
      15.502795       -1.956232       6.020000 
      15.520003       -1.956246       6.160000 
      15.533972       -1.956246       6.280000 
      15.549923       -1.956246       6.120000 
      15.565880       -1.956246       6.140000 
      15.581805       -1.956246       6.230000 
      15.596939       -1.956246       6.180000 
      15.610939       -1.956246       6.120000 
      15.628162       -1.956246       6.090000 
      15.643681       -1.956246       6.240000 
      15.659188       -1.956246       6.180000 
      15.674576       -1.956246       6.100000 
      15.689277       -1.956246       6.120000 
      15.705224       -1.956246       6.230000 
      15.719052       -1.956246       6.310000 
      15.734823       -1.956246       6.050000 
      15.751446       -1.956246       6.040000 
      15.767127       -1.956246       6.310000 
      15.782784       -1.956246       6.270000 
      15.798406       -1.956246       5.910000 
      15.814170       -1.956246       6.090000 
      15.830441       -1.956246       6.220000 
      15.845316       -1.956246       6.130000 
      15.861347       -1.956246       6.010000 
      15.878382       -1.956246       6.180000 
      15.893376       -1.956246       6.240000 
      15.909120       -1.956246       6.070000 
      15.925291       -1.956232       6.020000 
      15.939816       -1.955803       6.270000 
      15.954421       -1.950847       6.350000 
      15.970169       -1.932049       6.200000 
      15.985065       -1.916352       6.020000 
      16.000645       -1.932049       6.120000 
      16.017056       -1.950846       6.190000 
      16.032201       -1.955789       6.150000 
      16.047951       -1.955789       6.180000 
      16.062911       -1.950846       6.240000 
      16.079983       -1.932049       6.170000 
      16.095942       -1.916352       6.080000 
      16.111282       -1.932049       6.050000 
      16.127188       -1.950847       6.200000 
      16.142150       -1.955803       6.150000 
      16.159113       -1.956232       6.160000 
      16.174062       -1.956246       6.230000 
      16.190048       -1.956246       6.220000 
      16.204980       -1.956246       6.060000 
      16.221066       -1.956246       6.140000 
      16.236919       -1.956246       6.350000 
      16.253917       -1.956232       6.210000 
      16.268941       -1.955803       6.080000 
      16.282935       -1.950847       6.170000 
      16.299157       -1.932049       6.290000 
      16.314662       -1.916352       6.220000 
      16.330716       -1.932049       5.980000 
      16.344956       -1.950847       6.030000 
      16.361368       -1.955803       6.400000 
      16.377197       -1.956232       6.230000 
      16.393232       -1.956246       5.990000 
      16.408249       -1.956246       6.150000 
      16.425311       -1.956246       6.230000 
      16.441492       -1.956246       6.100000 
      16.454901       -1.956246       6.010000 
      16.470371       -1.956246       6.320000 
      16.487045       -1.956246       6.190000 
      16.502043       -1.956246       6.010000 
      16.517088       -1.956246       6.170000 
      16.531901       -1.956246       6.240000 
      16.548266       -1.956246       6.160000 
      16.563482       -1.956246       6.000000 
      16.579148       -1.956246       6.270000 
      16.593530       -1.956246       6.300000 
      16.610635       -1.956246       6.240000 
      16.625646       -1.956232       5.960000 
      16.640640       -1.955803       6.220000 
      16.669511       -1.950846       6.010000 
      16.684293       -1.932035       6.050000 
      16.700286       -1.915908       6.350000 
      16.714861       -1.926650       6.270000 
      16.731508       -1.926650       6.190000 
      16.747198       -1.915908       6.180000 
      16.763232       -1.932035       6.290000 
      16.777449       -1.950846       6.130000 
      16.793406       -1.955802       6.050000 
      16.809273       -1.956219       6.090000 
      16.824167       -1.955789       6.240000 
      16.838956       -1.950403       6.090000 
      16.854914       -1.926649       6.060000 
      16.868823       -1.892141       6.180000 
      16.884283       -1.891711       6.300000 
      16.900826       -1.921250       6.080000 
      16.916867       -1.926206       5.990000 
      16.931818       -1.915895       6.210000 
      16.948122       -1.932035       6.280000 
      16.963802       -1.950846       6.040000 
      16.978304       -1.955803       6.050000 
      16.994804       -1.956232       6.160000 
      17.009991       -1.956246       6.260000 
      17.025573       -1.956246       6.020000 
      17.040771       -1.956246       6.130000 
      17.057186       -1.956232       6.280000 
      17.070286       -1.955803       6.250000 
      17.087609       -1.950846       6.020000 
      17.118544       -1.932035       6.250000 
      17.135468       -1.915908       6.220000 
      17.149935       -1.926650       6.030000 
      17.165149       -1.926650       6.130000 
      17.182192       -1.915908       6.250000 
      17.196724       -1.932035       6.070000 
      17.212249       -1.950846       6.050000 
      17.228272       -1.955802       6.340000 
      17.243513       -1.956219       6.290000 
      17.259326       -1.955802       6.120000 
      17.273556       -1.950847       6.080000 
      17.290584       -1.932049       6.130000 
      17.305936       -1.916352       6.120000 
      17.320125       -1.932049       6.060000 
      17.336049       -1.950847       6.080000 
      17.351125       -1.955803       6.280000 
      17.366371       -1.956232       6.120000 
      17.381482       -1.956232       6.060000 
      17.397161       -1.955789       6.150000 
      17.411298       -1.950403       6.350000 
      17.426436       -1.926650       6.130000 
      17.442702       -1.892154       5.940000 
      17.457178       -1.892154       5.960000 
      17.473340       -1.926650       6.250000 
      17.488613       -1.950403       6.150000 
      17.503165       -1.955776       5.970000 
      17.518638       -1.955789       6.160000 
      17.533973       -1.950846       6.250000 
      17.550075       -1.932049       5.970000 
      17.564496       -1.916338       6.030000 
      17.579653       -1.931605       6.300000 
      17.595830       -1.945434       6.280000 
      17.611458       -1.931162       6.090000 
      17.626854       -1.910939       6.040000 
      17.640999       -1.907851       6.260000 
      17.657400       -1.910952       6.340000 
      17.673478       -1.931592       6.050000 
      17.689061       -1.950390       6.050000 
      17.703795       -1.950403       6.250000 
      17.720375       -1.932035       6.150000 
      17.735516       -1.916351       6.110000 
      17.751725       -1.932035       6.250000 
      17.767864       -1.950377       6.250000 
      17.782803       -1.949517       6.070000 
      17.797887       -1.921210       5.960000 
      17.812938       -1.867044       6.240000 
      17.828867       -1.840576       6.200000 
      17.844329       -1.843247       6.080000 
      17.858560       -1.816378       6.150000 
      17.874744       -1.821751       6.320000 
      17.890193       -1.872386       6.070000 
      17.905722       -1.899267       6.130000 
      17.921037       -1.906925       6.190000 
      17.936292       -1.910482       6.250000 
      17.952066       -1.926193       6.100000 
      17.968076       -1.926193       6.010000 
      17.983387       -1.910482       6.250000 
      17.999251       -1.906952       6.210000 
      18.014771       -1.900154       6.180000 
      18.030013       -1.883211       6.100000 
      18.045645       -1.871045       6.190000 
      18.061319       -1.907408       6.250000 
      18.077485       -1.945407       6.030000 
      18.092473       -1.954459       6.110000 
      18.107397       -1.944978       6.250000 
      18.122448       -1.902452       6.140000 
      18.138930       -1.852247       6.030000 
      18.153272       -1.867514       6.160000 
      18.169001       -1.915851       6.200000 
      18.184200       -1.925763       6.140000 
      18.200077       -1.915868       6.100000 
      18.216100       -1.931592       6.150000 
      18.231371       -1.945447       6.140000 
      18.247328       -1.931605       6.150000 
      18.263146       -1.916338       6.190000 
      18.278749       -1.932049       6.160000 
      18.294317       -1.950847       6.100000 
      18.308784       -1.955802       6.030000 
      18.325404       -1.956219       6.200000 
      18.340343       -1.955802       6.160000 
      18.356143       -1.950820       6.110000 
      18.371607       -1.931149       6.090000 
      18.387588       -1.905110       6.240000 
      18.402755       -1.878242       6.250000 
      18.418338       -1.846418       6.040000 
      18.434191       -1.862102       6.150000 
      18.449354       -1.896583       6.260000 
      18.465422       -1.904210       6.100000 
      18.480613       -1.901526       6.010000 
      18.495820       -1.880899       6.440000 
      18.510635       -1.862101       6.410000 
      18.526442       -1.862088       6.050000 
      18.543472       -1.880456       6.090000 
      18.559030       -1.896154       6.160000 
      18.575634       -1.880900       6.230000 
      18.590212       -1.867501       6.090000 
      18.605883       -1.886728       6.210000 
      18.620846       -1.925750       6.190000 
      18.635802       -1.944547       6.140000 
      18.650797       -1.926166       6.260000 
      18.681582       -1.891228       6.240000 
      18.698039       -1.880470       6.150000 
      18.713472       -1.867444       6.020000 
      18.729207       -1.821778       6.280000 
      18.744436       -1.822207       6.240000 
      18.760259       -1.872843       6.200000 
      18.777822       -1.904653       6.160000 
      18.793341       -1.930666       6.140000 
      18.808480       -1.944534       6.110000 
      18.824270       -1.920794       6.090000 
      18.839208       -1.867501       6.260000 
      18.854215       -1.846861       6.170000 
      18.868771       -1.878242       6.190000 
      18.885508       -1.904667       6.210000 
      18.900910       -1.925736       6.130000 
      18.916204       -1.926179       6.040000 
      18.931725       -1.910509       6.110000 
      18.946341       -1.907825       6.310000 
      18.962448       -1.910509       6.240000 
      18.978107       -1.926193       6.100000 
      18.994183       -1.926179       6.170000 
      19.009638       -1.910053       6.270000 
      19.025297       -1.901996       6.250000 
      19.041252       -1.881329       6.070000 
      19.055479       -1.866628       6.230000 
      19.071815       -1.875944       6.290000 
      19.087393       -1.877799       6.190000 
      19.102436       -1.870145       6.120000 
      19.116633       -1.901553       6.010000 
      19.132492       -1.915838       6.230000 
      19.149484       -1.891241       6.190000 
      19.165095       -1.891241       6.140000 
      19.180591       -1.915838       6.170000 
      19.195354       -1.901566       6.210000 
      19.210800       -1.870602       6.110000 
      19.226736       -1.883641       6.050000 
      19.241979       -1.905540       6.030000 
      19.258583       -1.930706       6.250000 
      19.273587       -1.944978       6.340000 
      19.289080       -1.926206       6.090000 
      19.304476       -1.892141       6.050000 
      19.319374       -1.892141       6.200000 
      19.334720       -1.926193       6.180000 
      19.351619       -1.944548       6.180000 
      19.366782       -1.925750       6.210000 
      19.381881       -1.886742       6.220000 
      19.396833       -1.867957       6.240000 
      19.412659       -1.886755       6.210000 
      19.428151       -1.926193       6.210000 
      19.443558       -1.949934       6.270000 
      19.458836       -1.949947       6.240000 
      19.473991       -1.926622       6.210000 
      19.490704       -1.891684       6.180000 
      19.506120       -1.885869       6.280000 
      19.521254       -1.891641       6.250000 
      19.567135       -1.861658       6.210000 
      19.583295       -1.845948       6.330000 
      19.598872       -1.872399       6.220000 
      19.614037       -1.875500       6.160000 
      19.629213       -1.866588       6.160000 
      19.645748       -1.880429       6.110000 
      19.659968       -1.890741       6.160000 
      19.674956       -1.855816       6.280000 
      19.692021       -1.816808       6.310000 
      19.706688       -1.814137       6.220000 
      19.722737       -1.840575       6.200000 
      19.754081       -1.896140       6.130000 
      19.770356       -1.920337       6.160000 
      19.785350       -1.910039       6.210000 
      19.800147       -1.907368       6.190000 
      19.815109       -1.905110       6.200000 
      19.831225       -1.902009       6.200000 
      19.845183       -1.886729       6.260000 
      19.861602       -1.891268       6.250000 
      19.877638       -1.921224       6.250000 
      19.892774       -1.925763       6.290000 
      19.907597       -1.910482       6.230000 
      19.922722       -1.907381       6.200000 
      19.938073       -1.905096       6.170000 
      19.952994       -1.901539       6.150000 
      19.967953       -1.880443       6.160000 
      19.983910       -1.856246       6.180000 
      20.000825       -1.832062       6.230000 
      20.015794       -1.811423       6.230000 
      20.031295       -1.813707       6.170000 
      20.047364       -1.840992       6.180000 
      20.062438       -1.901109       6.140000 
      20.078855       -1.939578       6.080000 
      20.094265       -1.931135       6.050000 
      20.109580       -1.915855       5.980000 
      20.124539       -1.925763       6.040000 
      20.140143       -1.915851       5.930000 
      20.156072       -1.867501       5.970000 
      20.172089       -1.851790       5.990000 
      20.202200       -1.896610       5.900000 
      20.217209       -1.915408       5.860000 
      20.233963       -1.891255       5.990000 
      20.249793       -1.892128       5.970000 
      20.264111       -1.926649       5.910000 
      20.279099       -1.950390       5.950000 
      20.294806       -1.955332       5.850000 
      20.309779       -1.950376       6.050000 
      20.326434       -1.926193       5.950000 
      20.342104       -1.886312       5.880000 
      20.357563       -1.862558       6.020000 
      20.372358       -1.862558       5.960000 
      20.387264       -1.886299       5.850000 
      20.402459       -1.925750       5.940000 
      20.418062       -1.944964       5.930000 
      20.434097       -1.930692       5.970000 
      20.449648       -1.905083       5.890000 
      20.465542       -1.877812       5.870000 
      20.480349       -1.841462       5.960000 
      20.496233       -1.843290       5.960000 
      20.510029       -1.880416       5.900000 
      20.527206       -1.913595       5.960000 
      20.542207       -1.884442       5.970000 
      20.558124       -1.786769       5.890000 
      20.573624       -1.710151       5.840000 
      20.589793       -1.728506       5.850000 
      20.605096       -1.820377       5.900000 
      20.619846       -1.879030       5.920000 
      20.636240       -1.854903       5.890000 
      20.651762       -1.816781       5.870000 
      20.666980       -1.814137       5.910000 
      20.682681       -1.840549       5.860000 
      20.698238       -1.895254       5.820000 
      20.712894       -1.909539       5.840000 
      20.729697       -1.861645       5.880000 
      20.745224       -1.827593       5.870000 
      20.759392       -1.857145       5.910000 
      20.774981       -1.896167       5.820000 
      20.791814       -1.904654       5.850000 
      20.820834       -1.907381       5.800000 
      20.836633       -1.910939       6.010000 
      20.852698       -1.931605       6.010000 
      20.869578       -1.950806       5.920000 
      20.885182       -1.954915       5.770000 
      20.899439       -1.945380       5.770000 
      20.915135       -1.906052       5.700000 
      20.931296       -1.853948       5.760000 
      20.946324       -1.799365       5.750000 
      20.962866       -1.726221       5.790000 
      20.978321       -1.724506       5.780000 
      20.994441       -1.775514       5.730000 
      21.009482       -1.814965       5.750000 
