

 time    ||    gripping force   ||   raspberry measurement 

      0       0.080000       -795.024000 
      0       0.070000       -795.024000 
      0       0.930000       -795.024000 
      0       0.130000       -795.024000 
      0       0.180000       -795.024000 
      0       0.100000       -795.024000 
      0       0.190000       -795.024000 
      0       0.050000       -795.024000 
      0       0.010000       -795.024000 
      1       0.200000       -787.073755 
      1       0.250000       -779.201849 
      1       0.110000       -771.304659 
      1       0.280000       -767.786644 
      1       0.470000       -724.928158 
      1       0.290000       -532.845968 
      1       0.600000       -216.136420 
      1       0.580000       -24.000936 
      1       6.100000       18.901956 
      1       20.310000       22.428887 
      1       45.270000       22.537433 
      1       54.180000       22.537202 
      1       74.760000       22.538645 
      2       90.070000       22.537207 
      2       105.690000       22.538645 
      2       91.920000       22.537207 
      2       82.470000       22.538645 
      2       88.050000       22.537207 
      2       94.680000       22.538619 
      2       95.380000       22.536321 
      2       94.850000       22.527902 
      2       94.460000       22.490694 
      2       94.160000       22.484134 
      3       93.500000       22.633403 
      3       92.610000       22.941024 
      3       92.140000       23.273555 
      3       91.700000       23.584357 
      3       91.690000       23.941958 
      3       91.510000       24.284974 
      3       91.550000       24.358020 
      3       91.460000       24.179429 
      3       91.320000       24.039192 
      3       90.550000       24.137372 
      3       89.950000       24.327388 
      3       89.040000       24.418337 
      3       88.610000       24.443024 
      4       88.510000       24.465419 
      4       88.460000       24.486109 
      4       88.420000       24.423738 
      4       88.430000       24.329331 
      4       86.320000       24.349804 
      4       85.290000       24.419764 
      4       84.900000       24.437675 
      4       84.920000       24.443490 
      4       84.870000       24.388758 
      4       84.900000       24.341360 
      4       84.890000       24.363216 
      4       84.900000       24.317948 
      4       84.900000       24.223879 
      5       84.800000       24.229221 
      5       84.820000       24.282483 
      5       84.780000       24.257014 
      5       84.700000       24.207628 
      5       84.110000       24.214435 
      5       83.020000       24.221023 
      5       82.530000       24.189351 
      5       82.030000       24.151509 
      5       82.090000       24.158829 
      5       82.090000       24.138948 
      5       82.050000       24.055256 
      5       82.040000       23.950278 
      6       82.030000       23.963813 
      6       82.030000       24.046575 
      6       82.060000       24.016149 
      6       82.010000       23.918036 
      6       80.980000       23.900953 
      6       80.310000       23.934575 
      6       80.340000       23.965030 
      6       80.350000       23.990998 
      6       80.310000       23.941192 
      6       80.340000       23.828361 
      6       80.330000       23.755204 
      6       80.150000       23.745428 
      7       79.260000       23.761875 
      7       78.920000       23.783523 
      7       78.900000       23.781088 
      7       78.860000       23.770540 
      7       78.960000       23.770347 
      7       78.930000       23.799663 
      7       78.900000       23.781128 
      7       78.850000       23.755729 
      7       78.690000       23.778058 
      7       78.350000       23.846631 
      7       78.090000       23.867258 
      7       77.880000       23.820153 
      8       77.700000       23.789754 
      8       77.740000       23.756462 
      8       77.610000       23.714072 
      8       77.640000       23.669490 
      8       77.470000       23.666581 
      8       77.370000       23.740751 
      8       77.160000       23.833701 
      8       77.180000       23.828569 
      8       77.030000       23.799222 
      9       76.940000       23.781061 
      9       76.910000       23.753926 
      9       76.890000       23.691900 
      9       76.840000       23.649887 
      9       76.780000       23.637221 
      9       76.810000       23.627888 
      9       76.760000       23.589269 
      9       76.610000       23.564686 
      9       76.660000       23.617979 
      9       76.570000       23.686996 
      10       76.610000       23.682057 
      10       76.610000       23.657917 
      10       75.860000       23.682943 
      10       75.620000       23.697794 
      10       74.980000       23.666360 
      10       74.770000       23.644018 
      10       74.540000       23.631835 
      10       74.440000       23.609519 
      10       74.280000       23.578958 
      11       74.120000       23.604150 
      11       74.010000       23.671702 
      11       73.890000       23.696894 
      11       73.850000       23.666347 
      11       73.820000       23.644474 
      11       73.830000       23.637663 
      12       73.810000       23.638659 
      12       73.840000       23.637207 
      12       73.830000       23.638645 
      12       73.790000       23.637207 
      12       73.780000       23.638645 
      12       73.790000       23.637207 
      12       73.700000       23.638645 
      12       73.720000       23.637207 
      13       73.750000       23.638645 
      13       73.770000       23.637207 
      13       73.580000       23.638645 
      13       73.470000       23.637207 
      13       73.530000       23.638645 
      13       73.400000       23.637207 
      13       73.450000       23.638645 
      13       73.460000       23.637207 
      13       73.400000       23.638645 
      13       73.430000       23.637193 
      14       73.390000       23.638189 
      14       73.380000       23.631378 
      14       73.430000       23.609479 
      14       73.450000       23.578058 
      14       73.390000       23.592896 
      14       73.420000       23.617479 
      14       73.420000       23.587939 
      14       73.390000       23.558803 
      14       73.430000       23.587926 
      15       73.120000       23.617022 
      15       73.080000       23.587040 
      15       73.080000       23.548032 
      15       73.000000       23.540418 
      15       72.990000       23.548032 
      15       72.950000       23.587040 
      15       72.880000       23.617022 
      15       72.930000       23.587926 
      16       72.950000       23.558830 
      16       72.890000       23.588799 
      16       72.420000       23.627391 
      16       72.410000       23.630505 
      16       72.310000       23.609895 
      16       72.300000       23.583484 
      17       72.350000       23.617979 
      17       72.270000       23.668171 
      17       72.280000       23.660531 
      17       72.350000       23.643991 
      17       72.250000       23.636763 
      18       71.730000       23.627860 
      18       71.730000       23.588813 
      19       71.720000       23.558830 
      19       71.720000       23.587926 
      19       71.750000       23.617049 
      19       71.640000       23.587913 
      19       71.720000       23.558374 
      19       71.540000       23.582983 
      19       71.510000       23.598681 
      20       70.140000       23.577198 
      20       70.130000       23.593755 
      20       70.100000       23.628277 
      20       70.030000       23.636334 
      20       69.790000       23.638619 
      21       69.800000       23.637207 
      21       69.830000       23.638659 
      21       69.690000       23.637663 
      21       69.690000       23.644474 
      21       69.770000       23.666373 
      22       69.710000       23.697767 
      22       69.800000       23.682070 
      22       69.710000       23.647575 
      22       69.740000       23.639532 
      23       69.690000       23.637677 
      23       69.710000       23.644045 
      23       69.690000       23.661404 
      24       69.710000       23.678513 
      24       69.670000       23.660518 
      24       69.630000       23.633246 
      25       69.480000       23.589256 
      25       69.350000       23.558870 
      25       69.340000       23.588813 
      25       69.270000       23.627820 
      25       69.310000       23.635434 
      25       69.290000       23.627820 
      25       69.310000       23.588812 
      26       69.250000       23.558857 
      26       69.250000       23.588813 
      27       69.210000       23.627847 
      27       69.220000       23.636321 
      27       69.200000       23.638619 
      27       69.150000       23.637207 
      28       69.080000       23.638659 
      28       69.050000       23.637663 
      29       68.960000       23.644474 
      29       69.070000       23.666373 
      29       68.950000       23.697767 
      29       68.980000       23.682070 
      29       68.910000       23.647575 
      29       68.840000       23.639518 
      29       68.930000       23.637233 
      30       68.880000       23.638619 
      30       68.850000       23.636320 
      30       68.810000       23.627820 
      30       68.840000       23.587926 
      30       68.820000       23.548059 
      30       68.860000       23.540418 
      31       68.840000       23.548032 
      31       68.770000       23.587053 
      32       68.800000       23.617452 
      32       68.770000       23.592868 
      32       68.820000       23.577171 
      32       68.880000       23.598640 
      33       68.840000       23.581654 
      33       68.760000       23.542176 
      33       68.820000       23.515322 
      34       68.860000       23.497366 
      34       68.760000       23.515335 
      34       68.780000       23.542606 
      34       68.800000       23.586597 
      35       68.750000       23.617009 
      35       68.780000       23.587912 
      35       68.800000       23.558374 
      35       68.750000       23.582983 
      36       68.790000       23.598681 
      36       68.750000       23.577172 
      36       68.810000       23.592868 
      36       68.790000       23.617452 
      36       68.800000       23.587053 
      36       68.800000       23.548005 
      37       68.800000       23.539532 
      37       68.750000       23.537260 
      37       68.770000       23.539532 
      37       68.780000       23.548005 
      37       68.730000       23.587039 
      37       68.750000       23.616995 
      38       68.750000       23.587039 
      38       68.830000       23.548005 
      38       68.740000       23.539532 
      38       68.720000       23.537260 
      38       68.750000       23.539532 
      39       68.800000       23.548005 
      39       68.760000       23.587039 
      39       68.720000       23.616995 
      39       68.780000       23.587039 
      40       68.800000       23.548005 
      40       68.810000       23.539532 
      40       68.800000       23.537234 
      40       68.770000       23.538646 
      40       68.770000       23.537234 
      40       68.840000       23.539532 
      40       68.760000       23.548032 
      41       68.770000       23.587926 
      41       68.770000       23.627820 
      41       68.730000       23.636320 
      41       68.780000       23.638592 
      41       68.730000       23.636320 
      41       68.750000       23.627847 
      41       68.770000       23.588813 
      41       68.720000       23.558857 
      41       68.750000       23.588812 
      41       68.760000       23.627820 
      42       68.770000       23.635434 
      42       68.730000       23.627820 
      42       68.800000       23.588812 
      42       68.720000       23.558830 
      42       68.810000       23.587926 
      42       68.830000       23.617049 
      42       68.840000       23.587926 
      42       68.840000       23.558830 
      43       68.760000       23.588812 
      43       68.790000       23.627820 
      43       68.860000       23.635434 
      43       68.760000       23.627820 
      44       68.770000       23.588812 
      44       68.780000       23.558830 
      44       68.840000       23.587926 
      44       68.800000       23.617022 
      44       68.750000       23.587040 
      44       68.780000       23.548005 
      46       69.250000       23.539532 
      46       69.220000       23.537260 
      46       69.240000       23.539532 
      46       69.210000       23.548032 
      47       69.240000       23.587926 
      47       69.280000       23.627794 
      47       69.230000       23.635434 
      47       69.210000       23.627820 
      47       69.270000       23.588812 
      47       69.280000       23.558830 
      47       69.340000       23.587926 
      47       69.320000       23.617022 
      48       69.280000       23.587040 
      48       69.320000       23.548005 
      49       69.210000       23.539532 
      49       69.310000       23.537234 
      49       69.270000       23.538646 
      49       69.350000       23.537207 
      50       69.310000       23.538645 
      50       69.280000       23.537207 
      50       69.600000       23.538646 
      50       69.480000       23.537234 
      51       69.680000       23.539532 
      51       69.720000       23.548005 
      51       69.590000       23.587039 
      51       69.680000       23.616995 
      51       69.650000       23.587039 
      52       69.650000       23.548005 
      52       69.660000       23.539532 
      52       69.650000       23.537234 
      52       69.600000       23.538646 
      53       69.770000       23.537234 
      53       69.680000       23.539532 
      53       69.590000       23.548032 
      53       69.640000       23.587913 
      53       69.710000       23.627364 
      53       69.640000       23.630491 
      54       69.660000       23.609452 
      54       69.670000       23.578084 
      54       69.720000       23.593782 
      54       69.600000       23.628277 
      54       69.720000       23.636334 
      54       69.740000       23.638619 
      55       69.720000       23.637206 
      55       69.700000       23.638619 
      56       69.980000       23.636321 
      56       69.880000       23.627847 
      56       69.910000       23.588813 
      56       69.960000       23.558857 
      56       69.930000       23.588813 
      56       69.910000       23.627860 
      57       69.990000       23.636763 
      57       69.900000       23.643991 
      57       69.920000       23.660517 
      57       69.950000       23.667715 
      57       69.940000       23.612123 
      57       69.930000       23.553458 
      58       69.870000       23.540862 
      58       70.000000       23.548072 
      58       69.930000       23.587926 
      58       69.960000       23.627794 
      58       69.880000       23.635434 
      58       69.930000       23.627794 
      59       70.010000       23.587926 
      59       69.980000       23.548032 
      59       69.850000       23.539532 
      59       69.840000       23.537260 
      60       69.920000       23.539532 
      60       69.900000       23.548032 
