

 time    ||    gripping force   ||   raspberry measurement 

      0       0.140000       -795.120833 
      0       0.190000       -795.120833 
      0       0.610000       -795.120833 
      0       0.060000       -795.120833 
      0       0.140000       -795.120833 
      1       0.170000       -787.169625 
      1       0.110000       -779.297929 
      1       10.470000       -771.504949 
      2       38.410000       -763.789900 
      2       53.870000       -756.151996 
      2       68.330000       -748.589308 
      2       75.360000       -740.998216 
      2       85.790000       -737.479342 
      2       85.130000       -694.610944 
      2       84.560000       -502.491158 
      2       84.230000       -185.750215 
      2       83.770000       6.353900 
      2       83.510000       49.220057 
      2       83.240000       52.747056 
      3       82.500000       52.894622 
      3       82.370000       52.954997 
      3       82.180000       53.073967 
      3       82.080000       53.368013 
      3       81.940000       53.751760 
      3       81.850000       54.095616 
      3       81.610000       54.430998 
      4       79.040000       54.699006 
      4       78.860000       54.819783 
      4       78.550000       54.841741 
      4       78.420000       54.845006 
      4       78.340000       54.843622 
      4       78.240000       54.845061 
      4       78.010000       54.843623 
      4       77.870000       54.845061 
      4       77.770000       54.843622 
      4       77.750000       54.845034 
      4       77.720000       54.842750 
      4       77.650000       54.834693 
      4       77.620000       54.800198 
      4       77.630000       54.784500 
      4       77.580000       54.815868 
      5       77.430000       54.836907 
      5       77.270000       54.833806 
      5       77.120000       54.795188 
      5       76.920000       54.764386 
      5       76.800000       54.784417 
      5       76.800000       54.785412 
      5       76.680000       54.757092 
      5       76.460000       54.766587 
      5       76.230000       54.762864 
      5       75.990000       54.749588 
      5       75.880000       54.738680 
      5       75.720000       54.721750 
      6       75.400000       54.714070 
      6       74.930000       54.763362 
      6       74.350000       54.786643 
      6       73.650000       54.707298 
      6       73.520000       54.592668 
      6       73.470000       54.546849 
      6       73.470000       54.603006 
      6       73.430000       54.687101 
      6       73.310000       54.759819 
      6       72.790000       54.790674 
      6       72.340000       54.804183 
      6       71.730000       54.770547 
      6       71.240000       54.743236 
      6       70.740000       54.779516 
      7       70.510000       54.766459 
      7       70.350000       54.675087 
      7       70.040000       54.595729 
      7       70.030000       54.595281 
      7       69.970000       54.605527 
      7       69.890000       54.582728 
      7       69.860000       54.588903 
      7       69.780000       54.580013 
      7       69.760000       54.527965 
      7       69.800000       54.508312 
      7       69.710000       54.527496 
      7       69.700000       54.573727 
      7       69.350000       54.553907 
      8       68.960000       54.494399 
      8       68.470000       54.500171 
      8       67.670000       54.523921 
      8       66.340000       54.494328 
      8       63.400000       54.464306 
      8       63.480000       54.482643 
      8       63.400000       54.463762 
      8       63.500000       54.358518 
      8       63.560000       54.284971 
      8       63.570000       54.263888 
      8       63.630000       54.244176 
      8       63.590000       54.298828 
      9       63.620000       54.357490 
      9       63.660000       54.307284 
      9       63.630000       54.221297 
      9       63.610000       54.203258 
      9       63.670000       54.214078 
      9       63.620000       54.132382 
      9       63.660000       54.021378 
      9       63.590000       53.980901 
      9       63.640000       53.992638 
      9       63.660000       54.008685 
      9       63.600000       54.068345 
      10       63.660000       54.112169 
      10       63.670000       54.063846 
      10       63.660000       53.995285 
      10       63.640000       54.001084 
      10       63.620000       54.034720 
      10       63.640000       54.042790 
      10       63.720000       54.046350 
      10       63.590000       54.059363 
      10       63.630000       54.111810 
      11       62.950000       54.133736 
      11       62.840000       54.054448 
      11       62.320000       54.006554 
      11       62.400000       54.066102 
      11       62.490000       54.129294 
      11       62.410000       54.152205 
      11       62.470000       54.183033 
      11       62.430000       54.179529 
      11       62.450000       54.127039 
      12       62.440000       54.096640 
      12       62.470000       54.068733 
      12       62.490000       54.050514 
      12       62.390000       54.044953 
      12       62.440000       54.055886 
      12       62.410000       54.092500 
      12       62.370000       54.131578 
      12       62.430000       54.132438 
      12       62.410000       54.169231 
      12       62.390000       54.199214 
      13       62.430000       54.172345 
      13       62.400000       54.150420 
      13       62.350000       54.138210 
      13       61.540000       54.114592 
      13       61.170000       54.068733 
      13       61.210000       54.032575 
      13       61.240000       54.034225 
      13       61.260000       54.090395 
      13       61.280000       54.127385 
      13       61.230000       54.124450 
      13       61.330000       54.116187 
      13       61.220000       54.100666 
      13       61.270000       54.022983 
      14       61.310000       53.967598 
      14       61.270000       53.975475 
      14       61.310000       54.020864 
      14       61.300000       54.066477 
      14       61.330000       54.097871 
      14       61.270000       54.058420 
      14       61.300000       53.984044 
      14       61.290000       53.951790 
      15       61.370000       53.944106 
      15       61.300000       53.945088 
      15       61.330000       53.944066 
      15       61.310000       53.950460 
      15       61.300000       53.967846 
      15       61.320000       53.985828 
      15       61.290000       53.978188 
      15       61.320000       53.993912 
      15       61.280000       54.005513 
      16       61.310000       53.983627 
      16       61.250000       54.000171 
      16       60.730000       54.034666 
      16       60.080000       54.041877 
      16       60.100000       54.034706 
      16       60.110000       54.001500 
      17       60.220000       53.999811 
      17       60.240000       54.077661 
      17       60.250000       54.108195 
      17       60.220000       54.026583 
      17       60.310000       53.962145 
      17       60.260000       53.945435 
      17       60.260000       53.950931 
      17       60.290000       53.972816 
      17       60.250000       54.005083 
      17       60.340000       53.999714 
      18       60.310000       54.007354 
      18       60.300000       54.044951 
      18       60.360000       54.012710 
      18       60.340000       53.959390 
      18       60.340000       53.946391 
      18       60.290000       53.944119 
      18       60.310000       53.950877 
      18       60.320000       53.972332 
      19       60.290000       53.998354 
      19       60.310000       53.959320 
      19       60.290000       53.894869 
      19       60.410000       53.901071 
      19       60.340000       53.934733 
      19       60.350000       53.943193 
      19       60.350000       53.950434 
      19       60.350000       53.967846 
      19       60.320000       53.985828 
      19       60.360000       53.978188 
      19       60.330000       53.993885 
      19       60.330000       54.004627 
      19       60.350000       53.972829 
      20       60.270000       53.951777 
      20       60.310000       53.954877 
      20       60.300000       53.993469 
      20       60.300000       54.023411 
      20       60.360000       53.993455 
      20       60.310000       53.954448 
      20       60.370000       53.946834 
      20       60.300000       53.954474 
      21       60.320000       53.994328 
      21       60.330000       54.033753 
      21       60.340000       54.035994 
      21       60.340000       54.004183 
      21       60.340000       53.925281 
      21       60.300000       53.871128 
      21       60.370000       53.895685 
      21       60.280000       53.934276 
      21       60.340000       53.942736 
      22       60.300000       53.945034 
      22       60.370000       53.943622 
      22       60.290000       53.945061 
      22       60.350000       53.943623 
      22       60.370000       53.945061 
      22       60.320000       53.943623 
      22       60.250000       53.945074 
      22       60.290000       53.944066 
      22       60.330000       53.950460 
      22       60.340000       53.967820 
      23       60.290000       53.984955 
      23       60.320000       53.967820 
      23       60.290000       53.950460 
      23       60.280000       53.944066 
      23       60.300000       53.945074 
      23       60.290000       53.943623 
      23       60.280000       53.945061 
      23       60.260000       53.943623 
      23       60.290000       53.945074 
      24       60.300000       53.944066 
      24       60.280000       53.950474 
      24       60.330000       53.968263 
      24       60.310000       53.990354 
      24       60.290000       53.992017 
      24       60.340000       53.990354 
      24       60.220000       53.968263 
      24       60.290000       53.950474 
      25       60.310000       53.944066 
      25       60.300000       53.945074 
      25       60.270000       53.943623 
      25       60.260000       53.945061 
      25       60.260000       53.943649 
      25       60.330000       53.945934 
      25       60.300000       53.953991 
      25       60.300000       53.988486 
      25       60.280000       54.004197 
      25       60.340000       53.973245 
      26       60.290000       53.956706 
      26       60.360000       53.972803 
      26       60.320000       53.998838 
      26       60.290000       53.965605 
      26       60.270000       53.929864 
      26       60.360000       53.989359 
      26       60.280000       54.038718 
      26       60.320000       53.996986 
      26       60.280000       53.961688 
      27       60.310000       53.969176 
      27       60.290000       53.990811 
      27       60.310000       53.997000 
      27       60.260000       54.010026 
      27       60.330000       53.994342 
      27       60.300000       53.978645 
      27       60.270000       53.991228 
      28       60.300000       53.992044 
      28       60.300000       53.990368 
      28       60.310000       53.968706 
      28       60.310000       53.955873 
      28       60.270000       53.968263 
      28       60.240000       53.984969 
      29       60.270000       53.967847 
      29       60.290000       53.951333 
      29       60.290000       53.954448 
      29       60.350000       53.988956 
      29       60.250000       54.010039 
      29       60.280000       54.002828 
      29       60.320000       54.020380 
      29       60.220000       54.032368 
      29       60.340000       54.014579 
      30       60.210000       53.974119 
      30       60.200000       53.956746 
      30       60.220000       53.973246 
      31       60.240000       54.004197 
      31       60.090000       53.988486 
      31       60.180000       53.953991 
      31       60.240000       53.945934 
      31       60.230000       53.943676 
      31       60.190000       53.945934 
      31       60.190000       53.953991 
      31       60.160000       53.988486 
      31       60.180000       54.004183 
      31       60.180000       53.972789 
      31       60.120000       53.950890 
      32       59.990000       53.944079 
      32       60.080000       53.945075 
      32       60.030000       53.943623 
      32       59.990000       53.945101 
      33       60.040000       53.944979 
      33       60.050000       53.962145 
      33       60.080000       54.027039 
      33       60.020000       54.114024 
      33       60.050000       54.106800 
      33       59.990000       54.058020 
      33       60.050000       54.034653 
      33       60.020000       53.983597 
      33       60.050000       53.906510 
      34       60.090000       53.871988 
      34       59.960000       53.924422 
      34       60.030000       53.993385 
      34       60.020000       53.987600 
      34       60.010000       53.953964 
      34       60.010000       53.945934 
      34       60.080000       53.943689 
      34       60.060000       53.946378 
      34       60.060000       53.959404 
      34       60.070000       54.013140 
      34       60.070000       54.049907 
      34       59.990000       54.026179 
      35       60.030000       54.016311 
      35       60.090000       54.000640 
      35       60.030000       54.008254 
      35       60.020000       54.055333 
      35       60.010000       54.056591 
      35       59.990000       54.025780 
      35       60.010000       54.003271 
      36       60.010000       54.010052 
      36       60.020000       53.988956 
      36       59.980000       53.954461 
      36       60.060000       53.951763 
      36       60.000000       53.972816 
      36       59.980000       54.004183 
      36       59.970000       53.988486 
      36       60.010000       53.953991 
      36       59.960000       53.945948 
      36       60.090000       53.944106 
      36       60.000000       53.950917 
      36       60.010000       53.973662 
      36       60.010000       54.014525 
      37       59.970000       54.031038 
      37       60.010000       54.004183 
      37       60.030000       53.930237 
      37       59.970000       53.890383 
      37       59.990000       53.917238 
      37       60.030000       53.948632 
      37       60.040000       53.993872 
      37       60.020000       54.033766 
      37       60.030000       54.036880 
      37       60.020000       54.015008 
      37       60.010000       53.974588 
      38       60.000000       53.962601 
      38       59.980000       54.003272 
      38       60.020000       54.073271 
      38       60.050000       54.072249 
      38       60.000000       54.009652 
      38       60.010000       53.979491 
      38       60.060000       53.985412 
      38       60.030000       53.962018 
      39       60.030000       53.921294 
      39       59.980000       53.884944 
      39       60.030000       53.900211 
      39       60.050000       53.934693 
      39       60.000000       53.942750 
      39       60.030000       53.945034 
      40       59.960000       53.943623 
      40       59.980000       53.945075 
      40       60.020000       53.944079 
      40       59.960000       53.950890 
      40       60.020000       53.972789 
      40       60.010000       54.004170 
      40       60.020000       53.988030 
      40       59.950000       53.948162 
      40       60.050000       53.916768 
      41       60.000000       53.884541 
      41       60.000000       53.900641 
      41       59.950000       53.940092 
      41       60.000000       53.966987 
      41       60.030000       53.986258 
      41       60.000000       53.984017 
      41       60.070000       54.023051 
      41       59.930000       54.063749 
      41       60.010000       54.017666 
      42       60.040000       53.959847 
      42       59.930000       53.947264 
      42       60.010000       53.954045 
      42       60.020000       53.988943 
      42       60.040000       54.010012 
      42       60.020000       54.001968 
      42       59.960000       54.010456 
      42       60.040000       53.994355 
      42       60.000000       53.978645 
      43       60.010000       53.991228 
      43       60.010000       53.992043 
      43       59.980000       53.990355 
      43       59.990000       53.968263 
      43       59.950000       53.950474 
      43       59.990000       53.944066 
      43       60.010000       53.945075 
      43       60.010000       53.943650 
      43       60.020000       53.945947 
      43       60.050000       53.954421 
      44       59.980000       53.993455 
      44       59.980000       54.023411 
      44       59.970000       53.993455 
      44       59.980000       53.954447 
      44       60.010000       53.946821 
      44       60.020000       53.954018 
      44       59.980000       53.988486 
      44       60.010000       54.004183 
      44       60.010000       53.972816 
      44       60.020000       53.951763 
      45       60.020000       53.954447 
      45       59.940000       53.988500 
      45       59.940000       54.004183 
      45       60.060000       53.972789 
      45       59.970000       53.950890 
      45       59.960000       53.944106 
      45       60.020000       53.945961 
      45       60.030000       53.954421 
      45       59.990000       53.993415 
      45       60.020000       54.022095 
      46       59.880000       53.977715 
      46       60.090000       53.887685 
      46       59.970000       53.856317 
      46       60.060000       53.940992 
      46       60.000000       54.022552 
      46       59.940000       54.036007 
      46       59.960000       54.015841 
      46       59.990000       53.984500 
      46       59.970000       54.000198 
      47       60.070000       54.034693 
      47       59.970000       54.042736 
      47       59.980000       54.044591 
      47       60.010000       54.038223 
      47       59.970000       54.020837 
      47       60.020000       54.002815 
      47       59.920000       54.009153 
      47       60.000000       53.978145 
      47       60.010000       53.905610 
      48       59.950000       53.866146 
      48       59.960000       53.895255 
      48       59.790000       53.934277 
      48       59.820000       53.943179 
      48       59.990000       53.950433 
      48       59.990000       53.967819 
      48       59.970000       53.984955 
      48       59.870000       53.967820 
      48       59.970000       53.950460 
      48       59.920000       53.944066 
      49       59.960000       53.945074 
      49       59.950000       53.943623 
      49       59.970000       53.945061 
      49       59.970000       53.943623 
      49       59.900000       53.945061 
      49       59.960000       53.943623 
      49       59.920000       53.945061 
      49       59.940000       53.943623 
      49       59.960000       53.945061 
      49       59.930000       53.943623 
      49       59.970000       53.945061 
      49       59.940000       53.943609 
      49       59.900000       53.944605 
      50       59.940000       53.937794 
      50       59.940000       53.915921 
      50       59.990000       53.885374 
      50       59.970000       53.910566 
      50       59.960000       53.978158 
      50       59.930000       54.004613 
      50       59.940000       53.988086 
      50       59.960000       54.013112 
      50       59.970000       54.020310 
      51       60.010000       53.956232 
      51       59.880000       53.921724 
      51       60.020000       53.895698 
      51       59.920000       53.884071 
      51       60.000000       53.915452 
      51       59.920000       53.932851 
      52       59.960000       53.926237 
      52       59.910000       53.932881 
      52       59.920000       53.979986 
      52       60.080000       53.983087 
      52       59.960000       53.953548 
      52       59.910000       53.945921 
      52       59.920000       53.943676 
      52       59.980000       53.945934 
      52       59.870000       53.953991 
      52       60.000000       53.988513 
      53       59.920000       54.005056 
      53       60.010000       53.983157 
      53       59.970000       53.994315 
      53       59.960000       54.004653 
      53       60.070000       53.973246 
      53       59.900000       53.956289 
      53       60.050000       53.968276 
      53       60.010000       53.984969 
      53       59.960000       53.967847 
      53       59.980000       53.951333 
      53       59.940000       53.954434 
      54       59.960000       53.988499 
      54       59.920000       54.004183 
      54       59.970000       53.972789 
      54       59.940000       53.950890 
      54       59.930000       53.944079 
      54       60.040000       53.945075 
      54       60.010000       53.943649 
      54       59.970000       53.945934 
      54       60.010000       53.953991 
      54       60.070000       53.988486 
      54       59.960000       54.004183 
      55       59.970000       53.972789 
      55       59.940000       53.950903 
      55       59.940000       53.944522 
      55       60.000000       53.950474 
      55       59.940000       53.967820 
      55       60.010000       53.984955 
      55       59.990000       53.967806 
      55       59.970000       53.950004 
      55       59.920000       53.938237 
      55       59.910000       53.915948 
      55       60.000000       53.885817 
      56       59.950000       53.915965 
      56       59.960000       54.002342 
      56       59.940000       54.044091 
      56       59.980000       54.007758 
      56       60.000000       54.004683 
      56       59.950000       54.024337 
      56       59.980000       53.994355 
      56       59.960000       53.964803 
      56       60.010000       53.989829 
      56       59.930000       54.010066 
      56       59.960000       54.002828 
      57       59.990000       54.020354 
      57       59.930000       54.031481 
      57       59.920000       54.003767 
      57       59.970000       53.925308 
      57       59.980000       53.872445 
      57       59.930000       53.911466 
      57       60.000000       54.002382 
      57       59.940000       54.049920 
      57       59.920000       54.037380 
      57       59.950000       54.069661 
      58       59.980000       54.099201 
      58       59.920000       54.071513 
      58       59.940000       54.041381 
      58       59.970000       54.010996 
      58       59.940000       54.027079 
      58       59.940000       54.066517 
      58       59.920000       54.027065 
      58       59.930000       54.010526 
      58       60.000000       54.035109 
      58       60.020000       54.036921 
      58       59.990000       54.015009 
      58       60.000000       53.974589 
      58       59.950000       53.962628 
      59       59.950000       54.004172 
      59       59.910000       54.084525 
      59       59.950000       54.126498 
      59       59.950000       54.119467 
      59       59.930000       54.096959 
      59       59.990000       54.079986 
      59       59.950000       54.018996 
      59       59.940000       53.959860 
      59       59.980000       53.946404 
      60       59.950000       53.944092 
      60       59.910000       53.950004 
      60       59.990000       53.962004 
      60       59.960000       53.956232 
      60       59.940000       53.914110 
      60       59.920000       53.930237 
      60       59.940000       53.980443 
      60       59.870000       53.991600 
