

 time    ||    gripping force   ||   raspberry measurement 

      0       0.250000       -792.952381 
      0       0.310000       -792.952381 
      0       0.760000       -792.952381 
      0       0.880000       -792.952381 
      1       1.200000       -785.022857 
      1       1.230000       -777.172629 
      1       1.230000       -769.400902 
      1       1.310000       -761.706893 
      1       1.790000       -754.089824 
      1       1.780000       -746.548921 
      2       4.050000       -739.082265 
      2       4.300000       -731.586389 
      2       6.040000       -728.072364 
      2       6.120000       -685.262496 
      2       6.820000       -493.398939 
      2       6.780000       -177.058351 
      4       60.350000       14.821763 
      4       68.450000       57.644642 
      4       77.920000       61.198120 
      4       90.560000       61.334229 
      4       95.970000       61.306312 
      5       97.040000       61.277194 
      5       98.340000       61.306317 
      5       97.740000       61.335413 
      5       97.640000       61.305431 
      5       97.450000       61.266396 
      5       97.220000       61.257923 
      5       97.040000       61.255665 
      5       96.560000       61.258407 
      6       96.440000       61.273220 
      6       96.320000       61.349049 
      6       102.420000       61.489803 
      6       103.060000       61.672279 
      7       102.060000       61.904947 
      7       101.910000       62.122747 
      8       101.010000       62.232672 
      8       100.940000       62.253744 
      8       100.570000       62.256982 
      9       100.360000       62.255597 
      9       100.170000       62.257036 
      9       100.090000       62.255598 
      9       99.920000       62.257036 
      10       99.770000       62.255598 
      10       99.740000       62.257036 
      10       99.640000       62.255598 
      10       99.630000       62.257036 
      10       99.630000       62.255598 
      10       100.370000       62.257036 
      10       100.430000       62.255598 
      11       100.490000       62.257036 
      11       100.410000       62.255598 
      11       100.390000       62.257036 
      11       100.380000       62.255598 
      11       102.290000       62.257036 
      11       102.190000       62.255598 
      12       101.840000       62.257036 
      12       101.750000       62.255598 
      12       101.670000       62.257036 
      12       101.580000       62.255584 
      13       101.500000       62.256593 
      13       101.460000       62.250198 
      13       101.340000       62.232812 
      13       101.380000       62.214817 
      13       101.420000       62.222041 
      13       101.310000       62.201805 
      14       101.200000       62.176805 
      14       101.150000       62.207190 
      14       101.140000       62.246238 
      14       101.180000       62.254711 
      14       101.160000       62.257009 
      14       101.030000       62.255598 
      14       101.020000       62.257036 
      14       101.020000       62.255598 
      14       100.930000       62.257036 
      14       100.910000       62.255598 
      15       100.840000       62.257036 
      15       100.810000       62.255598 
      16       100.450000       62.257036 
      16       100.510000       62.255598 
      16       100.410000       62.257036 
      16       100.450000       62.255598 
      16       100.390000       62.257036 
      16       100.390000       62.255598 
      17       100.390000       62.257036 
      17       100.240000       62.255598 
      17       100.190000       62.257036 
      17       100.100000       62.255598 
      17       100.160000       62.257036 
      17       100.140000       62.255598 
      17       100.140000       62.257036 
      17       100.130000       62.255598 
      18       99.990000       62.257036 
      18       99.990000       62.255598 
      19       99.800000       62.257036 
      19       99.770000       62.255598 
      19       99.720000       62.257036 
      19       99.710000       62.255598 
      20       99.560000       62.257036 
      20       99.610000       62.255584 
      20       99.550000       62.256593 
      20       99.530000       62.250226 
      21       99.500000       62.233726 
      21       99.480000       62.226502 
      21       99.390000       62.281233 
      21       99.390000       62.329987 
      21       99.360000       62.304987 
      21       99.370000       62.266383 
      21       99.280000       62.257922 
      22       99.270000       62.255625 
      22       99.330000       62.257037 
      22       99.310000       62.255598 
      22       99.230000       62.257036 
      22       99.190000       62.255598 
      22       99.180000       62.257036 
      22       99.180000       62.255598 
      23       99.090000       62.257036 
      23       99.160000       62.255598 
      23       99.110000       62.257036 
      24       98.970000       62.255598 
      24       99.000000       62.257036 
      24       98.910000       62.255598 
      24       98.940000       62.257036 
      24       98.960000       62.255598 
      25       98.850000       62.257036 
      25       98.870000       62.255598 
      25       98.830000       62.257036 
      25       98.820000       62.255598 
      25       98.790000       62.257036 
      25       98.800000       62.255598 
      26       99.340000       62.257036 
      26       100.010000       62.255598 
      26       100.970000       62.257036 
      26       101.340000       62.255598 
      26       101.340000       62.257036 
      26       101.380000       62.255598 
      26       101.280000       62.257036 
      26       101.270000       62.255598 
      27       101.270000       62.257036 
      27       101.280000       62.255598 
      27       101.260000       62.257036 
      27       101.240000       62.255598 
      27       101.190000       62.257036 
      27       101.200000       62.255598 
      27       101.270000       62.257036 
      27       101.570000       62.255598 
      27       101.770000       62.257036 
      27       101.780000       62.255584 
      27       101.720000       62.256593 
      27       101.710000       62.250199 
      27       101.710000       62.232839 
      28       101.640000       62.215704 
      28       101.680000       62.232839 
      28       101.630000       62.250199 
      28       101.590000       62.256593 
      28       101.590000       62.255571 
      28       101.480000       62.256593 
      28       101.480000       62.250199 
      29       101.490000       62.232839 
      29       101.480000       62.215730 
      29       101.490000       62.233712 
      29       101.410000       62.260540 
      29       101.370000       62.299132 
      29       101.340000       62.305347 
      29       101.360000       62.236396 
      30       101.270000       62.183950 
      30       101.170000       62.218028 
      31       101.150000       62.289676 
      31       101.150000       62.315246 
      31       101.100000       62.283864 
      31       101.150000       62.252497 
      31       101.140000       62.212629 
      31       101.080000       62.196489 
      31       101.050000       62.227870 
      32       101.090000       62.249769 
      32       101.060000       62.256580 
      32       101.080000       62.255584 
      32       101.050000       62.257036 
      32       101.080000       62.255598 
      32       100.910000       62.257036 
      32       100.900000       62.255598 
      33       100.890000       62.257036 
      33       100.860000       62.255598 
      33       100.860000       62.257036 
      33       100.790000       62.255598 
      33       100.830000       62.257036 
      34       100.810000       62.255598 
      34       100.790000       62.257036 
      34       100.780000       62.255598 
      35       100.710000       62.257036 
      35       100.710000       62.255598 
      35       100.680000       62.257036 
      35       100.690000       62.255598 
      35       100.630000       62.257009 
      35       100.640000       62.254711 
      36       100.600000       62.246238 
      36       100.650000       62.207204 
      36       100.600000       62.177248 
      36       100.590000       62.207204 
      36       100.470000       62.246238 
      36       100.530000       62.254711 
      36       100.530000       62.257009 
      36       100.530000       62.255598 
      37       100.530000       62.257036 
      37       100.490000       62.255584 
      37       100.450000       62.256593 
      37       100.440000       62.250199 
      37       100.430000       62.232839 
      37       100.450000       62.215704 
      37       100.420000       62.232839 
      38       100.400000       62.250185 
      38       100.470000       62.256150 
      38       100.450000       62.250185 
      38       100.350000       62.232839 
      39       100.310000       62.215704 
      39       100.250000       62.232839 
      39       100.290000       62.250199 
      39       100.330000       62.256593 
      39       100.280000       62.255584 
      39       100.300000       62.257036 
      39       100.270000       62.255598 
      40       100.290000       62.257036 
      40       100.250000       62.255598 
      40       100.190000       62.257036 
      40       100.180000       62.255598 
      40       100.180000       62.257036 
      40       100.210000       62.255598 
      40       100.200000       62.257036 
      40       100.200000       62.255598 
      40       100.200000       62.257036 
      40       100.140000       62.255598 
      41       100.170000       62.257036 
      41       100.170000       62.255598 
      41       100.150000       62.257036 
      41       100.080000       62.255598 
      41       100.080000       62.257036 
      42       100.080000       62.255598 
      42       100.010000       62.257037 
      42       99.990000       62.255625 
      42       99.950000       62.257923 
      43       99.990000       62.266396 
      43       99.970000       62.305430 
      43       99.970000       62.335386 
      43       99.920000       62.305430 
      43       99.950000       62.266383 
      44       99.940000       62.257479 
      44       99.850000       62.250226 
      44       99.940000       62.232839 
      44       99.870000       62.215677 
      44       99.900000       62.231940 
      44       99.880000       62.238971 
      44       99.880000       62.203230 
      44       99.860000       62.156568 
      44       99.880000       62.187976 
      45       99.850000       62.241269 
      45       99.840000       62.254282 
      45       99.910000       62.256996 
      45       99.840000       62.255597 
      46       99.730000       62.257036 
      46       99.750000       62.255598 
      46       99.690000       62.257009 
      46       99.730000       62.254711 
      46       99.730000       62.246238 
      46       99.780000       62.207204 
      47       99.660000       62.177248 
      47       99.680000       62.207204 
      47       99.670000       62.246238 
      47       99.700000       62.254711 
      48       99.630000       62.257009 
      48       99.680000       62.255598 
      48       99.560000       62.257036 
      48       99.640000       62.255598 
      49       99.580000       62.257036 
      49       99.620000       62.255598 
      49       99.530000       62.257036 
      49       99.570000       62.255598 
      49       99.580000       62.257036 
      49       99.520000       62.255598 
      50       99.530000       62.257036 
      50       99.550000       62.255598 
      50       99.560000       62.257036 
      50       99.500000       62.255598 
      50       99.520000       62.257036 
      50       99.500000       62.255598 
      50       99.500000       62.257036 
      50       99.500000       62.255598 
      51       99.440000       62.257036 
      51       99.520000       62.255598 
      51       99.470000       62.257036 
      51       99.480000       62.255598 
      51       99.450000       62.257036 
      51       99.440000       62.255598 
      51       99.470000       62.257036 
      51       99.420000       62.255598 
      52       99.420000       62.257036 
      52       99.390000       62.255598 
      52       99.360000       62.257036 
      52       99.390000       62.255598 
      53       99.330000       62.257036 
      53       99.370000       62.255598 
      53       99.350000       62.257036 
      53       99.270000       62.255598 
      53       99.290000       62.257036 
      54       99.310000       62.255598 
      54       99.300000       62.257036 
      54       99.310000       62.255598 
      54       99.310000       62.257036 
      54       99.290000       62.255598 
      55       99.290000       62.257036 
      55       99.290000       62.255598 
      55       99.240000       62.257036 
      55       99.220000       62.255598 
      55       99.240000       62.257036 
      56       99.180000       62.255598 
      56       99.230000       62.257036 
      56       99.210000       62.255598 
      56       99.200000       62.257036 
      56       99.170000       62.255598 
      56       99.230000       62.257036 
      56       99.170000       62.255598 
      57       99.180000       62.257036 
      57       99.160000       62.255598 
      57       99.120000       62.257036 
      58       99.140000       62.255598 
      58       99.110000       62.257036 
      58       99.130000       62.255598 
      58       99.100000       62.257036 
      58       99.110000       62.255598 
      59       99.080000       62.257036 
      59       99.040000       62.255598 
      59       99.050000       62.257036 
      59       99.090000       62.255598 
      59       99.010000       62.257036 
      59       99.050000       62.255598 
      60       99.010000       62.257036 
      60       99.030000       62.255598 
      60       99.070000       62.257036 
      60       99.030000       62.255598 
      60       98.960000       62.257036 
      60       99.010000       62.255598 
      60       98.990000       62.257036 
      60       99.010000       62.255598 
      61       99.030000       62.257036 
