

 time    ||    gripping force   ||   raspberry measurement 

      0       0.090000       -793.950000 
      0       0.060000       -793.950000 
      0       5.530000       -793.950000 
      0       0.260000       -793.950000 
      0       0.060000       -793.950000 
      0       0.110000       -793.950000 
      0       0.080000       -793.950000 
      0       0.050000       -793.950000 
      0       0.180000       -793.950000 
      0       0.290000       -793.949995 
      0       0.160000       -793.948818 
      1       0.330000       -785.904383 
      1       0.210000       -782.393929 
      1       0.280000       -739.628101 
      1       4.120000       -547.967616 
      1       19.780000       -231.979291 
      1       64.980000       -40.311595 
      1       91.190000       2.481544 
      1       118.100000       5.982129 
      2       112.270000       6.087280 
      2       97.450000       6.152062 
      2       95.000000       6.176220 
      2       97.840000       6.092946 
      2       101.900000       6.014500 
      2       103.170000       6.017627 
      2       103.170000       6.048593 
      2       102.580000       6.112753 
      2       102.480000       6.177839 
      2       102.170000       6.242088 
      2       102.080000       6.509504 
      3       101.810000       7.088515 
      3       101.790000       7.776597 
      3       101.640000       8.336909 
      3       101.570000       8.673547 
      3       101.380000       8.611812 
      3       101.270000       8.297058 
      3       100.850000       8.138340 
      3       100.710000       8.160372 
      3       100.370000       8.275488 
      3       99.960000       8.428796 
      3       99.680000       8.469869 
      3       99.390000       8.464804 
      4       99.150000       8.512063 
      4       98.950000       8.570532 
      4       98.940000       8.569040 
      4       98.790000       8.577649 
      4       98.670000       8.536312 
      4       98.580000       8.418485 
      4       98.530000       8.316316 
      4       98.440000       8.292527 
      4       98.380000       8.292474 
      4       98.290000       8.248609 
      4       98.280000       8.301862 
      4       98.140000       8.388803 
      4       97.910000       8.328242 
      4       97.670000       8.236041 
      5       97.620000       8.192849 
      5       97.540000       8.174157 
      5       97.530000       8.113960 
      5       97.450000       8.064319 
      5       97.030000       8.083933 
      5       96.830000       8.099201 
      5       96.600000       8.077718 
      5       96.070000       8.094718 
      5       94.700000       8.134612 
      5       94.180000       8.166007 
      5       94.100000       8.198287 
      6       93.930000       8.183906 
      6       93.700000       8.164305 
      6       93.550000       8.213489 
      6       93.370000       8.267804 
      6       93.340000       8.255625 
      6       92.360000       8.220340 
      7       89.090000       8.198691 
      7       89.010000       8.219910 
      7       88.140000       8.250642 
      7       87.400000       8.248093 
      7       86.600000       8.186094 
      7       86.570000       8.120353 
      7       86.540000       8.068666 
      7       86.460000       8.045034 
      7       86.450000       8.038170 
      8       86.480000       8.039165 
      8       86.290000       8.037713 
      8       86.220000       8.039152 
      8       86.070000       8.037713 
      8       86.080000       8.039125 
      8       86.050000       8.036827 
      9       86.040000       8.028327 
      9       85.980000       7.988433 
      11       85.540000       7.948565 
      11       85.460000       7.940925 
      13       83.230000       7.948538 
      13       83.220000       7.987546 
      13       83.180000       8.017528 
      13       82.940000       7.988432 
      13       83.010000       7.959337 
      14       82.940000       7.989345 
      14       82.980000       8.029226 
      15       82.900000       8.047195 
      15       82.860000       8.082550 
      15       82.720000       8.098273 
      15       82.560000       8.066879 
      15       82.540000       8.044954 
      15       82.450000       8.037296 
      15       82.460000       8.028797 
      16       82.340000       7.994262 
      16       82.370000       7.977704 
      16       82.350000       7.999160 
      16       82.300000       7.982603 
      16       82.320000       7.948082 
      16       82.290000       7.940038 
      19       79.930000       7.938197 
      19       79.870000       7.945008 
      19       79.970000       7.967766 
      19       79.880000       8.009072 
      19       79.880000       8.030971 
      19       79.850000       8.027870 
      19       79.870000       7.988419 
      20       79.880000       7.948538 
      20       79.940000       7.940038 
      20       79.860000       7.937740 
      20       79.780000       7.939152 
      21       79.790000       7.937713 
      21       79.750000       7.939152 
      21       79.830000       7.937713 
      21       79.810000       7.939151 
      22       79.820000       7.937700 
      22       79.810000       7.938695 
      23       79.760000       7.931884 
      23       79.700000       7.909985 
      23       79.730000       7.878591 
      23       79.780000       7.894315 
      23       79.750000       7.929670 
      23       79.730000       7.947665 
      23       79.710000       7.988405 
      23       79.720000       8.028300 
      24       79.660000       8.035940 
      24       79.680000       8.028300 
      25       79.680000       7.988432 
      25       79.660000       7.948538 
      25       79.710000       7.940038 
      25       79.710000       7.937740 
      25       79.640000       7.939152 
      25       79.680000       7.937713 
      25       79.720000       7.939152 
      26       79.640000       7.937713 
      26       79.580000       7.939151 
      27       79.640000       7.937700 
      27       79.670000       7.938709 
      27       79.680000       7.932341 
      27       79.630000       7.915828 
      27       79.600000       7.908187 
      27       79.580000       7.958379 
      27       79.600000       7.992874 
      28       79.560000       7.966423 
      28       79.630000       7.944524 
      28       79.610000       7.932770 
      28       79.600000       7.914968 
      29       79.610000       7.897819 
      29       79.610000       7.914954 
      30       79.600000       7.932301 
      30       79.550000       7.938278 
      30       79.540000       7.932730 
      30       79.580000       7.919897 
      31       79.530000       7.916187 
      31       79.540000       7.925682 
      31       79.530000       7.897389 
      31       79.580000       7.899244 
      32       79.560000       7.929213 
      32       79.500000       7.936853 
      32       79.540000       7.939125 
      33       79.560000       7.937713 
      33       79.540000       7.939152 
      33       79.510000       7.937713 
      33       79.460000       7.939152 
      33       79.490000       7.937713 
      33       79.540000       7.939152 
      33       79.500000       7.937713 
      33       79.550000       7.939152 
      34       79.530000       7.937713 
      34       79.520000       7.939152 
      34       79.540000       7.937740 
      34       79.490000       7.940025 
      34       79.590000       7.948081 
      34       79.520000       7.982577 
      35       79.470000       7.998274 
      35       79.570000       7.966879 
      35       79.470000       7.944981 
      35       79.550000       7.938170 
      35       79.530000       7.939165 
      36       79.550000       7.937713 
      36       79.490000       7.939152 
      36       79.460000       7.937740 
      36       79.490000       7.940025 
      36       79.460000       7.948081 
      37       79.470000       7.982577 
      37       79.490000       7.998274 
      37       79.500000       7.966866 
      37       79.490000       7.944537 
      37       79.460000       7.932770 
      37       79.460000       7.914968 
      37       79.520000       7.897819 
      38       79.500000       7.914954 
      38       79.490000       7.932314 
      39       79.440000       7.938708 
      39       79.450000       7.937700 
      40       79.410000       7.939151 
      40       79.410000       7.937713 
      40       79.430000       7.939152 
      40       79.400000       7.937713 
      41       79.480000       7.939152 
      41       79.450000       7.937713 
      41       79.400000       7.939152 
      41       79.430000       7.937713 
      41       79.460000       7.939152 
      41       79.410000       7.937713 
      43       79.390000       7.939152 
      43       79.350000       7.937713 
      43       79.340000       7.939152 
      43       79.390000       7.937713 
      44       79.420000       7.939152 
      44       79.380000       7.937713 
      44       79.410000       7.939152 
      44       79.420000       7.937713 
      45       79.430000       7.939152 
      45       79.360000       7.937713 
      45       79.390000       7.939152 
      45       79.390000       7.937713 
      45       79.410000       7.939152 
      45       79.340000       7.937713 
      45       79.400000       7.939151 
      45       79.370000       7.937700 
      46       79.380000       7.938695 
      46       79.380000       7.931884 
      46       79.340000       7.909985 
      46       79.350000       7.878591 
      46       79.410000       7.894315 
      47       79.370000       7.929670 
      47       79.340000       7.947638 
      48       79.370000       7.987519 
      48       79.350000       8.017501 
      48       79.330000       7.987546 
      49       79.330000       7.948511 
      49       79.330000       7.940038 
      49       79.360000       7.937740 
      49       79.340000       7.939152 
      49       79.340000       7.937740 
      49       79.340000       7.940038 
      50       79.300000       7.948538 
      50       79.340000       7.988419 
      50       79.310000       8.027870 
      51       79.310000       8.030971 
      51       79.280000       8.009072 
      51       79.270000       7.967793 
      52       79.300000       7.945894 
      52       79.240000       7.948968 
      52       79.330000       7.987559 
      52       79.300000       8.017502 
      52       79.340000       7.987546 
      53       79.300000       7.948511 
      53       79.300000       7.940038 
      53       79.260000       7.937740 
      53       79.280000       7.939152 
      53       79.260000       7.937713 
      53       79.260000       7.939152 
      53       79.260000       7.937713 
      53       79.280000       7.939152 
      54       79.280000       7.937740 
      54       79.270000       7.940038 
      54       79.290000       7.948511 
      54       79.310000       7.987546 
      54       79.310000       8.017528 
      54       79.320000       7.988432 
      54       79.270000       7.959296 
      55       79.260000       7.987989 
      55       79.280000       8.012129 
      55       79.260000       7.963349 
      55       79.300000       7.908617 
      55       79.290000       7.915841 
      55       79.280000       7.932368 
      56       79.290000       7.939595 
      56       79.270000       7.948498 
      56       79.240000       7.987546 
      56       79.240000       8.017502 
      56       79.290000       7.987546 
      56       79.280000       7.948511 
      56       79.240000       7.940038 
      56       79.260000       7.937740 
      56       79.280000       7.939152 
      56       79.270000       7.937713 
      57       79.290000       7.939152 
      57       79.260000       7.937713 
      57       79.220000       7.939152 
      57       79.260000       7.937713 
      57       79.260000       7.939152 
      57       79.270000       7.937713 
      57       79.250000       7.939152 
      59       79.120000       7.937713 
      59       79.170000       7.939152 
      59       79.180000       7.937713 
      59       79.220000       7.939152 
      60       79.170000       7.937713 
      60       79.190000       7.939165 
      60       79.220000       7.938170 
      60       79.210000       7.944981 
      60       79.190000       7.966879 
      60       79.170000       7.998274 
      60       79.150000       7.982577 
      60       79.100000       7.948081 
      60       79.240000       7.940025 
      60       79.210000       7.937726 
