Human trial picking the raspberry twin 

 time    ||     output     ||     loadcell

      0.000000       -803.000000       0.100000 
      0.030528       -803.000000       0.100000 
      0.061330       -803.000000       0.250000 
      0.092302       -803.000000       0.200000 
      0.123539       -803.000000       0.180000 
      0.154917       -803.000000       0.180000 
      0.186150       -803.000000       0.130000 
      0.217421       -803.000000       0.110000 
      0.247356       -803.000000       0.120000 
      0.294962       -802.999995       0.150000 
      0.325998       -802.998801       0.010000 
      0.356763       -802.891336       0.070000 
      0.388904       -799.332561       0.050000 
      0.420659       -755.977815       0.110000 
      0.450850       -561.675323       0.100000 
      0.481978       -241.324672       0.010000 
      0.512607       -47.022180       0.370000 
      0.543126       -3.667434       0.050000 
      0.574704       -0.108660       0.030000 
      0.605911       -0.001194       0.230000 
      0.637862       -0.000001       0.050000 
      0.670211       0.000004       0.150000 
      0.701006       0.000004       0.050000 
      0.731791       0.000004       0.220000 
      0.762486       0.000004       0.100000 
      0.793805       -0.000009       0.230000 
      0.825276       -0.000439       0.260000 
      0.856881       -0.005395       0.150000 
      0.887370       -0.024193       0.050000 
      0.918610       -0.039917       0.140000 
      0.949439       -0.025079       0.290000 
      0.980536       -0.016193       0.050000 
      1.012322       -0.048833       0.010000 
      1.043243       -0.079824       0.080000 
      1.074519       -0.049290       0.040000 
      1.105129       -0.022035       0.080000 
      1.136087       -0.054675       0.120000 
      1.168213       -0.104008       0.130000 
      1.199346       -0.088284       0.170000 
      1.230303       -0.034991       0.040000 
      1.261216       -0.006281       0.000000 
      1.292844       -0.000479       0.060000 
      1.324562       -0.000453       0.110000 
      1.356377       -0.005395       0.210000 
      1.387325       -0.024193       0.040000 
      1.418294       -0.039890       0.020000 
      1.448245       -0.024206       0.040000 
      1.479463       -0.005838       0.050000 
      1.510402       -0.005838       0.050000 
      1.541616       -0.024206       0.290000 
      1.571870       -0.039890       0.040000 
      1.603150       -0.024193       0.140000 
      1.633069       -0.005395       0.000000 
      1.665146       -0.000452       0.330000 
      1.696069       -0.000452       0.040000 
      1.727003       -0.005395       0.040000 
      1.758900       -0.024193       0.130000 
      1.789789       -0.039890       0.020000 
      1.820711       -0.024193       0.030000 
      1.852642       -0.005395       0.300000 
      1.883538       -0.000439       0.010000 
      1.913485       -0.000009       0.110000 
      1.943379       0.000004       0.010000 
      1.974560       0.000004       0.350000 
      2.006475       0.000004       0.180000 
      2.037497       0.000004       0.070000 
      2.068416       0.000004       0.080000 
      2.098416       0.000004       0.060000 
      2.129537       0.000004       0.010000 
      2.160104       -0.000009       0.020000 
      2.191079       -0.000439       0.060000 
      2.222801       -0.005408       0.050000 
      2.269013       -0.024663       0.130000 
      2.298777       -0.046176       0.100000 
      2.330177       -0.059202       0.030000 
      2.376436       -0.094153       0.010000 
      2.407924       -0.110710       0.010000 
      2.439842       -0.088798       0.100000 
      2.471772       -0.099526       0.150000 
      2.501678       -0.104881       0.160000 
      2.532474       -0.053829       0.040000 
      2.563660       -0.011681       0.090000 
      2.595335       -0.006295       0.030000 
      2.626011       -0.024233       0.040000 
      2.656875       -0.040360       0.150000 
      2.688870       -0.030478       0.060000 
      2.719706       -0.040404       0.100000 
      2.750299       -0.089184       0.090000 
      2.781016       -0.109837       0.330000 
      2.811564       -0.083385       0.190000 
      2.843018       -0.075342       0.270000 
      2.874654       -0.065430       0.060000 
      2.906005       -0.035031       0.330000 
      2.936901       -0.030492       0.010000 
      2.968474       -0.046189       0.160000 
      2.999419       -0.053802       0.210000 
      3.030419       -0.069486       0.270000 
      3.062305       -0.064530       0.210000 
      3.093791       -0.029619       0.080000 
      3.125328       -0.006281       0.080000 
      3.155201       -0.005851       0.030000 
      3.186642       -0.024206       0.230000 
      3.217992       -0.039890       0.120000 
      3.248708       -0.024193       0.060000 
      3.279429       -0.005395       0.180000 
      3.309991       -0.000439       0.330000 
      3.341516       -0.000009       0.010000 
      3.372920       0.000004       0.100000 
      3.405021       0.000004       0.010000 
      3.436178       0.000004       0.040000 
      3.467090       0.000004       0.180000 
      3.497090       0.000004       0.210000 
      3.528587       0.000004       0.130000 
      3.559372       0.000004       0.070000 
      3.590787       0.000004       0.050000 
      3.622683       0.000004       0.190000 
      3.653337       0.000004       0.240000 
      3.683784       -0.000009       0.180000 
      3.714870       -0.000452       0.140000 
      3.746953       -0.005838       0.060000 
      3.779326       -0.029592       0.000000 
      3.810052       -0.064100       0.150000 
      3.841303       -0.064530       0.220000 
      3.872868       -0.034991       0.260000 
      3.904754       -0.030035       0.220000 
      3.935929       -0.040346       0.400000 
      3.966491       -0.024206       0.180000 
      3.998008       -0.005395       0.050000 
      4.029779       -0.000452       0.240000 
      4.060506       -0.000452       0.020000 
      4.091286       -0.005409       0.130000 
      4.122725       -0.024663       0.280000 
      4.154851       -0.046175       0.070000 
      4.185313       -0.059188       0.100000 
      4.216376       -0.093683       0.030000 
      4.246955       -0.104424       0.260000 
      4.277795       -0.053802       0.100000 
      4.308696       -0.011237       0.220000 
      4.339426       -0.000895       0.070000 
      4.369829       -0.000023       0.110000 
      4.399657       0.000004       0.050000 
      4.431051       -0.000009       0.030000 
      4.462963       -0.000439       0.030000 
      4.492920       -0.005395       0.150000 
      4.523571       -0.024193       0.120000 
      4.554779       -0.039890       0.040000 
      4.585783       -0.024206       0.100000 
      4.617085       -0.005852       0.110000 
      4.648411       -0.006295       0.040000 
      4.679794       -0.030049       0.030000 
      4.710880       -0.069500       0.200000 
      4.740503       -0.088727       0.170000 
      4.771154       -0.074885       0.040000 
      4.802645       -0.054246       0.040000 
      4.833095       -0.046189       0.260000 
      4.863530       -0.030049       0.040000 
      4.894682       -0.029619       0.010000 
      4.926219       -0.040776       0.120000 
      4.956939       -0.029605       0.280000 
      4.988127       -0.029592       0.370000 
      5.019162       -0.040333       0.020000 
      5.050376       -0.024220       0.080000 
      5.082002       -0.005852       0.020000 
      5.113819       -0.006281       0.110000 
      5.144442       -0.029605       0.130000 
      5.175659       -0.064087       0.020000 
      5.206769       -0.064087       0.170000 
      5.237946       -0.029592       0.010000 
      5.268703       -0.005838       0.080000 
      5.299618       -0.000452       0.110000 
      5.330324       -0.000009       0.050000 
      5.360745       0.000004       0.140000 
      5.392329       -0.000009       0.060000 
      5.423881       -0.000439       0.070000 
      5.455077       -0.005395       0.180000 
      5.487025       -0.024193       0.190000 
      5.532855       -0.039903       0.050000 
      5.563857       -0.024636       0.040000 
      5.595041       -0.010794       0.020000 
      5.626392       -0.024636       0.090000 
      5.657722       -0.039903       0.030000 
      5.688364       -0.024206       0.060000 
      5.720030       -0.005838       0.010000 
      5.751081       -0.005838       0.030000 
      5.781791       -0.024206       0.190000 
      5.812539       -0.039890       0.290000 
      5.843910       -0.024193       0.270000 
      5.875323       -0.005395       0.050000 
      5.905777       -0.000439       0.220000 
      5.937307       -0.000009       0.050000 
      5.969029       0.000004       0.100000 
      5.999566       0.000004       0.160000 
      6.031544       0.000004       0.130000 
      6.062444       -0.000022       0.120000 
      6.093905       -0.000882       0.090000 
      6.124920       -0.010794       0.040000 
      6.156402       -0.048390       0.060000 
      6.187923       -0.079784       0.230000 
      6.218895       -0.048390       0.140000 
      6.249779       -0.010794       0.000000 
      6.280484       -0.000882       0.080000 
      6.311300       -0.000022       0.200000 
      6.342318       0.000004       0.010000 
      6.373760       0.000004       0.080000 
      6.404351       -0.000009       0.110000 
      6.435071       -0.000439       0.150000 
      6.466475       -0.005395       0.190000 
      6.497361       -0.024193       0.060000 
      6.528609       -0.039890       0.080000 
      6.560038       -0.024193       0.080000 
      6.591002       -0.005395       0.050000 
      6.622644       -0.000439       0.090000 
      6.654444       -0.000009       0.210000 
      6.685820       0.000004       0.220000 
      6.716446       0.000004       0.130000 
      6.747978       0.000004       0.060000 
      6.779020       0.000004       0.070000 
      6.809953       0.000004       0.290000 
      6.840413       0.000004       0.130000 
      6.871368       0.000004       0.130000 
      6.902510       0.000004       0.130000 
      6.934341       0.000004       0.420000 
      6.965181       -0.000009       0.100000 
      6.996097       -0.000439       0.000000 
      7.027270       -0.005395       0.190000 
      7.058991       -0.024193       0.030000 
      7.089334       -0.039890       0.210000 
      7.136297       -0.024193       0.090000 
      7.166808       -0.005395       0.100000 
      7.197795       -0.000439       0.150000 
      7.228863       -0.000009       0.150000 
      7.260483       0.000004       0.150000 
      7.291247       0.000004       0.050000 
      7.322769       -0.000009       0.060000 
      7.353891       -0.000439       0.160000 
      7.384612       -0.005395       0.050000 
      7.415262       -0.024193       0.030000 
      7.447002       -0.039890       0.040000 
      7.477948       -0.024193       0.040000 
      7.508865       -0.005395       0.100000 
      7.540762       -0.000439       0.050000 
      7.571671       -0.000009       0.160000 
      7.602588       0.000004       0.050000 
      7.634534       0.000004       0.130000 
      7.665447       0.000004       0.150000 
      7.696336       0.000004       0.160000 
      7.728252       0.000004       0.280000 
      7.759170       0.000004       0.720000 
      7.790087       0.000004       2.380000 
      7.822002       0.000004       3.530000 
      7.853948       -0.000009       5.800000 
      7.884922       -0.000439       7.180000 
      7.916451       -0.005395       9.730000 
      7.948045       -0.024193       13.420000 
      7.979140       -0.039890       17.380000 
      8.010251       -0.024193       22.140000 
      8.041569       -0.005395       28.800000 
      8.072134       -0.000439       34.990000 
      8.103123       -0.000009       47.160000 
      8.134925       0.000004       62.120000 
      8.167017       0.000004       77.140000 
      8.198470       0.000004       91.400000 
      8.229814       0.000004       107.460000 
      8.259665       0.000004       124.690000 
      8.290841       0.000004       135.750000 
      8.322518       0.000004       149.990000 
      8.352973       0.000004       165.900000 
      8.383212       0.000004       179.400000 
      8.413210       0.000004       188.090000 
      8.444878       0.000018       187.750000 
      8.475887       0.000448       168.550000 
      8.507630       0.005417       64.150000 
      8.538222       0.024699       28.820000 
      8.569063       0.047152       27.140000 
      8.600624       0.072776       21.880000 
      8.632251       0.178605       3.650000 
      8.663283       0.382590       6.940000 
      8.694001       0.618830       6.720000 
      8.724937       0.839066       14.160000 
      8.756189       1.020588       13.940000 
      8.787543       1.203686       2.450000 
      8.819494       1.467906       1.780000 
      8.849407       1.775663       11.370000 
      8.881295       1.859410       10.520000 
      8.913238       1.404172       7.080000 
      8.943132       0.257924       6.220000 
      8.975079       -0.860834       6.930000 
      9.006959       -1.155472       8.530000 
      9.036910       -1.108092       7.570000 
      9.068794       -1.247857       4.770000 
      9.100711       -1.564219       6.600000 
      9.130663       -1.850050       7.590000 
      9.162571       -1.974275       6.290000 
      9.194491       -1.998101       4.580000 
      9.224380       -1.999941       5.650000 
      9.256409       -1.999995       6.840000 
      9.287654       -1.999996       5.980000 
      9.318479       -1.999996       4.750000 
      9.349385       -1.999996       4.290000 
      9.380726       -1.999996       5.990000 
      9.412572       -1.999996       6.960000 
      9.443859       -1.999996       6.010000 
      9.474874       -1.999996       5.150000 
      9.505945       -1.999996       5.590000 
      9.536836       -1.999996       7.230000 
      9.568079       -1.999996       7.840000 
      9.599695       -1.999996       7.510000 
      9.630829       -1.999996       7.520000 
      9.661761       -1.999996       7.650000 
      9.692707       -1.999996       7.870000 
      9.723348       -1.999996       7.930000 
      9.754368       -1.999996       7.870000 
      9.785333       -1.999996       7.700000 
      9.816811       -1.999996       7.670000 
      9.849150       -1.999996       7.610000 
      9.879372       -1.999996       7.550000 
      9.910520       -1.999996       7.230000 
      9.955559       -1.999996       6.780000 
      9.986944       -1.999996       6.740000 
      10.018840       -1.999996       6.620000 
      10.049801       -1.999996       6.240000 
      10.079875       -1.999996       6.150000 
      10.111272       -1.999996       6.090000 
      10.157871       -1.999996       5.830000 
      10.187544       -1.999996       5.830000 
      10.218530       -1.999996       5.760000 
      10.248784       -1.999996       5.660000 
      10.280062       -1.999996       5.910000 
      10.311147       -1.999996       6.090000 
      10.341449       -1.999996       6.450000 
      10.372442       -1.999996       6.680000 
      10.403772       -1.999996       6.660000 
      10.435148       -1.999996       7.270000 
      10.466055       -1.999996       7.220000 
      10.497776       -1.999996       7.320000 
      10.527651       -1.999996       7.600000 
      10.559021       -1.999996       7.550000 
      10.589735       -1.999996       7.560000 
      10.636576       -1.999996       7.650000 
      10.668095       -1.999996       7.310000 
      10.699157       -1.999996       7.250000 
      10.730373       -1.999996       7.290000 
      10.761163       -1.999996       7.250000 
      10.792046       -1.999996       7.200000 
      10.822871       -1.999996       6.740000 
      10.854510       -1.999996       6.700000 
      10.885828       -1.999996       6.500000 
      10.916177       -1.999996       6.670000 
      10.947589       -1.999996       6.320000 
      10.978168       -1.999996       6.270000 
      11.009429       -1.999996       6.080000 
      11.040143       -1.999996       6.040000 
      11.071114       -1.999996       5.940000 
      11.102409       -1.999996       6.290000 
      11.133433       -1.999996       6.330000 
      11.164453       -1.999996       6.270000 
      11.195802       -1.999996       6.450000 
      11.227297       -1.999996       6.700000 
      11.258306       -1.999996       6.690000 
      11.289671       -1.999996       7.060000 
      11.320944       -1.999996       7.060000 
      11.352237       -1.999996       7.090000 
      11.384586       -1.999996       7.330000 
      11.415446       -1.999996       7.250000 
      11.445892       -1.999996       7.440000 
      11.477036       -1.999996       7.010000 
      11.508377       -1.999996       7.080000 
      11.539140       -1.999996       7.170000 
      11.570217       -1.999996       7.340000 
      11.601742       -1.999996       6.930000 
      11.632187       -1.999996       7.160000 
      11.663662       -1.999996       6.730000 
      11.693759       -1.999996       6.670000 
      11.740531       -1.999996       6.540000 
      11.771958       -1.999996       6.320000 
      11.802842       -1.999996       6.360000 
      11.834520       -1.999996       6.350000 
      11.865730       -1.999996       6.300000 
      11.896954       -1.999996       6.260000 
      11.927465       -1.999996       6.380000 
      11.958812       -1.999996       6.640000 
      11.990447       -1.999996       6.640000 
      12.021492       -1.999996       6.530000 
      12.052392       -1.999996       6.440000 
      12.100678       -1.999996       6.760000 
      12.131907       -1.999996       6.730000 
      12.161794       -1.999996       7.040000 
      12.192934       -1.999996       7.040000 
      12.225076       -1.999996       7.040000 
      12.256184       -1.999996       7.000000 
      12.286884       -1.999996       6.990000 
      12.317641       -1.999996       6.890000 
      12.349176       -1.999996       7.010000 
      12.396650       -1.999996       6.760000 
      12.427787       -1.999996       6.770000 
      12.459112       -1.999996       6.660000 
      12.489793       -1.999996       6.680000 
      12.520873       -1.999996       6.740000 
      12.552769       -1.999996       6.710000 
      12.583121       -1.999996       6.630000 
      12.614371       -1.999996       6.650000 
      12.645433       -1.999996       6.500000 
      12.676434       -1.999996       6.470000 
      12.707277       -1.999996       6.500000 
      12.737897       -1.999996       6.380000 
      12.768681       -1.999996       6.480000 
      12.799937       -1.999996       6.660000 
      12.831029       -1.999996       6.640000 
      12.862396       -1.999996       6.420000 
      12.892842       -1.999996       6.420000 
      12.924850       -1.999996       6.870000 
      12.956363       -1.999996       6.780000 
      12.987233       -1.999996       6.880000 
      13.018645       -1.999996       6.920000 
      13.049737       -1.999996       6.830000 
      13.081071       -1.999996       7.040000 
      13.112571       -1.999996       7.070000 
      13.143688       -1.999996       7.030000 
      13.174684       -1.999996       6.880000 
      13.205645       -1.999996       6.940000 
      13.236497       -1.999996       6.730000 
      13.268466       -1.999996       6.710000 
      13.299891       -1.999996       6.610000 
      13.331745       -1.999996       6.730000 
      13.362683       -1.999996       6.310000 
      13.393713       -1.999996       6.460000 
      13.424696       -1.999996       6.630000 
      13.455487       -1.999996       6.500000 
      13.487181       -1.999996       6.660000 
      13.517417       -1.999996       6.460000 
      13.548500       -1.999996       6.440000 
      13.580384       -1.999996       6.640000 
      13.611795       -1.999996       6.630000 
      13.643028       -1.999996       6.800000 
      13.675070       -1.999996       6.540000 
      13.706137       -1.999996       6.660000 
      13.737618       -1.999996       6.690000 
      13.769245       -1.999996       6.680000 
      13.800332       -1.999996       6.810000 
      13.831614       -1.999996       7.150000 
      13.862190       -1.999996       6.950000 
      13.894276       -1.999996       6.920000 
      13.925117       -1.999996       7.000000 
      13.955776       -1.999996       6.780000 
      13.987037       -1.999996       6.800000 
      14.018031       -1.999996       6.810000 
      14.048176       -1.999996       6.520000 
      14.078649       -1.999996       6.520000 
      14.109091       -1.999996       6.400000 
      14.140313       -1.999996       6.390000 
      14.171022       -1.999996       6.470000 
      14.202732       -1.999996       6.560000 
      14.233140       -1.999996       6.610000 
      14.264794       -1.999996       6.430000 
      14.294662       -1.999996       6.290000 
      14.325816       -1.999996       6.400000 
      14.356298       -1.999996       6.470000 
      14.386966       -1.999996       6.330000 
      14.418443       -1.999996       6.670000 
      14.449568       -1.999996       6.860000 
      14.480195       -1.999996       6.650000 
      14.511281       -1.999996       6.750000 
      14.542030       -1.999996       6.690000 
      14.573911       -1.999996       6.590000 
      14.605542       -1.999996       6.820000 
      14.635820       -1.999996       6.850000 
      14.666694       -1.999996       6.940000 
      14.697393       -1.999996       6.640000 
      14.728731       -1.999996       6.820000 
      14.759469       -1.999996       6.850000 
      14.789435       -1.999996       6.850000 
      14.819572       -1.999996       6.930000 
      14.850921       -1.999996       6.850000 
      14.882437       -1.999996       6.740000 
      14.914088       -1.999996       6.740000 
      14.944819       -1.999996       6.440000 
      14.975666       -1.999996       6.710000 
      15.006481       -1.999996       6.360000 
      15.038279       -1.999996       6.650000 
      15.084976       -1.999996       6.650000 
      15.116108       -1.999996       6.240000 
      15.148119       -1.999996       6.410000 
      15.180475       -1.999996       6.560000 
      15.212353       -1.999996       6.570000 
      15.242273       -1.999996       6.370000 
      15.272716       -1.999996       6.620000 
      15.304662       -1.999996       6.670000 
      15.334678       -1.999996       6.660000 
      15.365206       -1.999996       6.580000 
      15.396447       -1.999996       6.860000 
      15.428124       -1.999996       6.640000 
      15.458527       -1.999996       6.590000 
      15.490285       -1.999996       7.070000 
      15.520465       -1.999996       7.060000 
      15.551160       -1.999996       6.610000 
      15.582108       -1.999996       6.860000 
      15.612172       -1.999996       6.940000 
      15.643418       -1.999996       6.940000 
      15.690657       -1.999996       6.750000 
      15.722182       -1.999996       6.660000 
      15.752832       -1.999996       6.600000 
      15.784506       -1.999982       6.540000 
      15.816005       -1.999553       6.610000 
      15.847894       -1.994597       6.300000 
      15.879042       -1.975799       6.350000 
      15.910692       -1.960101       6.340000 
      15.941831       -1.975799       6.330000 
      15.972579       -1.994597       6.210000 
      16.004659       -1.999553       6.340000 
      16.035534       -1.999982       6.180000 
      16.066301       -1.999996       6.470000 
      16.097660       -1.999996       6.540000 
      16.128507       -1.999982       6.600000 
      16.159965       -1.999553       6.620000 
      16.191143       -1.994597       6.670000 
      16.223124       -1.975799       6.510000 
      16.254585       -1.960101       6.750000 
      16.286240       -1.975799       6.740000 
      16.317017       -1.994597       6.950000 
      16.348157       -1.999553       6.840000 
      16.378492       -1.999982       6.410000 
      16.409065       -1.999996       6.760000 
      16.439804       -1.999996       6.640000 
      16.485702       -1.999996       6.570000 
      16.516948       -1.999996       6.800000 
      16.548803       -1.999996       6.620000 
      16.579297       -1.999982       6.630000 
      16.610213       -1.999553       6.600000 
      16.641537       -1.994597       6.430000 
      16.673409       -1.975799       6.470000 
      16.719563       -1.960101       6.650000 
      16.750202       -1.975799       6.520000 
      16.781162       -1.994597       6.340000 
      16.812705       -1.999553       6.350000 
      16.844227       -1.999982       6.440000 
      16.875291       -1.999995       6.550000 
      16.906850       -1.999982       6.450000 
      16.938686       -1.999553       6.400000 
      16.970220       -1.994597       6.450000 
      17.001317       -1.975799       6.450000 
      17.031972       -1.960101       6.610000 
      17.062706       -1.975785       6.710000 
      17.094265       -1.994153       6.730000 
      17.125634       -1.994140       6.690000 
      17.156497       -1.975342       6.820000 
      17.187554       -1.954689       6.560000 
      17.235029       -1.951158       6.780000 
      17.266238       -1.949303       6.780000 
      17.298233       -1.951158       6.800000 
      17.329400       -1.954689       6.810000 
      17.360565       -1.975355       6.680000 
      17.391819       -1.994583       6.720000 
      17.422782       -1.999539       6.640000 
      17.454697       -1.999539       6.560000 
      17.484646       -1.994596       6.550000 
      17.516532       -1.975799       6.460000 
      17.548447       -1.960101       6.490000 
      17.578367       -1.975799       6.370000 
      17.610280       -1.994597       6.370000 
      17.642195       -1.999553       6.470000 
      17.672135       -1.999982       6.320000 
      17.704065       -1.999996       6.550000 
      17.735979       -1.999996       6.410000 
      17.765864       -1.999982       6.730000 
      17.797806       -1.999552       6.630000 
      17.829694       -1.994583       6.470000 
      17.859616       -1.975355       6.540000 
      17.890834       -1.954702       6.210000 
      17.922572       -1.951602       6.580000 
      17.953417       -1.954702       6.660000 
      17.984540       -1.975342       6.340000 
      18.015797       -1.994127       6.510000 
      18.046811       -1.993710       6.720000 
      18.077793       -1.970386       6.760000 
      18.109600       -1.935891       6.700000 
      18.140762       -1.935461       6.770000 
      18.172755       -1.965000       6.490000 
      18.204333       -1.969956       6.550000 
      18.235389       -1.959645       6.750000 
      18.266849       -1.975785       6.760000 
      18.298761       -1.994596       6.580000 
      18.328689       -1.999552       6.700000 
      18.360044       -1.999969       6.510000 
      18.391407       -1.999552       6.320000 
      18.422505       -1.994597       6.280000 
      18.453073       -1.975799       6.460000 
      18.483922       -1.960101       6.570000 
      18.514750       -1.975799       6.390000 
      18.545593       -1.994596       6.320000 
      18.576977       -1.999539       6.320000 
      18.608094       -1.999526       6.620000 
      18.639005       -1.994153       6.590000 
      18.669674       -1.970373       6.420000 
      18.701238       -1.935018       6.560000 
      18.732722       -1.925106       6.730000 
      18.764340       -1.921992       6.630000 
      18.794973       -1.913922       6.610000 
      18.826926       -1.945733       6.730000 
      18.857809       -1.964544       6.550000 
      18.888725       -1.953802       6.830000 
      18.919642       -1.951118       6.520000 
      18.950560       -1.948860       6.790000 
      18.982507       -1.945746       6.600000 
      19.013392       -1.930035       6.720000 
      19.044342       -1.929619       6.680000 
      19.076252       -1.940777       6.540000 
      19.107142       -1.929619       6.450000 
      19.138061       -1.930049       6.440000 
      19.169976       -1.946189       6.710000 
      19.200925       -1.954232       6.360000 
      19.231811       -1.974429       6.510000 
      19.262537       -1.982885       6.510000 
      19.294014       -1.939903       6.540000 
      19.324801       -1.865944       6.380000 
      19.355844       -1.841773       6.600000 
      19.386022       -1.871299       6.690000 
      19.416872       -1.899566       6.500000 
      19.448381       -1.923750       6.520000 
      19.479262       -1.940333       6.650000 
      19.511000       -1.930048       6.670000 
      19.542261       -1.935448       6.590000 
      19.573105       -1.970373       6.700000 
      19.604807       -1.993710       6.710000 
      19.634691       -1.994113       6.510000 
      19.665327       -1.974872       6.400000 
      19.696021       -1.948390       6.420000 
      19.726376       -1.915720       6.600000 
      19.757598       -1.855616       6.610000 
      19.788943       -1.822962       6.540000 
      19.819864       -1.860545       6.570000 
      19.850786       -1.934074       6.600000 
      19.882020       -1.958675       6.480000 
      19.913071       -1.934547       6.720000 
      19.944551       -1.930451       6.330000 
      19.974889       -1.945316       6.600000 
      20.006964       -1.943434       6.530000 
      20.038023       -1.926062       6.530000 
      20.069201       -1.903996       6.550000 
      20.100198       -1.902750       6.520000 
      20.131200       -1.908926       6.570000 
      20.161967       -1.944430       6.530000 
      20.192326       -1.954175       6.420000 
      20.222756       -1.910780       6.390000 
      20.253608       -1.894640       6.580000 
      20.284231       -1.929521       6.510000 
      20.315329       -1.909394       6.550000 
      20.346455       -1.837689       6.500000 
      20.377107       -1.798668       6.600000 
      20.407524       -1.766427       6.590000 
      20.437376       -1.789738       6.400000 
      20.468459       -1.856487       6.410000 
      20.499826       -1.873057       6.710000 
      20.531533       -1.885684       6.440000 
      20.562895       -1.919210       6.310000 
      20.593592       -1.939473       6.610000 
      20.624846       -1.924623       6.310000 
      20.656735       -1.910793       6.360000 
      20.687577       -1.924596       6.460000 
      20.718949       -1.938560       6.710000 
      20.749644       -1.907552       6.410000 
      20.780623       -1.827378       6.670000 
      20.811362       -1.755659       6.490000 
      20.842977       -1.776282       6.610000 
      20.874212       -1.805808       6.650000 
      20.904910       -1.789268       6.470000 
      20.935990       -1.810767       6.740000 
      20.966712       -1.859131       6.310000 
      20.997524       -1.863671       6.580000 
      21.028538       -1.830022       6.730000 
