

 time    ||    gripping force   ||   raspberry measurement 

      0       0.100000       -802.826000 
      0       0.060000       -802.826000 
      0       0.120000       -802.826000 
      0       0.060000       -802.826000 
      0       0.070000       -802.826000 
      0       0.100000       -802.826000 
      0       0.100000       -802.826000 
      0       0.110000       -802.826000 
      0       0.060000       -802.826000 
      0       0.030000       -802.826000 
      0       0.140000       -802.826000 
      0       0.080000       -802.826000 
      0       0.080000       -802.826000 
      0       0.150000       -802.826000 
      0       0.070000       -802.826000 
      0       0.090000       -802.826000 
      0       0.950000       -802.825995 
      0       0.400000       -802.824802 
      0       0.500000       -802.717417 
      0       0.640000       -799.161329 
      0       0.370000       -755.839850 
      0       0.100000       -561.692923 
      1       0.280000       -241.625532 
      1       0.090000       -47.535041 
      1       0.390000       -47.535041 
      1       0.110000       -4.274513 
      1       0.050000       -0.802726 
      1       0.080000       -0.745021 
      1       0.030000       -0.745021 
      1       0.150000       -0.701347 
      1       0.110000       -0.656992 
      1       0.020000       -0.702658 
      1       0.140000       -0.759618 
      1       0.250000       -0.762679 
      1       0.170000       -0.762679 
      1       0.460000       -0.721968 
      1       0.370000       -0.659579 
      1       0.400000       -0.628334 
      2       0.360000       -0.628334 
      2       0.630000       -0.628334 
      2       0.270000       -0.600844 
      2       0.370000       -0.600844 
      2       0.990000       -0.587997 
      2       3.530000       -0.605773 
      2       16.990000       -0.646675 
      2       38.490000       -0.669421 
      2       56.950000       -0.676258 
      2       72.210000       -0.675263 
      2       93.240000       -0.675263 
      2       106.690000       -0.675263 
      2       113.300000       -0.675263 
      2       112.890000       -0.675263 
      2       111.630000       -0.675263 
      2       108.520000       -0.675263 
      3       98.470000       -0.675263 
      3       84.490000       -0.676675 
      3       60.550000       -0.673960 
      3       39.170000       -0.660974 
      3       29.650000       -0.660974 
      3       19.460000       -0.660974 
      3       17.650000       -0.608541 
      3       17.350000       -0.608541 
      3       17.790000       -0.587058 
      3       17.510000       -0.671705 
      3       17.730000       -0.742439 
      3       17.870000       -0.705701 
      3       17.930000       -0.583263 
      3       18.250000       -0.395860 
      3       18.560000       -0.395860 
      4       18.950000       -0.190064 
      4       18.760000       -0.190064 
      4       18.840000       -0.012553 
      4       18.780000       0.219303 
      4       18.760000       0.219303 
      4       18.800000       0.219303 
      4       19.460000       0.219303 
      4       20.360000       0.560728 
      4       21.450000       0.759699 
      4       22.390000       0.589439 
      4       23.310000       0.278506 
      4       23.440000       0.035467 
      4       23.400000       0.035467 
      4       23.370000       0.035467 
      4       23.340000       -0.141486 
      5       23.220000       -0.199846 
      5       23.280000       -0.199846 
      5       23.240000       -0.173949 
      5       23.250000       -0.200858 
      5       23.180000       -0.220109 
      5       23.160000       -0.156062 
      5       23.000000       -0.108115 
      5       22.660000       -0.150662 
      5       22.350000       -0.195443 
      5       21.770000       -0.154706 
      5       21.590000       -0.154706 
      5       21.320000       -0.115657 
      5       21.130000       -0.117455 
      5       20.900000       -0.092785 
      5       20.660000       -0.041680 
      5       20.370000       0.038096 
      6       20.140000       0.083376 
      6       20.010000       0.083376 
      6       20.010000       0.083376 
      6       19.940000       0.083376 
      6       19.900000       0.076192 
      6       19.910000       0.070433 
      6       19.940000       0.047938 
      6       19.910000       0.030136 
      6       19.910000       0.023728 
      6       19.940000       0.023728 
      6       19.970000       0.024737 
      6       19.970000       0.023258 
      6       20.010000       0.023823 
      6       19.920000       0.012017 
      6       19.940000       -0.029970 
      7       19.950000       -0.029970 
      7       19.970000       -0.091955 
      7       19.920000       -0.117815 
      7       19.950000       -0.121525 
      7       19.960000       -0.099030 
      7       19.940000       -0.099030 
      7       19.940000       -0.071745 
      7       19.870000       -0.031838 
      7       19.930000       -0.010339 
      7       19.930000       -0.018383 
      7       19.830000       -0.010325 
      7       19.740000       -0.031395 
      7       19.620000       -0.066346 
      7       19.490000       -0.066346 
      7       19.480000       -0.074833 
      7       19.330000       -0.081644 
      8       19.150000       -0.094074 
      8       19.280000       -0.092412 
      8       19.250000       -0.059579 
      8       19.240000       -0.057890 
      8       19.260000       -0.069408 
      8       19.240000       -0.064614 
      8       19.300000       -0.064614 
      8       19.270000       -0.016514 
      8       19.310000       0.046095 
      8       19.290000       0.029582 
      8       19.260000       0.029582 
      8       19.300000       -0.047088 
      8       19.330000       -0.045667 
      8       19.360000       -0.035951 
      8       19.370000       -0.109758 
      9       19.370000       -0.140749 
      9       19.340000       -0.069075 
      9       19.330000       -0.043563 
      9       19.260000       -0.043563 
      9       19.290000       -0.074445 
      9       19.350000       -0.121137 
      9       19.350000       -0.225056 
      9       19.330000       -0.318229 
      9       19.330000       -0.306669 
      9       19.370000       -0.221013 
      9       19.470000       -0.221013 
      9       19.760000       -0.125167 
      9       19.900000       -0.105856 
      9       20.250000       -0.105856 
      9       20.520000       -0.175772 
      10       20.710000       -0.168518 
      10       20.870000       -0.071537 
      10       21.000000       -0.032642 
      10       21.050000       -0.095736 
      10       21.110000       -0.095736 
      10       21.130000       -0.161767 
      10       21.050000       -0.190791 
      10       21.170000       -0.187924 
      10       21.090000       -0.099173 
      10       21.070000       -0.032952 
      10       21.090000       -0.089877 
      10       21.060000       -0.147479 
      10       20.980000       -0.163424 
      10       20.910000       -0.163424 
      10       20.850000       -0.163424 
      10       20.770000       -0.172318 
      11       20.730000       -0.219052 
      11       20.620000       -0.282461 
      11       20.530000       -0.282461 
      11       20.380000       -0.266315 
      11       20.200000       -0.137247 
      11       19.950000       -0.033833 
      11       19.790000       -0.030846 
      11       19.780000       -0.057085 
      11       19.600000       -0.057085 
      11       19.600000       -0.114731 
      11       19.500000       -0.199494 
      11       19.590000       -0.214477 
      11       19.540000       -0.127108 
      11       19.530000       -0.062908 
      11       19.560000       -0.060469 
      12       19.510000       -0.122011 
      12       19.560000       -0.199702 
      12       19.540000       -0.199702 
      12       19.560000       -0.199702 
      12       19.540000       -0.228759 
      12       19.560000       -0.218083 
      12       19.650000       -0.143942 
      12       19.650000       -0.035732 
      12       19.710000       -0.005502 
      12       19.710000       -0.055710 
      12       19.800000       -0.098912 
      12       19.860000       -0.127348 
      12       19.900000       -0.130829 
      12       19.930000       -0.139001 
      12       20.080000       -0.103752 
      13       20.160000       -0.092670 
      13       20.220000       -0.192358 
      13       20.330000       -0.269394 
      13       20.390000       -0.197979 
      13       20.390000       -0.128137 
      13       20.360000       -0.153850 
      13       20.340000       -0.153242 
      13       20.330000       -0.117107 
      13       20.320000       -0.085693 
      13       20.320000       -0.057398 
      13       20.300000       -0.085591 
      13       20.360000       -0.110071 
      13       20.270000       -0.057868 
      13       20.290000       -0.008628 
      13       20.330000       -0.023904 
      14       20.280000       -0.094376 
      14       20.150000       -0.114126 
      14       20.200000       -0.088265 
      14       20.030000       -0.088265 
      14       20.000000       -0.075337 
      14       19.900000       -0.118503 
      14       19.890000       -0.126623 
      14       19.860000       -0.049050 
      14       19.880000       0.042844 
      14       19.810000       0.113378 
      14       19.810000       0.078532 
      14       19.830000       -0.011386 
      14       19.810000       -0.050328 
      14       19.840000       -0.050328 
      14       19.860000       -0.068452 
      15       19.840000       -0.047360 
      15       19.840000       -0.007458 
      15       19.890000       0.017900 
      15       19.800000       0.019528 
      15       19.850000       -0.068168 
      15       19.860000       -0.187548 
      15       19.910000       -0.196882 
      15       19.920000       -0.109198 
      15       19.880000       -0.043896 
      15       19.840000       0.035671 
      15       19.880000       0.111891 
      15       19.880000       0.075428 
      15       19.860000       -0.039821 
      15       19.860000       -0.055362 
      15       19.910000       -0.055362 
      16       19.850000       -0.012712 
      16       19.850000       -0.000580 
      16       19.940000       0.002048 
      16       19.870000       -0.000621 
      16       19.900000       -0.000621 
      16       19.890000       -0.013511 
      16       19.900000       -0.066600 
      16       19.940000       -0.103172 
      16       19.830000       -0.088023 
      16       19.860000       -0.109249 
      16       19.990000       -0.109249 
      16       20.070000       -0.099768 
      16       20.330000       -0.035746 
      16       20.300000       -0.021272 
      16       20.440000       -0.012906 
      17       20.480000       -0.009472 
      17       20.320000       -0.041956 
      17       20.360000       -0.088799 
      17       20.340000       -0.088799 
      17       20.300000       -0.116994 
      17       20.360000       -0.155510 
      17       20.370000       -0.154176 
      17       20.360000       -0.135995 
      17       20.350000       -0.097581 
      17       20.320000       -0.097581 
      17       20.200000       -0.030671 
      17       20.200000       0.054956 
      17       20.060000       0.100428 
      17       20.000000       0.100428 
      17       19.910000       0.100449 
      18       19.850000       0.046520 
      18       19.810000       -0.044777 
      18       19.820000       -0.086099 
      18       19.820000       -0.049308 
      18       19.790000       -0.046609 
      18       19.770000       -0.074948 
      18       19.920000       -0.075567 
      18       19.820000       -0.075567 
      18       19.830000       -0.043704 
      18       19.850000       0.030378 
      18       19.830000       0.030378 
      18       19.780000       0.030378 
      18       19.810000       0.070408 
      18       19.820000       0.053382 
      18       19.860000       0.064758 
      19       19.790000       0.064758 
      19       19.800000       0.079251 
      19       19.840000       0.065511 
      19       19.780000       0.057413 
      19       19.770000       0.019425 
      19       19.800000       0.019425 
      19       19.780000       -0.058692 
      19       19.840000       -0.124334 
      19       19.850000       -0.124334 
      19       19.880000       -0.067096 
      19       19.820000       0.041726 
      19       19.900000       0.085258 
      19       19.920000       0.037403 
      19       19.870000       0.037403 
      19       20.010000       -0.022010 
      20       20.010000       -0.033287 
      20       20.000000       -0.033449 
      20       20.020000       -0.033449 
      20       19.970000       -0.026401 
      20       19.960000       -0.068824 
      20       19.930000       -0.068824 
      20       20.020000       -0.121718 
      20       19.960000       -0.121718 
      20       20.040000       -0.121718 
      20       19.980000       -0.121718 
      20       20.030000       -0.067780 
      20       20.010000       0.029126 
      20       19.990000       0.011579 
      20       20.110000       -0.107938 
      20       20.010000       -0.225222 
      21       20.160000       -0.225222 
      21       20.190000       -0.245638 
      21       20.180000       -0.152186 
      21       20.210000       -0.052691 
      21       20.220000       0.041558 
      21       20.210000       0.096482 
      21       20.260000       0.076126 
      21       20.240000       0.054932 
      21       20.120000       0.052146 
      21       20.200000       0.001044 
      21       20.250000       -0.034419 
      21       20.210000       -0.022620 
      21       20.190000       -0.022620 
      21       20.250000       -0.022620 
      21       20.170000       -0.056930 
      22       20.210000       -0.094988 
      22       20.180000       -0.034136 
      22       20.170000       0.073545 
      22       20.150000       0.104329 
      22       20.070000       0.007417 
      22       20.140000       -0.056889 
      22       19.960000       0.002164 
      22       20.000000       0.012338 
      22       19.920000       -0.067594 
      22       19.910000       -0.055859 
      22       19.810000       0.013408 
      22       19.900000       -0.009309 
      22       19.880000       -0.061976 
      22       19.940000       -0.082775 
      22       19.850000       -0.082775 
      23       19.920000       -0.107974 
      23       19.830000       -0.090186 
      23       19.820000       -0.090186 
      23       19.830000       -0.090186 
      23       19.870000       -0.046558 
      23       19.800000       -0.079969 
      23       19.880000       -0.120636 
      23       19.850000       -0.094788 
      23       19.870000       0.021684 
      23       19.800000       0.104296 
      23       19.840000       0.110447 
      23       19.880000       0.052966 
      23       19.910000       -0.002573 
      23       19.800000       0.003701 
      23       19.870000       0.003701 
      24       19.860000       0.009335 
      24       19.820000       -0.031486 
      24       19.820000       -0.100445 
      24       19.870000       -0.097191 
      24       19.920000       -0.020794 
      24       19.890000       -0.020794 
      24       19.940000       -0.020794 
      24       19.960000       -0.020794 
      24       20.010000       0.050784 
      24       19.930000       0.039221 
      24       19.970000       -0.023732 
      24       20.000000       -0.023732 
      24       19.960000       -0.028812 
      24       20.010000       -0.054702 
      24       19.990000       -0.098952 
      25       20.100000       -0.079787 
      25       20.140000       -0.021327 
      25       20.200000       -0.021327 
      25       20.200000       0.025919 
      25       20.160000       -0.018260 
      25       20.190000       -0.018260 
      25       20.200000       -0.018260 
      25       20.160000       -0.062410 
      25       20.250000       -0.019659 
      25       20.170000       0.019577 
      25       20.150000       0.021605 
      25       20.180000       0.021605 
      25       20.180000       0.021605 
      25       20.160000       -0.012310 
      25       20.180000       -0.012310 
      26       20.160000       -0.032221 
      26       20.230000       -0.015812 
      26       20.210000       -0.006075 
      26       20.190000       -0.029792 
      26       20.210000       -0.102865 
      26       20.190000       -0.124710 
      26       20.230000       -0.124710 
      26       20.160000       -0.102369 
      26       20.140000       -0.028374 
      26       20.020000       -0.028374 
      26       19.930000       0.058686 
      26       19.890000       0.058686 
      26       19.830000       0.070652 
      26       19.830000       0.034388 
      26       19.860000       0.064300 
      27       19.830000       0.096393 
      27       19.860000       0.028965 
      27       19.810000       -0.049461 
      27       19.820000       -0.005446 
      27       19.870000       0.065950 
      27       19.790000       0.022342 
      27       19.870000       0.022342 
      27       19.890000       0.022342 
      27       19.870000       0.022342 
      27       19.870000       -0.055140 
      27       19.810000       -0.055140 
      27       19.870000       -0.023934 
      27       19.820000       0.054798 
      27       19.810000       0.051593 
      27       19.870000       -0.040272 
      28       19.830000       -0.054545 
      28       19.850000       0.044557 
      28       19.820000       0.103037 
      28       19.790000       0.103037 
      28       19.860000       0.082992 
      28       19.840000       0.059057 
      28       19.870000       0.107741 
      28       19.860000       0.088849 
      28       19.830000       0.088849 
      28       19.890000       -0.036648 
      28       19.920000       -0.068213 
      28       20.090000       -0.024188 
      28       20.140000       -0.024188 
      28       20.200000       -0.045092 
      28       20.230000       -0.045092 
      29       20.160000       -0.074459 
      29       20.160000       -0.044428 
      29       20.200000       -0.044428 
      29       20.200000       -0.010697 
      29       20.250000       0.038675 
      29       20.150000       0.026656 
      29       20.250000       -0.064416 
      29       20.100000       -0.080736 
      29       20.190000       -0.054579 
      29       20.120000       -0.054579 
      29       20.170000       -0.058966 
      29       20.180000       -0.038325 
      29       20.050000       -0.017222 
      29       20.250000       0.009754 
      29       20.140000       0.028119 
      29       20.150000       0.039114 
      30       20.140000       0.056774 
      30       20.140000       0.078528 
      30       20.150000       0.084694 
      30       20.100000       0.104814 
      30       20.150000       0.104814 
      30       20.120000       0.104543 
      30       20.150000       0.104543 
      30       20.070000       0.104543 
      30       20.130000       0.029414 
      30       20.020000       -0.113677 
      30       19.980000       -0.166741 
      30       19.950000       -0.126868 
      30       19.870000       -0.126868 
      30       20.010000       -0.126868 
      30       19.900000       -0.103959 
      31       19.930000       -0.039331 
      31       19.920000       0.011903 
      31       19.990000       0.010182 
      31       19.990000       0.003355 
      31       20.030000       0.047732 
      31       19.980000       0.058288 
      31       19.870000       0.058288 
      31       20.030000       0.001462 
      31       19.940000       0.001462 
      31       19.950000       0.001462 
      31       19.910000       -0.010184 
      31       20.000000       0.004646 
      31       19.930000       0.010726 
      31       19.940000       0.010726 
      31       19.930000       0.030245 
      32       19.930000       0.030245 
      32       19.910000       0.030245 
      32       19.970000       0.034684 
      32       19.910000       0.053138 
      32       20.010000       0.049745 
      32       19.890000       0.035692 
      32       19.930000       0.019218 
      32       19.910000       -0.020826 
      32       19.910000       -0.057438 
      32       19.980000       0.011423 
      32       19.910000       0.094724 
      32       19.980000       0.094724 
      32       19.910000       0.070659 
      32       19.840000       0.016385 
      32       19.930000       -0.015397 
      32       19.980000       -0.016888 
      33       19.950000       -0.005287 
      33       19.880000       0.053870 
      33       20.000000       0.053870 
      33       19.860000       0.102448 
      33       19.950000       0.081567 
      33       19.920000       0.060305 
      33       19.920000       0.057466 
      33       19.940000       0.006363 
      33       19.910000       -0.027491 
      33       19.980000       0.002601 
      33       19.940000       0.028146 
      33       19.960000       -0.000789 
      33       19.940000       -0.000789 
      33       19.900000       -0.000789 
      33       19.930000       -0.045292 
      34       19.870000       -0.045292 
      34       19.950000       -0.045292 
      34       19.970000       -0.045292 
      34       19.940000       0.000974 
      34       19.910000       0.000974 
      34       19.910000       0.043885 
      34       19.980000       0.067935 
      34       19.900000       0.055211 
      34       19.910000       -0.015878 
      34       19.970000       -0.056486 
      34       19.930000       -0.050237 
      34       19.920000       -0.042996 
      34       19.920000       -0.042996 
      34       19.960000       -0.042996 
      34       19.880000       -0.042996 
      35       20.020000       -0.090580 
      35       19.920000       -0.104200 
      35       20.030000       -0.104200 
      35       19.910000       -0.002544 
      35       20.020000       0.080884 
      35       19.950000       0.024231 
      35       19.980000       -0.055918 
      35       19.870000       -0.087276 
      35       19.980000       -0.087284 
      35       19.890000       -0.087284 
      35       19.990000       -0.062881 
      35       19.920000       -0.086712 
      35       20.040000       -0.076414 
      35       19.970000       -0.076414 
      35       19.930000       0.046275 
      36       20.090000       0.137642 
      36       20.160000       0.137642 
      36       20.270000       0.137642 
      36       20.220000       0.137642 
      36       20.220000       0.101281 
      36       20.210000       0.038573 
      36       20.220000       0.001815 
      36       20.270000       0.001815 
      36       20.210000       -0.030560 
      36       20.180000       -0.014754 
      36       20.250000       0.019517 
      36       20.230000       0.026460 
      36       20.250000       0.019018 
      36       20.190000       -0.016573 
      36       20.270000       -0.046693 
      36       20.210000       -0.071840 
      37       20.250000       -0.106313 
      37       20.240000       -0.094426 
      37       20.210000       -0.094426 
      37       20.200000       -0.092821 
      37       20.110000       -0.074339 
      37       19.940000       -0.023219 
      37       19.900000       -0.023219 
      37       19.850000       0.015275 
      37       19.790000       -0.003075 
      37       19.790000       0.008041 
      37       19.810000       0.015964 
      37       19.860000       0.015964 
      37       19.860000       0.015964 
      37       19.850000       -0.023279 
      37       19.850000       -0.009177 
      38       19.810000       0.012043 
      38       19.840000       -0.013634 
      38       19.790000       -0.035326 
      38       19.890000       -0.035326 
      38       19.810000       0.035603 
      38       19.780000       0.111085 
      38       19.720000       0.111085 
      38       19.810000       0.111085 
      38       19.820000       0.117498 
      38       19.810000       0.117498 
      38       19.870000       0.071114 
      38       19.830000       -0.014839 
      38       19.850000       -0.078936 
      38       19.860000       -0.078936 
      38       19.970000       -0.096014 
      39       20.130000       -0.042572 
      39       20.100000       -0.002855 
      39       20.210000       -0.054545 
      39       20.140000       -0.080733 
      39       20.260000       -0.002173 
      39       20.140000       0.041635 
      39       20.170000       0.044070 
      39       20.230000       0.057198 
      39       20.180000       0.073178 
      39       20.160000       0.054632 
      39       20.100000       0.027526 
      39       20.160000       -0.010955 
      39       20.180000       -0.017025 
      39       20.210000       0.050555 
      39       20.130000       0.092146 
      40       20.130000       0.019854 
      40       20.120000       0.019854 
      40       20.140000       -0.086890 
      40       20.170000       -0.095673 
      40       20.130000       -0.043384 
      40       20.130000       -0.049538 
      40       20.200000       -0.049538 
      40       20.140000       -0.049538 
      40       20.140000       -0.077874 
      40       20.150000       -0.005274 
      40       20.150000       0.028517 
      40       20.110000       -0.024515 
      40       20.090000       -0.036232 
      40       19.960000       -0.028853 
      40       19.900000       -0.028853 
      41       19.860000       0.028829 
      41       19.810000       0.125086 
      41       19.840000       0.125086 
      41       19.830000       0.125086 
      41       19.820000       0.125724 
      41       19.890000       0.031269 
      41       19.870000       0.009716 
      41       19.870000       0.070351 
      41       19.830000       0.070351 
      41       19.850000       0.108266 
      41       19.860000       0.083631 
      41       19.840000       0.083631 
      41       19.820000       0.083631 
      41       19.920000       0.066416 
      41       19.890000       0.076794 
      42       19.860000       0.076794 
      42       19.870000       0.017921 
      42       19.890000       -0.061671 
      42       19.910000       -0.040664 
      42       19.920000       -0.040664 
      42       19.840000       -0.003519 
      42       19.810000       -0.003519 
      42       19.920000       -0.052641 
      42       19.900000       -0.129416 
      42       19.940000       -0.155519 
      42       20.030000       -0.142070 
      42       19.980000       -0.112609 
      42       19.930000       -0.070752 
      42       19.920000       0.028516 
      42       19.980000       0.094721 
      43       19.970000       0.041452 
      43       19.960000       -0.064030 
      43       19.970000       -0.093185 
      43       19.890000       -0.041217 
      43       19.970000       -0.041217 
      43       19.870000       -0.041217 
      43       19.940000       0.010214 
      43       19.990000       0.047358 
      43       19.940000       -0.027677 
      43       19.940000       -0.127975 
      43       19.920000       -0.054487 
      43       20.000000       0.055248 
      43       19.900000       0.055248 
      43       20.080000       0.075940 
      43       20.050000       0.061481 
      44       20.160000       0.035973 
      44       20.150000       0.035973 
      44       20.170000       0.016553 
      44       20.100000       0.016553 
      44       20.070000       -0.050159 
      44       20.140000       -0.050159 
      44       20.090000       -0.076288 
      44       20.120000       -0.064930 
      44       20.200000       -0.120168 
      44       20.110000       -0.125131 
      44       20.110000       -0.103546 
      44       20.090000       -0.103546 
      44       20.100000       -0.118420 
      44       20.120000       -0.080833 
      44       20.160000       0.028617 
      45       20.090000       0.098855 
      45       20.070000       0.041598 
      45       20.030000       -0.030739 
      45       20.110000       -0.030739 
      45       20.120000       -0.088071 
      45       20.050000       -0.142625 
      45       20.120000       -0.073320 
      45       20.160000       0.022698 
      45       20.080000       0.022698 
      45       20.130000       0.062513 
      45       20.160000       0.066261 
      45       20.050000       -0.006692 
      45       20.120000       -0.065125 
      45       20.090000       -0.001492 
      45       20.190000       0.080514 
      46       20.080000       0.064745 
      46       20.150000       0.029374 
      46       20.040000       0.033188 
      46       20.090000       0.013218 
      46       19.980000       -0.002289 
      46       19.910000       -0.002289 
      46       19.960000       -0.002289 
      46       19.920000       -0.005102 
      46       19.920000       0.016408 
      46       19.940000       0.016408 
      46       19.960000       0.016408 
      46       19.930000       0.033882 
      46       20.090000       0.033882 
      46       19.990000       0.041176 
      46       20.030000       0.041176 
      47       20.060000       0.054897 
      47       20.030000       0.116096 
      47       20.040000       0.116096 
      47       20.040000       0.173835 
      47       20.040000       0.123831 
      47       20.020000       0.034284 
      47       19.990000       0.018401 
      47       20.090000       0.038182 
      47       20.000000       0.038182 
      47       20.010000       0.071073 
      47       20.000000       0.063171 
      47       19.940000       0.063171 
      47       20.010000       0.000512 
      47       20.060000       -0.022626 
      47       20.020000       -0.059198 
      48       20.010000       -0.134484 
      48       20.100000       -0.110444 
      48       20.030000       -0.005230 
      48       20.080000       0.063261 
      48       20.070000       0.050597 
      48       19.960000       0.001304 
      48       20.070000       -0.066983 
      48       20.020000       -0.063669 
      48       20.060000       0.017673 
      48       19.970000       0.045476 
      48       20.010000       0.045476 
      48       19.960000       0.019699 
      48       20.000000       -0.050964 
      48       20.040000       -0.077987 
      48       20.060000       0.011105 
      49       20.040000       0.011105 
      49       19.990000       0.100109 
      49       20.040000       0.150609 
      49       19.950000       0.087394 
      49       19.890000       -0.036764 
      49       19.720000       -0.036764 
      49       19.840000       -0.071037 
      49       19.890000       -0.042828 
      49       19.800000       -0.022009 
      49       19.810000       -0.091910 
      49       19.880000       -0.091910 
      49       19.770000       -0.161949 
      49       19.840000       -0.084864 
      49       19.900000       -0.084864 
      49       19.810000       -0.003409 
      50       19.830000       -0.026670 
      50       19.910000       -0.026670 
      50       19.850000       -0.035909 
      50       19.830000       -0.035909 
      50       19.850000       -0.035909 
      50       19.900000       0.036064 
      50       19.800000       0.036064 
      50       19.870000       0.092793 
      50       19.830000       0.092793 
      50       19.820000       0.098187 
      50       19.770000       0.053640 
      50       19.870000       0.054485 
      50       19.860000       0.054485 
      50       19.920000       0.054485 
      50       19.890000       0.030355 
      51       19.980000       -0.075925 
      51       19.930000       -0.143066 
      51       19.870000       -0.143899 
      51       19.930000       -0.143899 
      51       19.960000       -0.081202 
      51       20.070000       -0.012103 
      51       20.170000       -0.026619 
      51       20.130000       -0.086195 
      51       20.230000       -0.076918 
      51       20.180000       -0.076918 
      51       20.160000       0.025477 
      51       20.190000       0.078369 
      51       20.180000       0.078369 
      51       20.140000       0.023579 
      51       20.140000       -0.024623 
      52       20.190000       -0.039438 
      52       20.170000       -0.039438 
      52       20.130000       -0.052774 
      52       20.140000       -0.052774 
      52       20.170000       -0.052774 
      52       20.120000       0.025828 
      52       20.150000       0.123139 
      52       20.110000       0.123139 
      52       20.180000       0.096172 
      52       20.200000       0.015868 
      52       20.110000       0.003661 
      52       20.100000       0.039143 
      52       20.090000       0.006781 
      52       20.100000       -0.046048 
      52       20.090000       -0.057645 
      52       20.120000       -0.050768 
      53       20.050000       -0.020617 
      53       20.060000       -0.018123 
      53       19.990000       -0.040169 
      53       20.070000       -0.001093 
      53       20.070000       0.057805 
      53       20.060000       0.096830 
      53       20.120000       0.065989 
      53       20.060000       -0.030808 
      53       20.100000       -0.118426 
      53       20.010000       -0.144266 
      53       20.040000       -0.117075 
      53       19.940000       -0.041421 
      53       19.890000       -0.041421 
      53       19.910000       0.014071 
      53       19.880000       0.054702 
      54       19.890000       0.127006 
      54       19.910000       0.146032 
      54       19.960000       0.113695 
      54       19.900000       0.068035 
      54       19.930000       0.068035 
      54       19.890000       0.049744 
      54       19.910000       0.065582 
      54       19.890000       0.096006 
      54       19.990000       0.084811 
      54       19.850000       0.072916 
      54       19.920000       0.093867 
      54       19.880000       0.076551 
      54       19.880000       0.041635 
      54       19.860000       0.034094 
      54       20.000000       0.041330 
      55       19.910000       0.080386 
      55       20.000000       0.119077 
      55       20.080000       0.126327 
      55       20.110000       0.128164 
      55       20.050000       0.134446 
      55       19.980000       0.161907 
      55       20.010000       0.161907 
      55       19.980000       0.151873 
      55       20.050000       0.151873 
      55       20.010000       0.151873 
      55       20.000000       0.079805 
      55       20.050000       0.034210 
      55       19.990000       0.031180 
      55       20.020000       0.064141 
      55       20.020000       0.078987 
      55       20.040000       0.078987 
      56       20.050000       0.046265 
      56       20.030000       0.014270 
      56       20.000000       -0.031125 
      56       20.020000       -0.076053 
      56       20.020000       -0.106425 
      56       20.060000       -0.106425 
      56       19.960000       -0.133225 
      56       20.010000       -0.107182 
      56       20.020000       -0.089584 
      56       20.010000       -0.118496 
      56       20.010000       -0.122982 
      56       20.020000       -0.122712 
      56       20.020000       -0.041521 
      56       20.040000       -0.041521 
      56       19.980000       0.047108 
      57       20.040000       0.049802 
      57       20.070000       0.044458 
      57       20.050000       0.084329 
      57       20.040000       0.147453 
      57       20.040000       0.121025 
      57       20.020000       0.018788 
      57       20.070000       -0.029857 
      57       19.990000       -0.004687 
      57       19.990000       -0.004687 
      57       20.070000       0.015325 
      57       20.060000       0.008033 
      57       20.060000       -0.039024 
      57       19.970000       -0.039024 
      57       19.960000       -0.045798 
      57       20.080000       0.039073 
      58       19.980000       0.083302 
      58       20.060000       0.025024 
      58       20.030000       -0.037509 
      58       20.010000       0.026437 
      58       20.030000       0.026437 
      58       20.010000       0.097435 
      58       20.010000       0.096156 
      58       20.020000       0.000529 
      58       20.020000       -0.145317 
      58       20.050000       -0.194022 
      58       20.020000       -0.142022 
      58       20.000000       -0.123678 
      58       19.940000       -0.108295 
      58       20.040000       -0.054409 
      58       20.030000       -0.025007 
      59       20.030000       -0.011448 
      59       20.010000       -0.011448 
      59       20.000000       -0.045033 
      59       19.990000       -0.075650 
      59       20.000000       -0.046962 
      59       20.100000       -0.046962 
      59       20.010000       -0.029215 
      59       19.990000       -0.050658 
      59       19.980000       -0.169927 
      59       19.920000       -0.169927 
      59       20.020000       -0.285341 
      59       19.960000       -0.285341 
      59       19.910000       -0.285341 
      59       19.910000       -0.225654 
      59       19.900000       -0.054870 
      60       19.890000       -0.054870 
      60       19.880000       -0.054870 
      60       19.900000       0.066348 
      60       19.900000       0.044898 
      60       19.920000       0.025318 
      60       19.870000       0.039794 
      60       19.890000       -0.012174 
      60       19.940000       -0.054067 
      60       19.910000       -0.083017 
      60       19.900000       -0.090893 
      60       19.880000       -0.125202 
      60       20.000000       -0.125202 
      60       19.870000       -0.125202 
      60       19.910000       -0.196146 
      60       19.860000       -0.232415 
      61       19.900000       -0.191421 
