

 time    ||    gripping force   ||   raspberry measurement 

      0       83.040000       -793.923077 
      0       65.070000       -793.923077 
      0       58.810000       -793.923077 
      0       32.540000       -793.923077 
      0       27.780000       -793.923077 
      1       10.590000       -785.983846 
      1       10.380000       -778.124008 
      1       14.240000       -770.342768 
      1       23.760000       -762.639340 
      1       49.000000       -755.012942 
      1       57.840000       -747.461644 
      1       68.600000       -739.881869 
      1       71.740000       -736.364365 
      2       73.420000       -693.513548 
      2       74.020000       -501.484323 
      2       74.410000       -184.957251 
      2       75.530000       6.857776 
      2       76.270000       49.474707 
      2       76.150000       52.877411 
      2       75.770000       52.962132 
      2       75.950000       52.960087 
      2       76.220000       52.962363 
      2       76.280000       52.971749 
      2       76.230000       53.022468 
      2       76.120000       53.111644 
      2       76.060000       53.210783 
      3       76.050000       53.311603 
      3       76.050000       53.421071 
      3       75.980000       53.553227 
      3       76.400000       53.659095 
      3       78.670000       53.671609 
      3       81.100000       53.637198 
      3       82.470000       53.601345 
      3       82.990000       53.617512 
      4       82.420000       53.662792 
      4       82.440000       53.719216 
      4       83.020000       53.800417 
      4       83.270000       53.837070 
      4       83.230000       53.807158 
      4       83.180000       53.760470 
      4       83.210000       53.785243 
      4       83.110000       53.800761 
      4       83.110000       53.732380 
      4       83.100000       53.721046 
      4       83.100000       53.817953 
      5       83.050000       53.862195 
      5       83.050000       53.847150 
      5       83.140000       53.850558 
      5       86.180000       53.906768 
      5       89.890000       53.943356 
      6       89.530000       53.936325 
      6       89.460000       53.919216 
      6       89.340000       53.926883 
      6       89.320000       53.911159 
      6       89.280000       53.899532 
      6       89.230000       53.920585 
      6       89.260000       53.895015 
      6       89.180000       53.833683 
      6       89.190000       53.842182 
      6       89.110000       53.945681 
      7       89.140000       54.008886 
      7       89.390000       53.988263 
      7       89.440000       53.967251 
      7       89.440000       53.960453 
      7       89.390000       53.961019 
      7       89.330000       53.954611 
      7       89.350000       53.937252 
      8       89.300000       53.920116 
      8       89.750000       53.937252 
      8       89.920000       53.954611 
      8       89.860000       53.960979 
      8       89.900000       53.959111 
      8       89.850000       53.950650 
      8       89.800000       53.911616 
      9       89.810000       53.881660 
      9       89.800000       53.911616 
      10       89.730000       53.950651 
      10       89.710000       53.959124 
      10       89.720000       53.961422 
      10       89.690000       53.960010 
      10       89.720000       53.961449 
      10       89.630000       53.960010 
      10       89.640000       53.961449 
      10       89.680000       53.960010 
      10       89.630000       53.961449 
      10       89.660000       53.959997 
      10       89.680000       53.961006 
      10       89.700000       53.954611 
      11       89.670000       53.937252 
      11       89.670000       53.920116 
      11       89.630000       53.937252 
      11       89.620000       53.954611 
      11       89.620000       53.961006 
      11       89.590000       53.959997 
      11       89.590000       53.961449 
      12       89.590000       53.960010 
      12       89.600000       53.961449 
      12       89.540000       53.959997 
      12       89.560000       53.960992 
      13       89.520000       53.954181 
      13       89.530000       53.932282 
      13       89.540000       53.900888 
      13       89.590000       53.916585 
      13       89.510000       53.951080 
      13       89.520000       53.959137 
      13       89.620000       53.961422 
      13       89.580000       53.960010 
      14       90.280000       53.961449 
      14       90.340000       53.960010 
      14       90.310000       53.961449 
      14       90.340000       53.960037 
      14       90.310000       53.962335 
      14       90.220000       53.970795 
      14       90.360000       54.009400 
      14       90.320000       54.034400 
      15       90.280000       53.985646 
      15       90.330000       53.930914 
      15       90.360000       53.938138 
      15       90.290000       53.954638 
      16       90.280000       53.961006 
      16       90.260000       53.959997 
      16       90.280000       53.961448 
      16       90.290000       53.959997 
      16       90.250000       53.961006 
      16       90.270000       53.954611 
      16       90.300000       53.937252 
      17       90.240000       53.920116 
      17       90.260000       53.937225 
      17       90.190000       53.953725 
      17       90.260000       53.950207 
      17       90.260000       53.911603 
      17       90.280000       53.881660 
      17       90.290000       53.911616 
      17       90.230000       53.950651 
      17       90.250000       53.959124 
      17       90.270000       53.961422 
      18       90.260000       53.960010 
      18       90.260000       53.961449 
      18       90.210000       53.960010 
      18       90.210000       53.961449 
      18       90.270000       53.960010 
      18       90.270000       53.961449 
      18       90.200000       53.960010 
      18       90.230000       53.961422 
      19       90.280000       53.959137 
      19       90.200000       53.951080 
      19       90.280000       53.916585 
      19       90.180000       53.900888 
      19       90.170000       53.932282 
      19       90.200000       53.954181 
      19       90.120000       53.960992 
      20       90.220000       53.959996 
      20       90.240000       53.961422 
      20       90.250000       53.959137 
      20       90.200000       53.951080 
      20       90.150000       53.916585 
      20       90.220000       53.900888 
      20       90.150000       53.932282 
      20       90.170000       53.954181 
      20       90.180000       53.960992 
      20       90.160000       53.959983 
      21       90.160000       53.961005 
      21       90.170000       53.954611 
      21       90.160000       53.937252 
      21       90.130000       53.920116 
      21       90.110000       53.937252 
      21       90.140000       53.954611 
      22       90.160000       53.961005 
      22       90.170000       53.959984 
      22       90.140000       53.961005 
      22       90.130000       53.954611 
      22       90.180000       53.937252 
      23       90.140000       53.920116 
      23       90.150000       53.937252 
      23       90.130000       53.954611 
      23       90.130000       53.961006 
      23       90.200000       53.959997 
      24       90.100000       53.961449 
      24       90.070000       53.960010 
      24       90.120000       53.961449 
      24       90.100000       53.960010 
      24       90.070000       53.961449 
      24       90.130000       53.959997 
      24       90.120000       53.961006 
      24       90.180000       53.954611 
      25       90.150000       53.937252 
      25       90.090000       53.920116 
      25       90.110000       53.937252 
      25       90.090000       53.954611 
      25       90.100000       53.961006 
      26       90.090000       53.959997 
      26       90.060000       53.961449 
      26       90.110000       53.960010 
      26       90.080000       53.961449 
      26       90.040000       53.960010 
      27       90.090000       53.961449 
      27       90.010000       53.960037 
      27       90.080000       53.962335 
      27       90.040000       53.970809 
      27       90.100000       54.009843 
      27       90.020000       54.039799 
      28       90.010000       54.009843 
      28       90.010000       53.970809 
      28       90.090000       53.962335 
      28       90.080000       53.960024 
      29       90.050000       53.961006 
      29       90.020000       53.954611 
      29       89.980000       53.937252 
      29       90.020000       53.920116 
      29       90.010000       53.937252 
      29       90.100000       53.954611 
      29       90.040000       53.961006 
      30       90.020000       53.959997 
      30       90.070000       53.961449 
      30       90.040000       53.960010 
      30       90.080000       53.961449 
      30       90.010000       53.960010 
      30       90.010000       53.961449 
      31       90.050000       53.960010 
      31       90.020000       53.961449 
      31       90.040000       53.960010 
      31       90.010000       53.961449 
      32       90.010000       53.960010 
      32       90.040000       53.961449 
      32       89.990000       53.960010 
      32       89.950000       53.961449 
      32       90.000000       53.960010 
      32       90.050000       53.961449 
      33       89.990000       53.960010 
      33       89.940000       53.961449 
      33       89.980000       53.960010 
      34       90.020000       53.961449 
      34       89.950000       53.960010 
      34       90.000000       53.961449 
      34       89.990000       53.960010 
      34       90.040000       53.961449 
      34       90.020000       53.960010 
      34       90.000000       53.961449 
      34       89.990000       53.960010 
      34       90.000000       53.961449 
      34       89.970000       53.960010 
      34       89.960000       53.961449 
      34       90.020000       53.960010 
      35       90.010000       53.961462 
      35       89.980000       53.960454 
      35       89.970000       53.966848 
      35       89.990000       53.984207 
      36       89.970000       54.001343 
      36       89.980000       53.984234 
      36       90.040000       53.967721 
      36       89.980000       53.970822 
      37       90.010000       54.004887 
      37       89.980000       54.020544 
      37       89.990000       53.988303 
      37       89.980000       53.956910 
      38       89.970000       53.917042 
      38       90.000000       53.900902 
      38       90.000000       53.932283 
      38       89.990000       53.954181 
      39       89.960000       53.960992 
      39       89.920000       53.959997 
      40       89.990000       53.961449 
      40       89.950000       53.960010 
      40       89.920000       53.961449 
      40       89.900000       53.960010 
      40       89.940000       53.961449 
      40       89.960000       53.960010 
      40       89.940000       53.961449 
      40       89.940000       53.960010 
      40       89.990000       53.961449 
      40       89.910000       53.960010 
      41       89.930000       53.961449 
      41       89.940000       53.960010 
      41       89.910000       53.961449 
      41       89.940000       53.960010 
      41       89.960000       53.961449 
      41       89.940000       53.960010 
      41       89.920000       53.961449 
      41       89.950000       53.960010 
      41       89.880000       53.961449 
      42       89.930000       53.960010 
      42       89.920000       53.961449 
      42       90.000000       53.960010 
      42       89.880000       53.961449 
      42       89.900000       53.960010 
      42       89.910000       53.961449 
      42       89.920000       53.960010 
      42       89.910000       53.961449 
      42       89.920000       53.960010 
      43       89.940000       53.961449 
      43       89.910000       53.960010 
      43       89.920000       53.961449 
      43       89.880000       53.960010 
      43       89.950000       53.961449 
      43       89.930000       53.959997 
      44       89.930000       53.960992 
      44       89.920000       53.954181 
      44       89.920000       53.932282 
      44       89.930000       53.900888 
      44       89.940000       53.916585 
      44       89.890000       53.951080 
      45       89.930000       53.959124 
      45       89.920000       53.960966 
      45       89.940000       53.954181 
      45       89.930000       53.932269 
      45       89.930000       53.900445 
      46       89.900000       53.911186 
      46       89.950000       53.926883 
      46       89.890000       53.919243 
      46       89.930000       53.937225 
      46       89.870000       53.954611 
      46       89.940000       53.961006 
      47       89.890000       53.959997 
      47       89.880000       53.961448 
      47       89.910000       53.959997 
      47       89.890000       53.960992 
      47       89.910000       53.954181 
      47       89.820000       53.932282 
      47       89.870000       53.900888 
      47       89.980000       53.916572 
      48       89.860000       53.950637 
      48       89.900000       53.953738 
      48       89.870000       53.937225 
      48       89.860000       53.920116 
      48       89.880000       53.937252 
      48       89.890000       53.954638 
      49       89.870000       53.961892 
      49       89.900000       53.970795 
      49       89.890000       54.009843 
      49       89.900000       54.039799 
      49       89.940000       54.009843 
      49       89.870000       53.970809 
      49       89.870000       53.962335 
      49       89.940000       53.960037 
      50       89.850000       53.961449 
      50       89.910000       53.960010 
      50       89.870000       53.961449 
      50       89.840000       53.959997 
      50       89.910000       53.961006 
      50       89.890000       53.954611 
      50       89.910000       53.937252 
      51       89.880000       53.920116 
      51       89.890000       53.937252 
      52       89.850000       53.954611 
      52       89.870000       53.961006 
      52       89.850000       53.959997 
      52       89.850000       53.961449 
      52       89.860000       53.960010 
      52       89.890000       53.961422 
      52       89.880000       53.959137 
      52       89.860000       53.951080 
      53       89.910000       53.916585 
      53       89.850000       53.900888 
      54       89.850000       53.932282 
      54       89.860000       53.954181 
      54       89.870000       53.960992 
      54       89.860000       53.959997 
      54       89.900000       53.961449 
      54       89.880000       53.960010 
      54       89.830000       53.961449 
      54       89.870000       53.960010 
      55       89.850000       53.961449 
      55       89.870000       53.960010 
      56       89.930000       53.961449 
      56       89.900000       53.960010 
      56       89.860000       53.961449 
      56       89.910000       53.960010 
      56       89.900000       53.961449 
      56       89.840000       53.960010 
      56       89.890000       53.961449 
      56       89.890000       53.960010 
      56       89.890000       53.961449 
      56       89.830000       53.960010 
      56       89.850000       53.961449 
      56       89.860000       53.960010 
      57       89.840000       53.961449 
      57       89.820000       53.960010 
      57       89.900000       53.961449 
      57       89.870000       53.960010 
      58       89.880000       53.961449 
      58       89.890000       53.960010 
      58       89.870000       53.961449 
      58       89.890000       53.960010 
      58       89.830000       53.961449 
      59       89.850000       53.960010 
      59       89.860000       53.961449 
      60       89.900000       53.960010 
      60       89.860000       53.961449 
      60       89.820000       53.960010 
      60       89.850000       53.961449 
      60       89.840000       53.960010 
      60       89.910000       53.961449 
      60       89.870000       53.960010 
      60       89.850000       53.961449 
      60       89.900000       53.960010 
