

 time    ||    gripping force   ||   raspberry measurement 

      0       85.420000       -797.014286 
      0       26.020000       -797.014286 
      0       10.180000       -797.014286 
      0       13.920000       -797.014286 
      0       74.270000       -797.014286 
      0       140.730000       -797.014286 
      0       240.790000       -797.014286 
      0       198.030000       -797.014286 
      0       129.040000       -797.014286 
      0       122.090000       -797.014281 
      1       121.520000       -789.042968 
      1       135.290000       -781.047209 
      1       157.840000       -777.524023 
      1       175.450000       -734.605650 
      1       175.770000       -542.293316 
      1       168.940000       -225.380079 
      1       155.890000       -33.414627 
      1       148.600000       9.375362 
      1       154.860000       13.375186 
      1       159.150000       14.700654 
      1       160.470000       16.215135 
      1       160.130000       16.931688 
      2       159.980000       16.443275 
      2       159.890000       15.541285 
      2       159.850000       15.087635 
      2       159.790000       15.212930 
      2       159.650000       15.628379 
      2       159.740000       15.998745 
      3       159.730000       16.200999 
      3       159.800000       16.149839 
      3       160.200000       15.950200 
      3       160.020000       15.824204 
      3       160.020000       15.799118 
      3       159.980000       15.805389 
      4       159.910000       15.845216 
      4       159.900000       15.885123 
      5       159.980000       15.894053 
      5       159.830000       15.901307 
      5       159.810000       15.918693 
      5       159.790000       15.935802 
      5       159.770000       15.917807 
      6       160.460000       15.890509 
      6       160.440000       15.845659 
      6       160.400000       15.805361 
      6       160.390000       15.797708 
      7       160.340000       15.805348 
      7       160.340000       15.845216 
      7       160.350000       15.885110 
      7       160.360000       15.893609 
      8       160.320000       15.895881 
      8       160.350000       15.893623 
      8       160.350000       15.885566 
      8       160.290000       15.851044 
      8       160.310000       15.834487 
      8       160.350000       15.855943 
      8       160.320000       15.839387 
      9       160.270000       15.804891 
      9       160.330000       15.797694 
      10       160.280000       15.805348 
      10       160.340000       15.845216 
      10       160.210000       15.885110 
      10       160.270000       15.893609 
      11       160.300000       15.895908 
      11       160.360000       15.894522 
      11       160.260000       15.896808 
      11       160.380000       15.904864 
      11       160.310000       15.939359 
      11       160.580000       15.955057 
      11       159.950000       15.923662 
      11       160.050000       15.901764 
      11       159.840000       15.894953 
      11       159.710000       15.895948 
      12       159.720000       15.894496 
      12       159.750000       15.895908 
      12       159.760000       15.893610 
      12       159.760000       15.885136 
      12       159.020000       15.846102 
      13       159.470000       15.816146 
      13       160.040000       15.846102 
      13       160.050000       15.885110 
      14       159.890000       15.892723 
      14       159.840000       15.885110 
      14       159.550000       15.846102 
      14       159.630000       15.816146 
      14       159.630000       15.846102 
      14       159.810000       15.885110 
      15       159.650000       15.892723 
      15       159.600000       15.885110 
      15       159.790000       15.846102 
      15       159.840000       15.816146 
      15       159.850000       15.846102 
      15       159.890000       15.885110 
      15       159.850000       15.892723 
      15       159.870000       15.885083 
      16       159.820000       15.845215 
      16       159.910000       15.805348 
      16       159.910000       15.797708 
      16       159.830000       15.805348 
      16       159.900000       15.845202 
      16       159.890000       15.884666 
      16       159.870000       15.888210 
      16       159.850000       15.871711 
      16       159.880000       15.854602 
      17       159.860000       15.871738 
      17       159.880000       15.889137 
      17       159.860000       15.896808 
      17       159.780000       15.910250 
      17       159.850000       15.963556 
      18       160.040000       15.994951 
      18       160.000000       15.947859 
      18       159.930000       15.907136 
      18       159.910000       15.894509 
      18       159.880000       15.885163 
      18       160.240000       15.846102 
      18       159.700000       15.816146 
      18       160.190000       15.846102 
      18       159.990000       15.885136 
      18       159.910000       15.893610 
      18       159.790000       15.895921 
      19       159.880000       15.894952 
      19       159.930000       15.901763 
      19       159.840000       15.923636 
      19       159.900000       15.954170 
      19       159.790000       15.928561 
      20       159.820000       15.856457 
      20       159.540000       15.816562 
      20       159.600000       15.840273 
      20       159.970000       15.855084 
      20       159.900000       15.823689 
      20       159.890000       15.802650 
      20       159.840000       15.805778 
      20       159.910000       15.845255 
      20       159.800000       15.885983 
      21       159.870000       15.903978 
      21       159.830000       15.939332 
      21       159.830000       15.955030 
      21       159.850000       15.922776 
      21       159.900000       15.890939 
      22       159.840000       15.845672 
      22       159.620000       15.805335 
      22       159.940000       15.796835 
      22       160.070000       15.795006 
      22       159.990000       15.802664 
      22       160.010000       15.834917 
      23       160.050000       15.909307 
      23       159.960000       15.949201 
      23       159.850000       15.923206 
      23       159.800000       15.901750 
      23       159.850000       15.894953 
      23       160.030000       15.895961 
      23       160.010000       15.894939 
      23       160.030000       15.901334 
      23       159.870000       15.918693 
      23       159.800000       15.935802 
      24       160.080000       15.917807 
      24       160.070000       15.890535 
      24       159.960000       15.846545 
      24       159.780000       15.816159 
      24       160.000000       15.846089 
      25       159.920000       15.884693 
      25       159.890000       15.888211 
      25       159.870000       15.871711 
      25       159.950000       15.854601 
      25       159.860000       15.871711 
      26       160.030000       15.888211 
      26       159.820000       15.884706 
      26       160.030000       15.846532 
      26       160.280000       15.821545 
      26       160.210000       15.870299 
      27       159.890000       15.925031 
      27       159.880000       15.917807 
      27       159.920000       15.901307 
      27       159.910000       15.894925 
      27       159.880000       15.895491 
      27       159.870000       15.888667 
      28       159.850000       15.866768 
      28       159.850000       15.835374 
      28       159.890000       15.851071 
      28       159.900000       15.885566 
      28       159.890000       15.893623 
      28       159.890000       15.895908 
      29       159.860000       15.894496 
      29       160.050000       15.895908 
      30       159.990000       15.893610 
      30       160.050000       15.885136 
      30       160.030000       15.846102 
      30       159.970000       15.816146 
      30       160.030000       15.846102 
      31       160.070000       15.885110 
      31       159.980000       15.892723 
      32       159.970000       15.885110 
      32       159.970000       15.846102 
      32       159.950000       15.816146 
      32       159.930000       15.846102 
      32       159.960000       15.885137 
      32       159.930000       15.893636 
      33       159.940000       15.896781 
      33       159.920000       15.904864 
      33       160.100000       15.939359 
      33       159.890000       15.955057 
      33       160.070000       15.923662 
      33       159.930000       15.901764 
      34       159.910000       15.894952 
      34       160.100000       15.895921 
      34       159.950000       15.893610 
      34       159.940000       15.885110 
      35       160.010000       15.845216 
      35       159.960000       15.805348 
      35       159.960000       15.797708 
      35       159.880000       15.805348 
      35       160.080000       15.845216 
      36       160.010000       15.885110 
      37       159.990000       15.893609 
      37       160.000000       15.895908 
      37       159.980000       15.894496 
      38       159.940000       15.895908 
      38       159.970000       15.893610 
      38       159.960000       15.885136 
      38       160.050000       15.846102 
      38       160.070000       15.816146 
      40       159.950000       15.846102 
      40       160.100000       15.885136 
      40       160.050000       15.893609 
      40       159.980000       15.895881 
      40       160.010000       15.893609 
      40       159.960000       15.885136 
      40       159.900000       15.846102 
      40       160.000000       15.816146 
      40       160.110000       15.846102 
      40       160.090000       15.885110 
      41       159.970000       15.892723 
      41       160.040000       15.885083 
      41       160.010000       15.845215 
      41       160.220000       15.805348 
      41       159.910000       15.797708 
      41       159.970000       15.805321 
      42       159.980000       15.844329 
      42       160.080000       15.874285 
      42       160.110000       15.844342 
      42       160.090000       15.805737 
      43       160.130000       15.802220 
      43       160.210000       15.818720 
      43       160.170000       15.835829 
      43       160.010000       15.818720 
      43       160.000000       15.802207 
      43       160.010000       15.805321 
      44       159.970000       15.839830 
      44       159.960000       15.860913 
      44       159.980000       15.853715 
      44       159.930000       15.871711 
      44       159.940000       15.889096 
      45       159.970000       15.895465 
      45       159.940000       15.893596 
      45       159.910000       15.885136 
      45       160.150000       15.846102 
      46       160.030000       15.816119 
      46       160.040000       15.845216 
      46       160.030000       15.874338 
      46       159.970000       15.845216 
      46       159.940000       15.816119 
      46       159.960000       15.846088 
      47       160.090000       15.884680 
      47       160.040000       15.887754 
      47       160.000000       15.865855 
      47       159.860000       15.824549 
      47       159.920000       15.801790 
      47       160.090000       15.794953 
      47       159.950000       15.795948 
      47       159.890000       15.794523 
      48       160.050000       15.796821 
      48       160.120000       15.805294 
      48       160.000000       15.844329 
      48       159.950000       15.874311 
      48       159.910000       15.845215 
      48       159.890000       15.816119 
      48       160.110000       15.846088 
      48       160.060000       15.884693 
      48       160.140000       15.888210 
      48       160.050000       15.871684 
      49       159.920000       15.853715 
      49       159.980000       15.860939 
      49       159.960000       15.840703 
      50       159.950000       15.815676 
      50       159.960000       15.845202 
      50       159.950000       15.874311 
      50       160.000000       15.844329 
      50       159.870000       15.805321 
      50       160.000000       15.797708 
      52       160.000000       15.805348 
      52       159.940000       15.845215 
      52       160.120000       15.885083 
      52       160.080000       15.892723 
      52       160.100000       15.885110 
      52       160.060000       15.846101 
      52       159.940000       15.816119 
      53       160.250000       15.845229 
      53       160.030000       15.874768 
      53       160.090000       15.850158 
      53       159.930000       15.834461 
      54       159.970000       15.855970 
      54       159.940000       15.840273 
      54       159.970000       15.815663 
      54       159.930000       15.845215 
      54       159.910000       15.874768 
      54       159.990000       15.850185 
      54       159.960000       15.835347 
      55       159.960000       15.866741 
      55       159.980000       15.887781 
      55       159.910000       15.884680 
      55       159.990000       15.846088 
      56       159.950000       15.816119 
      56       159.980000       15.845215 
      56       159.950000       15.874311 
      56       159.990000       15.844342 
      56       159.980000       15.805751 
      56       160.000000       15.802677 
      57       159.950000       15.824575 
      57       159.980000       15.865855 
      57       159.950000       15.887754 
      57       159.990000       15.884680 
      57       159.960000       15.846088 
      57       159.980000       15.816146 
      58       160.020000       15.846102 
      58       159.990000       15.885110 
      58       159.990000       15.892723 
      58       159.990000       15.885083 
      58       159.970000       15.845215 
      58       159.900000       15.805348 
      58       159.980000       15.797708 
      58       160.080000       15.805348 
      59       159.980000       15.845215 
      59       159.980000       15.885083 
      59       160.010000       15.892723 
      59       159.970000       15.885083 
      59       159.940000       15.845215 
      59       159.920000       15.805321 
      59       160.120000       15.796821 
      59       159.950000       15.794550 
      60       159.930000       15.796821 
      60       159.900000       15.805294 
      60       160.150000       15.844329 
      60       160.130000       15.874285 
      60       159.950000       15.844329 
      60       160.050000       15.805321 
      61       159.960000       15.797708 
