

 time    ||    gripping force   ||   raspberry measurement 

      0       0.010000       -794.069697 
      0       0.010000       -794.069697 
      0       0.010000       -794.069697 
      0       0.050000       -794.069697 
      0       0.020000       -794.069697 
      0       0.020000       -794.069697 
      0       0.070000       -794.069697 
      0       0.050000       -794.069697 
      0       0.020000       -794.069697 
      0       0.030000       -794.069692 
      0       0.050000       -794.068512 
      1       0.030000       -786.022615 
      1       0.040000       -782.503297 
      1       0.020000       -739.629501 
      1       0.050000       -547.485517 
      1       0.030000       -230.704680 
      1       0.020000       -38.576394 
      1       0.040000       4.294301 
      1       0.030000       7.811764 
      1       0.000000       7.919437 
      1       0.030000       7.918332 
      1       0.030000       7.910281 
      1       0.090000       7.875785 
      1       0.030000       7.860088 
      1       0.050000       7.891483 
      1       0.050000       7.913381 
      1       0.050000       7.920192 
      2       0.000000       7.919197 
      2       0.010000       7.920649 
      2       0.030000       7.919210 
      2       0.050000       7.920649 
      2       0.010000       7.919197 
      2       0.050000       7.920192 
      2       0.020000       7.913381 
      2       0.020000       7.891483 
      2       0.040000       7.860088 
      2       0.030000       7.875785 
      3       0.020000       7.910280 
      3       0.030000       7.918324 
      3       0.270000       7.920166 
      3       0.120000       7.913381 
      4       0.110000       7.891483 
      4       0.170000       7.860088 
      5       0.070000       7.875785 
      5       0.120000       7.910281 
      5       0.150000       7.918337 
      5       0.230000       7.920622 
      5       0.150000       7.919210 
      5       0.240000       7.920649 
      5       0.270000       7.919210 
      5       0.290000       7.920622 
      6       0.410000       7.918324 
      6       0.970000       7.909851 
      6       36.210000       7.870816 
      6       45.440000       7.840834 
      7       50.390000       7.869930 
      7       53.420000       7.899052 
      7       78.300000       7.869930 
      7       81.030000       7.840807 
      7       81.380000       7.869929 
      7       80.880000       7.899026 
      7       80.560000       7.869044 
      7       80.280000       7.830035 
      7       80.000000       7.822422 
      7       79.700000       7.830117 
      7       79.570000       7.871811 
      7       79.310000       7.935074 
      8       79.360000       8.061986 
      8       78.810000       8.321550 
      8       78.420000       8.587810 
      8       74.200000       8.763563 
      8       71.770000       8.913870 
      8       69.260000       9.095799 
      8       69.090000       9.205685 
      9       66.030000       9.195444 
      9       64.510000       9.238506 
      9       62.620000       9.250977 
      9       61.330000       9.148460 
      9       56.980000       9.121553 
      9       50.800000       9.164943 
      9       49.930000       9.134491 
      9       49.920000       9.074929 
      9       49.860000       9.089587 
      10       49.580000       9.095468 
      10       49.210000       9.025951 
      10       48.610000       8.966829 
      10       48.040000       8.896369 
      10       47.160000       8.846273 
      10       46.840000       8.870373 
      10       45.620000       8.899039 
      10       43.080000       8.869043 
      10       43.060000       8.830009 
      10       42.870000       8.821535 
      10       42.910000       8.819224 
      10       42.840000       8.820206 
      11       42.910000       8.813798 
      11       42.820000       8.795995 
      11       42.880000       8.773447 
      11       42.810000       8.765942 
      11       42.770000       8.738035 
      11       40.220000       8.696881 
      11       32.610000       8.660035 
      11       28.140000       8.668614 
      12       28.130000       8.664044 
      12       28.120000       8.576242 
      12       28.100000       8.512208 
      12       27.370000       8.571716 
      12       27.280000       8.649772 
      12       27.360000       8.666731 
      12       27.330000       8.671717 
      13       26.080000       8.672533 
      13       25.320000       8.678413 
      13       24.980000       8.622685 
      13       24.960000       8.497282 
      13       24.910000       8.359091 
      13       24.910000       8.191979 
      13       24.900000       8.021565 
      13       24.880000       7.944529 
      14       24.900000       7.944805 
      14       24.810000       7.960584 
      14       24.760000       7.943408 
      14       24.790000       7.926048 
      14       24.770000       7.919654 
      14       24.820000       7.920662 
      14       24.790000       7.919211 
      15       24.160000       7.920649 
      15       23.730000       7.919210 
      15       23.600000       7.920649 
      16       21.570000       7.919197 
      16       21.600000       7.920192 
      16       21.600000       7.913381 
      16       21.540000       7.891469 
      16       21.560000       7.859632 
      16       21.560000       7.869956 
      16       21.550000       7.881114 
      16       21.570000       7.859215 
      16       21.590000       7.875759 
      16       21.560000       7.910280 
      17       20.670000       7.918337 
      17       20.550000       7.920636 
      17       20.510000       7.919653 
      17       20.460000       7.926048 
      18       20.350000       7.943408 
      18       20.340000       7.960543 
      18       20.220000       7.943408 
      18       20.200000       7.926048 
      18       20.170000       7.919653 
      18       20.150000       7.920635 
      18       20.100000       7.918324 
      19       20.080000       7.909824 
      21       20.090000       7.869930 
      21       20.120000       7.830062 
      22       20.140000       7.822422 
      22       20.110000       7.830062 
      22       20.080000       7.869930 
      22       20.140000       7.909824 
      23       20.100000       7.918324 
      23       20.140000       7.920622 
      23       20.130000       7.919210 
      23       20.110000       7.920649 
      24       20.130000       7.919210 
      24       20.080000       7.920649 
      24       20.150000       7.919210 
      24       20.070000       7.920649 
      24       20.060000       7.919210 
      24       20.110000       7.920649 
      24       20.090000       7.919210 
      24       20.130000       7.920649 
      24       20.080000       7.919210 
      24       20.190000       7.920622 
      25       20.120000       7.918324 
      25       20.150000       7.909824 
      25       20.150000       7.869930 
      25       20.160000       7.830062 
      25       20.110000       7.822422 
      25       20.130000       7.830062 
      25       20.130000       7.869917 
      25       20.160000       7.909381 
      26       20.100000       7.912925 
      26       20.120000       7.896425 
      26       20.140000       7.879316 
      26       20.150000       7.896452 
      26       20.110000       7.913811 
      27       20.150000       7.920206 
      27       20.080000       7.919197 
      27       20.080000       7.920622 
      27       20.060000       7.918324 
      27       20.090000       7.909864 
      28       20.160000       7.871260 
      28       20.100000       7.846259 
      28       20.140000       7.895013 
      28       20.110000       7.949745 
      28       20.100000       7.942521 
      28       20.140000       7.926021 
      28       20.080000       7.919653 
      28       20.130000       7.920662 
      29       20.140000       7.919211 
      29       20.200000       7.920649 
      29       20.070000       7.919210 
      29       20.120000       7.920649 
      29       20.170000       7.919210 
      29       20.100000       7.920649 
      29       20.100000       7.919210 
      29       20.110000       7.920649 
      29       20.090000       7.919210 
      30       20.150000       7.920649 
      30       20.160000       7.919210 
      30       20.120000       7.920622 
      30       20.100000       7.918337 
      30       20.140000       7.910281 
      30       20.100000       7.875786 
      30       20.140000       7.860115 
      31       20.100000       7.892342 
      31       20.070000       7.923306 
      31       20.100000       7.958218 
      31       20.140000       7.955561 
      31       20.090000       7.908509 
      32       20.120000       7.903167 
      32       20.160000       7.925066 
      32       20.090000       7.968627 
      32       20.110000       7.999429 
      32       20.090000       7.974442 
      32       20.110000       7.954206 
      33       20.110000       7.961429 
      33       20.100000       7.943421 
      33       20.160000       7.925605 
      33       20.110000       7.914295 
      33       20.120000       7.897795 
      33       20.140000       7.895514 
      33       20.090000       7.969043 
      33       20.110000       8.033494 
      33       20.150000       7.992797 
      34       20.070000       7.935394 
      34       20.120000       7.921978 
      34       20.110000       7.919251 
      34       20.130000       7.920663 
      34       20.090000       7.919640 
      34       20.160000       7.925605 
      35       20.130000       7.938009 
      35       20.110000       7.936359 
      35       20.120000       7.903956 
      35       20.130000       7.907250 
      36       20.110000       7.938452 
      36       20.090000       7.960113 
      36       20.130000       7.943394 
      36       20.160000       7.926048 
      36       20.140000       7.919654 
      36       20.070000       7.920676 
      36       20.130000       7.919654 
      36       20.050000       7.926048 
      36       20.100000       7.943408 
      36       20.140000       7.960543 
      37       20.120000       7.943407 
      37       20.110000       7.926021 
      37       20.130000       7.918781 
      37       20.110000       7.910294 
      37       20.120000       7.875786 
      37       20.090000       7.860088 
      37       20.150000       7.891483 
      37       20.080000       7.913408 
      37       20.110000       7.921066 
      38       20.130000       7.929565 
      38       20.090000       7.964074 
      38       20.120000       7.979771 
      38       20.170000       7.948403 
      38       20.140000       7.927351 
      38       20.070000       7.930035 
      39       20.120000       7.964087 
      39       20.190000       7.979771 
      39       20.100000       7.948377 
      39       20.090000       7.926478 
      39       20.100000       7.919667 
      39       20.140000       7.920676 
      39       20.140000       7.919654 
      39       20.110000       7.926048 
      40       20.120000       7.943408 
      40       20.130000       7.960543 
      40       20.120000       7.943408 
      40       20.180000       7.926048 
      40       20.120000       7.919654 
      40       20.130000       7.920663 
      40       20.110000       7.919237 
      40       20.110000       7.921522 
      40       20.080000       7.929579 
      40       20.110000       7.964074 
      40       20.090000       7.979771 
      40       20.060000       7.948377 
      40       20.090000       7.926478 
      41       20.090000       7.919667 
      41       20.100000       7.920662 
      41       20.160000       7.919211 
      41       20.090000       7.920662 
      41       20.160000       7.919654 
      41       20.130000       7.926048 
      41       20.120000       7.943394 
      41       20.120000       7.960087 
      41       20.190000       7.937579 
      41       20.160000       7.896908 
      41       20.140000       7.861418 
      42       20.110000       7.886597 
      42       20.120000       7.958675 
      42       20.130000       7.998126 
      42       20.140000       7.969016 
      42       20.140000       7.930008 
      42       20.110000       7.921535 
      42       20.140000       7.919237 
      42       20.140000       7.920649 
      42       20.110000       7.919237 
      42       20.170000       7.921522 
      43       20.100000       7.929579 
      43       20.170000       7.964074 
      43       20.140000       7.979771 
      43       20.130000       7.948377 
      43       20.120000       7.926478 
      43       20.170000       7.919694 
      43       20.160000       7.921549 
      43       20.110000       7.930009 
      43       20.140000       7.969043 
      43       20.130000       7.999026 
      44       20.100000       7.969929 
      44       20.150000       7.940807 
      44       20.140000       7.969943 
      44       20.130000       7.999469 
      44       20.130000       7.974443 
      44       20.090000       7.954232 
      44       20.180000       7.962303 
      44       20.110000       7.953803 
      45       20.160000       7.969473 
      45       20.130000       7.980228 
      45       20.160000       7.948833 
      45       20.110000       7.931877 
      45       20.100000       7.943864 
      45       20.140000       7.960557 
      45       20.090000       7.943408 
      45       20.070000       7.926075 
      45       20.150000       7.920540 
      46       20.170000       7.931460 
      46       20.150000       7.967605 
      46       20.110000       8.000437 
      46       20.160000       7.967605 
      46       20.120000       7.931461 
      46       20.110000       7.920554 
      46       20.140000       7.926545 
      46       20.140000       7.949707 
      46       20.140000       7.995968 
      47       20.160000       8.036665 
      47       20.090000       8.049261 
      47       20.120000       7.994113 
      47       20.160000       7.935434 
      47       20.120000       7.921979 
      47       20.160000       7.919250 
      47       20.140000       7.920623 
      47       20.190000       7.918324 
      47       20.140000       7.909864 
      48       20.090000       7.871260 
      48       20.150000       7.846259 
      48       20.130000       7.895014 
      48       20.080000       7.949758 
      48       20.120000       7.942964 
      48       20.160000       7.931420 
      48       20.160000       7.943850 
      48       20.180000       7.960556 
      48       20.170000       7.943408 
      48       20.150000       7.926048 
      48       20.130000       7.919654 
      49       20.130000       7.920676 
      49       20.100000       7.919667 
      49       20.140000       7.926478 
      49       20.130000       7.948403 
      49       20.100000       7.980658 
      49       20.160000       7.974885 
      49       20.140000       7.978416 
      49       20.150000       8.006710 
      49       20.130000       7.991855 
      50       20.130000       7.972215 
      50       20.130000       7.954662 
      50       20.130000       7.969500 
      50       20.100000       7.980214 
      50       20.130000       7.948390 
      50       20.150000       7.926451 
      50       20.090000       7.918781 
      50       20.170000       7.909864 
      50       20.160000       7.870816 
      50       20.170000       7.840860 
      51       20.100000       7.870816 
      51       20.110000       7.909851 
      51       20.130000       7.918324 
      51       20.160000       7.920635 
      51       20.150000       7.919653 
      51       20.120000       7.926048 
      51       20.140000       7.943408 
      51       20.160000       7.960543 
      51       20.120000       7.943407 
      52       20.120000       7.926021 
      52       20.120000       7.918767 
      52       20.110000       7.909864 
      52       20.100000       7.870803 
      52       20.160000       7.840404 
      52       19.970000       7.864987 
      52       19.860000       7.880685 
      52       19.440000       7.859229 
      52       18.920000       7.876658 
      52       18.710000       7.921508 
      53       18.600000       7.971701 
      53       17.750000       8.019639 
      53       17.690000       7.988271 
      53       17.260000       7.934978 
      53       17.250000       7.921965 
      53       17.220000       7.919250 
      53       17.200000       7.920649 
      54       17.230000       7.919210 
      54       17.210000       7.920649 
      54       17.200000       7.919210 
      54       17.240000       7.920649 
      54       17.160000       7.919210 
      54       17.240000       7.920649 
      54       17.200000       7.919210 
      54       17.250000       7.920649 
      54       17.220000       7.919210 
      55       17.180000       7.920649 
      55       17.220000       7.919210 
      55       17.210000       7.920649 
      55       17.230000       7.919210 
      55       17.270000       7.920649 
      55       17.160000       7.919211 
      55       17.260000       7.920676 
      55       17.200000       7.920110 
      56       17.190000       7.931877 
      56       17.210000       7.972574 
      56       17.200000       8.019665 
      56       17.230000       7.988271 
      56       17.270000       7.934978 
      56       17.230000       7.921965 
      56       17.190000       7.919250 
      56       17.270000       7.920623 
      57       17.210000       7.918324 
      57       17.230000       7.909864 
      57       17.220000       7.871260 
      57       17.220000       7.846259 
      57       17.210000       7.895013 
      57       17.180000       7.949745 
      58       17.240000       7.942521 
      58       17.230000       7.926021 
      58       17.240000       7.919653 
      58       17.240000       7.920662 
      59       17.240000       7.919211 
      59       17.250000       7.920649 
      59       17.210000       7.919210 
      59       17.260000       7.920649 
      59       17.260000       7.919211 
      59       17.210000       7.920662 
      59       17.210000       7.919653 
      59       17.260000       7.926008 
      60       17.290000       7.942078 
      60       17.220000       7.944359 
      60       17.200000       7.871260 
      60       17.270000       7.811764 
      60       17.240000       7.871259 
