Human trial picking the raspberry twin 

 time    ||     output     ||     loadcell

      0.000000       -799.000000       0.020000 
      0.017425       -799.000000       0.000000 
      0.032058       -799.000000       0.030000 
      0.046167       -799.000000       0.010000 
      0.077353       -799.000000       0.060000 
      0.093043       -799.000000       0.020000 
      0.123765       -799.000000       0.000000 
      0.139704       -799.000000       0.050000 
      0.155844       -799.000000       0.000000 
      0.185767       -798.999995       0.010000 
      0.201915       -798.998807       0.020000 
      0.217891       -798.891877       0.060000 
      0.231886       -795.350830       0.010000 
      0.248002       -752.212048       0.000000 
      0.263453       -558.877439       0.010000 
      0.279569       -240.122557       0.090000 
      0.295485       -46.787948       0.030000 
      0.310476       -3.649166       0.020000 
      0.326426       -0.108119       0.110000 
      0.342288       -0.001188       0.070000 
      0.357752       -0.000001       0.060000 
      0.374676       0.000004       0.020000 
      0.389731       0.000004       0.070000 
      0.406589       0.000004       0.090000 
      0.421890       0.000004       0.050000 
      0.436742       0.000004       0.130000 
      0.452219       0.000004       0.060000 
      0.469879       0.000004       0.120000 
      0.483869       0.000004       0.040000 
      0.500050       0.000004       0.040000 
      0.515899       0.000004       0.010000 
      0.530844       0.000004       0.040000 
      0.544806       0.000004       0.000000 
      0.575723       0.000004       0.110000 
      0.592679       0.000004       0.100000 
      0.606875       0.000004       0.010000 
      0.636809       0.000004       0.010000 
      0.652843       0.000004       0.020000 
      0.698072       0.000004       0.020000 
      0.713688       0.000004       0.010000 
      0.730613       0.000004       0.040000 
      0.745574       0.000004       0.070000 
      0.775175       0.000004       0.170000 
      0.790751       0.000004       0.100000 
      0.806977       0.000004       0.020000 
      0.821561       0.000004       0.110000 
      0.837994       0.000004       0.130000 
      0.853103       0.000004       0.060000 
      0.867887       0.000004       0.100000 
      0.883029       0.000004       0.010000 
      0.899000       0.000004       0.110000 
      0.914881       0.000004       0.020000 
      0.929834       0.000004       0.090000 
      0.946969       0.000004       0.020000 
      0.963040       0.000004       0.040000 
      0.978503       0.000004       0.030000 
      0.993958       0.000004       0.010000 
      1.009959       0.000004       0.070000 
      1.024619       0.000004       0.040000 
      1.040420       0.000004       0.050000 
      1.056573       0.000004       0.060000 
      1.072663       0.000004       0.090000 
      1.087992       0.000004       0.000000 
      1.103550       0.000004       0.060000 
      1.118675       0.000004       0.080000 
      1.150126       0.000004       0.000000 
      1.167031       0.000004       0.150000 
      1.181138       0.000004       0.070000 
      1.197091       0.000004       0.020000 
      1.211995       0.000004       0.060000 
      1.228749       0.000004       0.010000 
      1.244518       0.000004       0.050000 
      1.259575       0.000004       0.000000 
      1.275929       0.000004       0.000000 
      1.291402       0.000004       0.010000 
      1.306040       0.000004       0.030000 
      1.322108       0.000004       0.010000 
      1.336703       0.000004       0.050000 
      1.352656       0.000004       0.070000 
      1.367888       0.000004       0.030000 
      1.383702       0.000004       0.040000 
      1.398660       0.000004       0.070000 
      1.414616       0.000004       0.000000 
      1.429588       0.000004       0.050000 
      1.445535       0.000004       0.000000 
      1.460497       0.000004       0.100000 
      1.474641       0.000004       0.070000 
      1.491143       0.000004       0.080000 
      1.505688       0.000004       0.010000 
      1.537082       0.000004       0.020000 
      1.554038       0.000004       0.010000 
      1.569753       0.000004       0.040000 
      1.584723       0.000004       0.020000 
      1.599673       0.000004       0.040000 
      1.630591       0.000004       0.000000 
      1.646918       0.000004       0.070000 
      1.662910       0.000004       0.090000 
      1.677926       0.000004       0.100000 
      1.692066       0.000004       0.050000 
      1.708000       0.000004       0.100000 
      1.736922       0.000004       0.040000 
      1.752825       0.000004       0.030000 
      1.768851       0.000004       0.020000 
      1.783349       0.000004       0.030000 
      1.800354       0.000004       0.050000 
      1.815025       0.000004       0.020000 
      1.831974       0.000004       0.000000 
      1.846930       0.000004       0.040000 
      1.863029       0.000004       0.060000 
      1.877989       0.000004       0.030000 
      1.893114       0.000004       0.020000 
      1.909055       0.000004       0.010000 
      1.924187       0.000004       0.050000 
      1.939146       0.000004       0.040000 
      1.956108       0.000004       0.060000 
      1.970801       0.000004       0.040000 
      1.986762       0.000004       0.010000 
      2.003285       0.000004       0.010000 
      2.019281       0.000004       0.060000 
      2.034497       0.000004       0.010000 
      2.049726       0.000004       0.030000 
      2.064949       0.000004       0.010000 
      2.080077       0.000004       0.050000 
      2.095109       0.000004       0.030000 
      2.110284       0.000004       0.030000 
      2.125101       0.000004       0.040000 
      2.142210       0.000004       0.030000 
      2.156019       0.000004       0.000000 
      2.170898       0.000004       0.070000 
      2.186713       0.000004       0.010000 
      2.218305       0.000004       0.030000 
      2.234262       0.000004       0.010000 
      2.249561       0.000004       0.040000 
      2.264783       0.000004       0.030000 
      2.281540       0.000004       0.020000 
      2.295660       0.000004       0.010000 
      2.313083       0.000004       0.050000 
      2.328742       0.000004       0.090000 
      2.345037       0.000004       0.080000 
      2.360199       0.000004       0.090000 
      2.375603       0.000004       0.020000 
      2.390588       0.000004       0.010000 
      2.406506       0.000004       0.070000 
      2.420855       0.000004       0.030000 
      2.437298       0.000004       0.020000 
      2.452035       0.000004       0.030000 
      2.466245       0.000004       0.050000 
      2.483185       0.000004       0.020000 
      2.498295       0.000004       0.130000 
      2.512989       0.000004       0.090000 
      2.530020       0.000004       0.010000 
      2.544814       0.000004       0.010000 
      2.561902       0.000004       0.150000 
      2.577497       0.000004       0.120000 
      2.593244       0.000004       0.030000 
      2.608975       0.000004       0.090000 
      2.625219       0.000004       0.080000 
      2.640343       0.000004       0.030000 
      2.685731       0.000004       0.080000 
      2.701701       0.000004       0.070000 
      2.715625       0.000004       0.010000 
      2.746917       0.000004       0.020000 
      2.763804       0.000004       0.060000 
      2.780524       0.000004       0.080000 
      2.795515       0.000004       0.000000 
      2.811164       0.000004       0.030000 
      2.827094       0.000004       0.040000 
      2.843161       0.000004       0.020000 
      2.857328       0.000004       0.040000 
      2.872879       0.000004       0.030000 
      2.889274       0.000004       0.000000 
      2.904114       0.000004       0.080000 
      2.920516       0.000004       0.050000 
      2.934517       0.000004       0.080000 
      2.950442       0.000004       0.040000 
      2.965130       0.000004       0.000000 
      2.981534       0.000004       0.050000 
      2.996844       0.000004       0.090000 
      3.011894       0.000004       0.060000 
      3.028853       0.000004       0.000000 
      3.059704       0.000004       0.040000 
      3.075282       0.000004       0.020000 
      3.091936       0.000004       0.010000 
      3.106866       0.000004       0.100000 
      3.122055       0.000004       0.070000 
      3.137980       0.000004       0.020000 
      3.152791       0.000004       0.010000 
      3.168818       0.000004       0.040000 
      3.184728       0.000004       0.080000 
      3.199152       0.000004       0.040000 
      3.216752       0.000004       0.010000 
      3.231392       0.000004       0.040000 
      3.246083       0.000004       0.000000 
      3.262787       0.000004       0.020000 
      3.278582       0.000004       0.040000 
      3.294016       0.000004       0.000000 
      3.309134       0.000004       0.010000 
      3.325213       0.000004       0.080000 
      3.340943       0.000004       0.090000 
      3.356843       0.000004       0.020000 
      3.373339       0.000004       0.000000 
      3.389068       0.000004       0.050000 
      3.405033       0.000004       0.050000 
      3.420593       0.000004       0.010000 
      3.435312       0.000004       0.050000 
      3.450232       0.000004       0.010000 
      3.465927       0.000004       0.040000 
      3.481264       -0.000009       0.070000 
      3.496978       -0.000439       0.020000 
      3.526273       -0.005395       0.050000 
      3.543811       -0.024193       0.030000 
      3.557992       -0.039890       0.050000 
      3.603793       -0.024193       0.070000 
      3.620041       -0.005395       0.060000 
      3.635663       -0.000439       0.000000 
      3.649723       -0.000009       0.040000 
      3.665597       0.000004       0.060000 
      3.680608       0.000004       0.030000 
      3.695796       0.000004       0.090000 
      3.711971       0.000004       0.030000 
      3.727960       0.000004       0.020000 
      3.757969       0.000004       0.050000 
      3.789283       0.000004       0.000000 
      3.805926       0.000004       0.020000 
      3.819828       0.000004       0.050000 
      3.836458       0.000004       0.000000 
      3.852040       0.000004       0.090000 
      3.867630       0.000004       0.070000 
      3.881832       0.000004       0.010000 
      3.897816       0.000004       0.010000 
      3.913904       0.000004       0.050000 
      3.929137       0.000004       0.030000 
      3.944466       0.000004       0.050000 
      3.960425       0.000004       0.020000 
      3.977497       0.000004       0.050000 
      3.991935       0.000004       0.180000 
      4.006771       0.000004       0.120000 
      4.023871       0.000004       0.050000 
      4.039940       0.000004       0.070000 
      4.055259       0.000004       0.060000 
      4.069882       0.000004       0.030000 
      4.085135       0.000004       0.010000 
      4.100466       0.000004       0.050000 
      4.116098       0.000004       0.130000 
      4.132902       0.000004       0.080000 
      4.147044       0.000004       0.010000 
      4.162508       0.000004       0.030000 
      4.178523       0.000004       0.000000 
      4.193913       0.000004       0.080000 
      4.210465       0.000004       0.090000 
      4.225764       0.000004       0.030000 
      4.241246       0.000004       0.000000 
      4.256595       0.000004       0.050000 
      4.272738       0.000004       0.010000 
      4.287410       0.000004       0.000000 
      4.302898       0.000004       0.070000 
      4.318080       0.000004       0.030000 
      4.333950       0.000004       0.040000 
      4.350210       0.000004       0.050000 
      4.364419       0.000004       0.050000 
      4.381319       0.000004       0.100000 
      4.396565       0.000004       0.070000 
      4.411641       0.000004       0.010000 
      4.428703       0.000004       0.080000 
      4.444293       0.000004       0.010000 
      4.459109       0.000004       0.060000 
      4.475690       -0.000009       0.040000 
      4.491643       -0.000452       0.030000 
      4.522107       -0.005838       0.050000 
      4.553010       -0.029592       0.080000 
      4.568964       -0.064087       0.020000 
      4.584133       -0.064087       0.060000 
      4.599686       -0.029592       0.040000 
      4.614790       -0.005838       0.070000 
      4.630796       -0.000452       0.030000 
      4.646341       -0.000009       0.020000 
      4.661352       0.000004       0.010000 
      4.678393       0.000004       0.000000 
      4.694114       0.000004       0.030000 
      4.708117       0.000004       0.140000 
      4.724782       0.000004       0.060000 
      4.740712       0.000004       0.020000 
      4.756315       0.000004       0.000000 
      4.771985       0.000004       0.060000 
      4.786276       0.000004       0.000000 
      4.801868       0.000004       0.060000 
      4.817957       0.000004       0.110000 
      4.833076       0.000004       0.090000 
      4.848486       0.000004       0.050000 
      4.864093       0.000004       0.000000 
      4.878195       0.000004       0.020000 
      4.894062       0.000004       0.010000 
      4.911075       0.000004       0.000000 
      4.927003       0.000004       0.030000 
      4.942036       0.000004       0.090000 
      4.958956       0.000004       0.020000 
      4.974440       0.000004       0.020000 
      4.990469       0.000004       0.010000 
      5.005059       0.000004       0.030000 
      5.021347       0.000004       0.040000 
      5.037099       0.000004       0.030000 
      5.053071       0.000004       0.030000 
      5.067255       0.000004       0.020000 
      5.082972       0.000004       0.060000 
      5.099823       0.000004       0.090000 
      5.114912       0.000004       0.050000 
      5.145668       0.000004       0.120000 
      5.162005       0.000004       0.010000 
      5.178357       0.000004       0.050000 
      5.193469       0.000004       0.030000 
      5.210364       0.000004       0.010000 
      5.225798       0.000004       0.040000 
      5.240874       0.000004       0.090000 
      5.255317       0.000004       0.030000 
      5.270835       -0.000009       0.000000 
      5.286427       -0.000439       0.010000 
      5.302641       -0.005395       0.110000 
      5.318504       -0.024193       0.100000 
      5.334206       -0.039890       0.050000 
      5.349818       -0.024193       0.030000 
      5.364934       -0.005395       0.000000 
      5.380531       -0.000439       0.070000 
      5.394939       -0.000009       0.030000 
      5.411449       0.000004       0.070000 
      5.425606       0.000004       0.050000 
      5.442164       0.000004       0.090000 
      5.457583       0.000004       0.010000 
      5.473236       0.000004       0.160000 
      5.487331       0.000004       0.060000 
      5.503029       0.000004       0.090000 
      5.518808       0.000004       0.010000 
      5.535242       0.000004       0.130000 
      5.550101       0.000004       0.090000 
      5.565452       0.000004       0.060000 
      5.596563       0.000004       0.030000 
      5.612853       0.000004       0.010000 
      5.627499       0.000004       0.010000 
      5.644287       0.000004       0.090000 
      5.660535       0.000004       0.050000 
      5.675968       0.000004       0.020000 
      5.691678       0.000004       0.030000 
      5.706983       0.000004       0.040000 
      5.723335       0.000004       0.050000 
      5.739097       0.000004       0.040000 
      5.753809       0.000004       0.020000 
      5.769032       0.000004       0.040000 
      5.783819       0.000004       0.080000 
      5.800799       0.000004       0.050000 
      5.816434       0.000004       0.130000 
      5.831753       0.000004       0.150000 
      5.846228       0.000004       0.160000 
      5.862887       0.000004       0.100000 
      5.877494       0.000004       0.120000 
      5.892469       0.000004       0.020000 
      5.908433       0.000004       0.040000 
      5.923472       0.000004       0.030000 
      5.938874       0.000004       0.140000 
      5.955070       0.000004       0.030000 
      5.970032       0.000004       0.070000 
      5.986097       0.000004       0.050000 
      6.003167       0.000004       0.010000 
      6.018223       0.000004       0.060000 
      6.033221       0.000004       0.000000 
      6.049134       0.000004       0.000000 
      6.065001       0.000004       0.090000 
      6.080710       0.000004       0.030000 
      6.095300       0.000004       0.070000 
      6.110804       0.000004       0.040000 
      6.126243       0.000004       0.160000 
      6.143023       0.000004       0.110000 
      6.158540       0.000004       0.020000 
      6.173982       0.000004       0.030000 
      6.189169       0.000004       0.040000 
      6.205005       0.000004       0.060000 
      6.220304       -0.000009       0.030000 
      6.235476       -0.000439       0.040000 
      6.251279       -0.005395       0.020000 
      6.267002       -0.024193       0.030000 
      6.282841       -0.039890       0.060000 
      6.297216       -0.024193       0.010000 
      6.313855       -0.005395       0.060000 
      6.344075       -0.000439       0.050000 
      6.360550       -0.000009       0.070000 
      6.375196       0.000004       0.050000 
      6.390608       0.000004       0.110000 
      6.405736       0.000004       0.090000 
      6.423182       0.000004       0.010000 
      6.438982       0.000004       0.020000 
      6.455109       0.000004       0.110000 
      6.484483       0.000004       0.010000 
      6.500621       0.000004       0.120000 
      6.515717       0.000004       0.130000 
      6.530717       0.000004       0.140000 
      6.546563       0.000004       0.080000 
      6.562520       0.000004       0.230000 
      6.578262       0.000004       0.150000 
      6.593797       0.000004       0.090000 
      6.608813       0.000004       0.020000 
      6.623533       0.000004       0.170000 
      6.640235       0.000004       0.070000 
      6.654996       0.000004       0.190000 
      6.670628       0.000004       0.100000 
      6.685781       0.000004       0.000000 
      6.700288       0.000004       0.020000 
      6.716731       -0.000009       0.060000 
      6.732160       -0.000439       0.040000 
      6.747602       -0.005395       0.010000 
      6.776429       -0.024206       0.040000 
      6.793211       -0.040333       0.030000 
      6.808834       -0.029592       0.140000 
      6.839880       -0.029592       0.090000 
      6.856165       -0.040333       0.070000 
      6.871994       -0.024206       0.030000 
      6.886775       -0.005395       0.040000 
      6.901902       -0.000439       0.030000 
      6.917338       -0.000009       0.090000 
      6.933029       0.000004       0.010000 
      6.948592       0.000004       0.000000 
      6.964716       0.000004       0.020000 
      6.979702       0.000004       0.020000 
      6.995816       0.000004       0.120000 
      7.010845       0.000004       0.020000 
      7.026967       0.000004       0.030000 
      7.042904       0.000004       0.130000 
      7.073013       0.000004       0.020000 
      7.103908       0.000004       0.000000 
      7.120285       0.000004       0.030000 
      7.135282       0.000004       0.010000 
      7.149980       0.000004       0.020000 
      7.165812       0.000004       0.050000 
      7.182466       0.000004       0.060000 
      7.198650       0.000004       0.030000 
      7.215038       0.000004       0.020000 
      7.230131       0.000004       0.020000 
      7.260699       0.000004       0.060000 
      7.277554       0.000004       0.060000 
      7.293702       0.000004       0.050000 
      7.309572       0.000004       0.110000 
      7.323946       0.000004       0.080000 
      7.339274       0.000004       0.020000 
      7.369498       0.000004       0.020000 
      7.385731       0.000004       0.030000 
      7.401286       0.000004       0.040000 
      7.416572       0.000004       0.020000 
      7.431111       0.000004       0.020000 
      7.448088       0.000004       0.010000 
      7.463898       0.000004       0.040000 
      7.478829       0.000004       0.010000 
      7.494811       0.000004       0.000000 
      7.511025       0.000004       0.110000 
      7.526445       0.000004       0.030000 
      7.541578       0.000004       0.030000 
      7.557204       0.000004       0.040000 
      7.570889       0.000004       0.030000 
      7.586241       0.000004       0.020000 
      7.603109       0.000004       0.010000 
      7.618750       0.000004       0.010000 
      7.648647       0.000004       0.010000 
      7.665006       0.000004       0.060000 
      7.680472       0.000004       0.030000 
      7.695789       0.000004       0.120000 
      7.711774       0.000004       0.030000 
      7.726119       0.000004       0.060000 
      7.743225       0.000004       0.050000 
      7.773047       0.000004       0.010000 
      7.789006       0.000004       0.070000 
      7.805337       0.000004       0.030000 
      7.821547       0.000004       0.060000 
      7.837444       0.000004       0.000000 
      7.852875       0.000004       0.080000 
      7.868072       0.000004       0.050000 
      7.883754       0.000004       0.070000 
      7.898967       0.000004       0.020000 
      7.914395       -0.000009       0.070000 
      7.930457       -0.000439       0.050000 
      7.946803       -0.005395       0.020000 
      7.976025       -0.024193       0.010000 
      7.993090       -0.039890       0.030000 
      8.006972       -0.024193       0.060000 
      8.023698       -0.005395       0.060000 
      8.038548       -0.000439       0.040000 
      8.054634       -0.000009       0.000000 
      8.070248       0.000004       0.050000 
      8.086111       0.000004       0.040000 
      8.099997       0.000004       0.050000 
      8.116545       0.000004       0.000000 
      8.130958       0.000004       0.020000 
      8.146708       0.000004       0.040000 
      8.161893       0.000004       0.070000 
      8.178316       0.000004       0.040000 
      8.192828       0.000004       0.010000 
      8.209147       0.000004       0.100000 
      8.225040       0.000004       0.180000 
      8.239040       0.000004       2.310000 
      8.255227       0.000004       3.020000 
      8.270919       0.000004       3.470000 
      8.285905       0.000004       3.580000 
      8.300002       0.000004       3.170000 
      8.316212       0.000004       1.450000 
      8.333094       0.000004       0.080000 
      8.348832       0.000004       1.750000 
      8.363937       0.000004       6.970000 
      8.379989       0.000004       10.080000 
      8.394907       0.000004       17.860000 
      8.409865       0.000004       22.370000 
      8.424661       0.000004       27.370000 
      8.440152       0.000004       39.910000 
      8.455501       0.000004       47.990000 
      8.470723       0.000004       68.790000 
      8.486094       0.000004       80.590000 
      8.503408       0.000004       91.910000 
      8.518858       0.000004       115.420000 
      8.535115       0.000004       128.450000 
      8.549380       0.000004       157.440000 
      8.563896       0.000004       174.160000 
      8.579371       0.000018       192.450000 
      8.595441       0.000462       231.100000 
      8.610833       0.005941       249.260000 
      8.625861       0.032811       266.100000 
      8.640382       0.105570       295.110000 
      8.657245       0.281235       308.200000 
      8.671584       0.560995       328.750000 
      8.687656       0.794909       338.850000 
      8.703966       0.931344       356.120000 
      8.719309       0.989220       361.020000 
      8.734498       1.019841       365.100000 
      8.749009       1.131141       365.830000 
      8.765028       1.420794       366.830000 
      8.779932       1.782033       373.850000 
      8.796467       2.040414       379.700000 
      8.811743       2.337768       384.750000 
      8.826956       2.733545       388.890000 
      8.843000       3.029735       388.350000 
      8.858251       3.340871       387.850000 
      8.875328       3.782164       389.680000 
      8.889606       4.249267       397.110000 
      8.905658       4.721072       402.280000 
      8.920678       5.091272       406.260000 
      8.936778       5.431345       411.580000 
      8.951842       5.756288       406.780000 
      8.967800       5.940644       275.470000 
      8.984529       6.014374       162.790000 
      9.000486       6.109779       11.320000 
      9.015117       6.242209       17.080000 
      9.030584       6.346060       4.950000 
      9.047202       6.439954       1.700000 
      9.062379       6.481468       7.430000 
      9.077900       6.477688       11.040000 
      9.094811       6.475727       1.700000 
      9.109144       6.560550       0.880000 
      9.124777       6.658158       8.760000 
      9.140205       6.606221       13.050000 
      9.154936       6.216245       0.360000 
      9.169980       5.091399       1.650000 
      9.186626       2.992173       2.720000 
      9.202061       1.221598       11.390000 
      9.217259       1.108318       6.230000 
      9.232830       1.603998       0.280000 
      9.248516       1.764638       5.070000 
      9.264182       1.581538       10.550000 
      9.279149       1.237117       5.900000 
      9.295244       0.979714       2.450000 
      9.310488       0.720474       8.040000 
      9.326233       0.289174       12.290000 
      9.341716       -0.254630       5.670000 
      9.356447       -0.729850       3.140000 
      9.372262       -0.980910       8.450000 
      9.387012       -1.156006       11.370000 
      9.402884       -1.381779       9.240000 
      9.417766       -1.476543       1.970000 
      9.433805       -1.408870       3.590000 
      9.449121       -1.348460       7.310000 
      9.465312       -1.281625       7.180000 
      9.479962       -1.258441       3.300000 
      9.495337       -1.335852       3.890000 
      9.510580       -1.446171       7.550000 
      9.527392       -1.464031       8.950000 
      9.542632       -1.382154       3.390000 
      9.558192       -1.391970       2.860000 
      9.574064       -1.531820       8.370000 
      9.588442       -1.619165       8.770000 
      9.603939       -1.608024       5.860000 
      9.620479       -1.530424       3.810000 
      9.635130       -1.470872       6.370000 
      9.651666       -1.469459       8.710000 
      9.666595       -1.446547       5.670000 
      9.682163       -1.333618       4.590000 
      9.697731       -1.166858       7.450000 
      9.713518       -1.059825       9.690000 
      9.727651       -1.068697       5.840000 
      9.744720       -1.157444       4.220000 
      9.759064       -1.270815       7.600000 
      9.774257       -1.356818       9.100000 
      9.790273       -1.309837       5.000000 
      9.806230       -1.215764       3.900000 
      9.822219       -1.245334       7.340000 
      9.838220       -1.342534       8.140000 
      9.854221       -1.414694       6.450000 
      9.870211       -1.362177       3.690000 
      9.884312       -1.189241       5.150000 
      9.900300       -1.053445       7.420000 
      9.916914       -1.007678       5.660000 
      9.932863       -1.000507       3.960000 
      9.946891       -1.000010       5.610000 
      9.963593       -0.999996       7.470000 
      9.977550       -1.000009       5.640000 
      9.993853       -1.000439       4.460000 
      10.008810       -1.005395       4.950000 
      10.026872       -1.024193       8.050000 
      10.039501       -1.039917       7.750000 
      10.054650       -1.025093       6.180000 
      10.070962       -1.016650       5.750000 
      10.086426       -1.054689       7.280000 
      10.101505       -1.109837       7.550000 
      10.116780       -1.117894       5.910000 
      10.133275       -1.099539       5.140000 
      10.148370       -1.076228       7.030000 
      10.163038       -1.060115       7.690000 
      10.178233       -1.075785       5.350000 
      10.194108       -1.094140       4.790000 
      10.209293       -1.093697       6.590000 
      10.223174       -1.069929       7.060000 
      10.239165       -1.030049       6.180000 
      10.254463       -1.005865       4.580000 
      10.271022       -1.000922       5.420000 
      10.286074       -1.006295       6.990000 
      10.301800       -1.034991       6.100000 
      10.317136       -1.088298       5.040000 
      10.332486       -1.104438       5.780000 
      10.349500       -1.059658       6.950000 
      10.365010       -1.041720       6.140000 
      10.381002       -1.075798       5.330000 
      10.395651       -1.112951       6.200000 
      10.412608       -1.114780       7.160000 
      10.428230       -1.078456       7.090000 
      10.444325       -1.052071       5.410000 
      10.460180       -1.037220       5.650000 
      10.476042       -1.070013       7.280000 
      10.491383       -1.152819       7.020000 
      10.507022       -1.168099       5.960000 
      10.522894       -1.083829       5.600000 
      10.538851       -1.022505       6.660000 
      10.554814       -1.026436       6.630000 
      10.568798       -1.050756       5.630000 
      10.584729       -1.073501       5.580000 
      10.598691       -1.096882       6.470000 
      10.613709       -1.108496       6.890000 
      10.629720       -1.145316       5.400000 
      10.643919       -1.165403       5.160000 
      10.659947       -1.164184       5.750000 
      10.674915       -1.195000       6.680000 
      10.690967       -1.215249       6.180000 
      10.705730       -1.202640       5.330000 
      10.720914       -1.196411       5.940000 
      10.736843       -1.173030       6.740000 
      10.753865       -1.144873       6.180000 
      10.768808       -1.095510       5.650000 
      10.782942       -1.042230       6.280000 
      10.797958       -1.047603       6.820000 
      10.813893       -1.124663       6.290000 
      10.830311       -1.203995       5.660000 
      10.846003       -1.217894       5.650000 
      10.862008       -1.205368       6.880000 
      10.875908       -1.205824       6.720000 
      10.891418       -1.224206       5.560000 
      10.907099       -1.239863       5.690000 
      10.921826       -1.223280       6.220000 
      10.937509       -1.193710       6.440000 
      10.953545       -1.141233       5.810000 
      10.969358       -1.071356       5.670000 
      10.985484       -1.065501       6.240000 
      11.001442       -1.104908       6.580000 
      11.016282       -1.088781       5.830000 
      11.031593       -1.041277       5.640000 
      11.045873       -1.041304       5.920000 
      11.062141       -1.089667       6.640000 
      11.078241       -1.115706       6.400000 
      11.093245       -1.113882       5.760000 
      11.108220       -1.150688       6.030000 
      11.123034       -1.183811       6.730000 
      11.138478       -1.175785       6.370000 
      11.154664       -1.170417       5.880000 
      11.170627       -1.218363       6.110000 
      11.184798       -1.245219       6.430000 
      11.200756       -1.188811       6.190000 
      11.217235       -1.165487       5.800000 
      11.232353       -1.186983       6.150000 
      11.249340       -1.178510       6.530000 
      11.265309       -1.181642       6.080000 
      11.281265       -1.206321       5.780000 
      11.297224       -1.255145       5.800000 
      11.312183       -1.325995       6.460000 
      11.327100       -1.390055       6.360000 
      11.342062       -1.414252       5.600000 
      11.358025       -1.329578       5.730000 
      11.374808       -1.255216       6.120000 
      11.389765       -1.268628       6.320000 
      11.406720       -1.273540       5.930000 
      11.421762       -1.280298       5.830000 
      11.437716       -1.294570       6.290000 
      11.452673       -1.294153       6.340000 
      11.469630       -1.275329       6.050000 
      11.485587       -1.254259       5.930000 
      11.500556       -1.246162       6.370000 
      11.514507       -1.229149       6.480000 
      11.530465       -1.218378       6.060000 
      11.546424       -1.187010       5.900000 
      11.560385       -1.126520       6.120000 
      11.575061       -1.152559       6.530000 
      11.591954       -1.259615       6.310000 
      11.606914       -1.328648       5.940000 
      11.623123       -1.334038       5.980000 
      11.638083       -1.352875       6.340000 
      11.653125       -1.369415       6.070000 
      11.669624       -1.299553       5.740000 
      11.685155       -1.225163       5.790000 
      11.700331       -1.222878       6.370000 
      11.715816       -1.224690       6.410000 
      11.730531       -1.229592       5.940000 
      11.746829       -1.245289       5.810000 
      11.760977       -1.243447       6.300000 
      11.776331       -1.226504       6.300000 
      11.791714       -1.209355       6.190000 
      11.807902       -1.225631       5.950000 
      11.822650       -1.233080       6.190000 
      11.839456       -1.201905       6.300000 
      11.853966       -1.170375       6.060000 
      11.870101       -1.213576       5.940000 
      11.885834       -1.292741       6.250000 
      11.901140       -1.360086       6.260000 
      11.916227       -1.372117       6.060000 
      11.931762       -1.369459       5.910000 
      11.947719       -1.345262       5.900000 
      11.961680       -1.302666       6.180000 
      11.977847       -1.267259       6.260000 
      11.992805       -1.208549       6.080000 
      12.022826       -1.176726       6.200000 
      12.038867       -1.158344       6.260000 
      12.053826       -1.174028       6.030000 
      12.068786       -1.261014       5.920000 
      12.083747       -1.303039       6.230000 
      12.099703       -1.291083       6.320000 
      12.114664       -1.313881       6.060000 
      12.130622       -1.375271       5.970000 
      12.146579       -1.369056       6.330000 
      12.161539       -1.338078       6.360000 
      12.177374       -1.342605       6.290000 
      12.193446       -1.321948       6.010000 
      12.208795       -1.297379       6.160000 
      12.224845       -1.267260       6.230000 
      12.240493       -1.300093       6.100000 
      12.256460       -1.399442       5.920000 
      12.270930       -1.427332       6.130000 
      12.286779       -1.378443       6.250000 
      12.301953       -1.339062       6.090000 
      12.317505       -1.344874       6.000000 
      12.332877       -1.415693       5.980000 
      12.349478       -1.458218       6.290000 
      12.364019       -1.447060       6.270000 
      12.379198       -1.416082       5.980000 
      12.394885       -1.359658       6.010000 
      12.410963       -1.330089       6.140000 
      12.426519       -1.317493       6.160000 
      12.441926       -1.295593       6.080000 
      12.457653       -1.335851       6.090000 
      12.472621       -1.408977       6.230000 
      12.489517       -1.426767       6.220000 
      12.504990       -1.382140       6.030000 
      12.521053       -1.342562       5.960000 
      12.535737       -1.365097       6.260000 
      12.551663       -1.363632       6.260000 
      12.567755       -1.409008       6.110000 
      12.583663       -1.463547       6.050000 
      12.598819       -1.412521       6.110000 
      12.613741       -1.322022       6.250000 
      12.627700       -1.291027       6.220000 
      12.643736       -1.315733       6.030000 
      12.658817       -1.313409       6.100000 
      12.675435       -1.280795       6.220000 
      12.690026       -1.261901       6.150000 
      12.706301       -1.293379       6.090000 
      12.721377       -1.384715       6.110000 
      12.735970       -1.508011       6.200000 
      12.752722       -1.564445       6.170000 
      12.767247       -1.504411       6.060000 
      12.782888       -1.382557       6.060000 
      12.799131       -1.355685       6.320000 
      12.814828       -1.421921       6.270000 
      12.830394       -1.417464       5.970000 
      12.845799       -1.382500       6.000000 
      12.860608       -1.356944       6.140000 
      12.876011       -1.286125       6.220000 
      12.892061       -1.263370       6.040000 
      12.907555       -1.349706       6.150000 
      12.923169       -1.442989       6.160000 
      12.938510       -1.429910       6.240000 
      12.953990       -1.344416       6.130000 
      12.970034       -1.232708       6.020000 
      12.986101       -1.163840       6.210000 
      13.001418       -1.209423       6.240000 
      13.016144       -1.290552       6.130000 
      13.030104       -1.272144       6.070000 
      13.046061       -1.239947       6.040000 
      13.061955       -1.241622       6.280000 
      13.078172       -1.228746       6.180000 
      13.092829       -1.218794       6.040000 
      13.108857       -1.191939       6.060000 
      13.125192       -1.144391       6.230000 
      13.139629       -1.156128       6.200000 
      13.155671       -1.179299       6.160000 
      13.171990       -1.156571       6.100000 
      13.186340       -1.149764       6.170000 
      13.201821       -1.215263       6.170000 
      13.216971       -1.248333       6.050000 
      13.233577       -1.209921       5.970000 
      13.249421       -1.190598       6.130000 
      13.265521       -1.222905       6.170000 
      13.280113       -1.260102       6.150000 
      13.295751       -1.328692       6.040000 
      13.311660       -1.398542       6.120000 
      13.327142       -1.387384       6.320000 
      13.342181       -1.329135       6.110000 
      13.357497       -1.276698       6.080000 
      13.373311       -1.236791       6.190000 
      13.388357       -1.240417       6.270000 
      13.403788       -1.283356       6.140000 
      13.419292       -1.280295       6.090000 
      13.434939       -1.221080       6.080000 
      13.450723       -1.233290       6.190000 
      13.466403       -1.338035       6.210000 
      13.481775       -1.413433       6.080000 
      13.498037       -1.372990       6.080000 
      13.513012       -1.326521       6.260000 
      13.528011       -1.343877       6.270000 
      13.543747       -1.350215       6.200000 
      13.558928       -1.283882       6.080000 
      13.573759       -1.242177       6.120000 
      13.589195       -1.257471       6.160000 
      13.604367       -1.298180       6.130000 
      13.620003       -1.342135       6.080000 
      13.635228       -1.355520       6.150000 
      13.650433       -1.373055       6.230000 
      13.665738       -1.300342       6.110000 
      13.680857       -1.165597       6.040000 
      13.695999       -1.142607       6.100000 
      13.713170       -1.180738       6.250000 
      13.728285       -1.167229       6.240000 
      13.743517       -1.131877       6.020000 
      13.758781       -1.109369       6.130000 
      13.773901       -1.120729       6.180000 
      13.788801       -1.115611       6.120000 
      13.804195       -1.102378       6.100000 
      13.819877       -1.157777       6.000000 
      13.834849       -1.241271       6.150000 
      13.850342       -1.222324       6.180000 
      13.865657       -1.201908       6.100000 
      13.881250       -1.244737       6.170000 
      13.896592       -1.284807       6.230000 
      13.911020       -1.273461       6.240000 
      13.927312       -1.261500       6.130000 
      13.943071       -1.273957       6.130000 
      13.959013       -1.291925       6.170000 
      13.974165       -1.288771       6.090000 
      13.988952       -1.317450       6.090000 
      14.004146       -1.315166       6.040000 
      14.019835       -1.213948       6.110000 
      14.035332       -1.153432       6.220000 
      14.050141       -1.182541       6.110000 
      14.065887       -1.242615       6.050000 
      14.082912       -1.280242       6.110000 
      14.097037       -1.260101       6.320000 
      14.113045       -1.271302       6.210000 
      14.128817       -1.344819       6.130000 
      14.144119       -1.395411       6.170000 
      14.159630       -1.355144       6.120000 
      14.174725       -1.250690       6.140000 
      14.190382       -1.228817       6.170000 
      14.205945       -1.295926       6.070000 
      14.221766       -1.362798       6.140000 
      14.238760       -1.382872       6.130000 
      14.255825       -1.351145       6.040000 
      14.270190       -1.320664       6.040000 
      14.286036       -1.357886       6.180000 
      14.300949       -1.424153       6.190000 
      14.317610       -1.486068       6.140000 
      14.331780       -1.487730       6.030000 
      14.347131       -1.380298       6.130000 
      14.362854       -1.280326       6.170000 
      14.377720       -1.274941       6.210000 
      14.393878       -1.284809       6.120000 
      14.409839       -1.329606       6.200000 
      14.424817       -1.385587       6.170000 
      14.438871       -1.395951       6.180000 
      14.455042       -1.386473       6.020000 
      14.470946       -1.340377       6.220000 
      14.486140       -1.332290       6.190000 
      14.501265       -1.343045       6.110000 
      14.517027       -1.269501       6.130000 
      14.533247       -1.262027       6.160000 
      14.547916       -1.349622       6.110000 
      14.562147       -1.378038       6.130000 
      14.577238       -1.326381       6.110000 
      14.593247       -1.273127       6.160000 
      14.609122       -1.215708       6.240000 
      14.623150       -1.216690       6.250000 
      14.638043       -1.265431       6.120000 
      14.653088       -1.293724       6.010000 
      14.668962       -1.299539       6.090000 
      14.684918       -1.300398       6.140000 
      14.700939       -1.304508       6.130000 
      14.716713       -1.313381       6.100000 
      14.732874       -1.291039       6.160000 
      14.748626       -1.238575       6.090000 
      14.779819       -1.227821       6.050000 
      14.794975       -1.230062       6.070000 
      14.810959       -1.248404       6.070000 
      14.826601       -1.261013       6.050000 
      14.842881       -1.228650       6.090000 
      14.858916       -1.218961       6.120000 
      14.874998       -1.258649       6.200000 
      14.889533       -1.335003       6.180000 
      14.906127       -1.350091       6.140000 
      14.921637       -1.291052       6.110000 
      14.937376       -1.202282       6.120000 
      14.952342       -1.201879       6.140000 
      14.968000       -1.286540       6.150000 
      14.983573       -1.336692       6.190000 
      14.999092       -1.343463       6.100000 
      15.015274       -1.312898       6.070000 
      15.030864       -1.245329       6.110000 
      15.045008       -1.161432       6.120000 
      15.061162       -1.122546       6.150000 
      15.076253       -1.150190       6.170000 
      15.092229       -1.190623       6.120000 
      15.107800       -1.197254       6.130000 
      15.122712       -1.196881       6.130000 
      15.139228       -1.184729       6.070000 
      15.154777       -1.204992       6.140000 
      15.168973       -1.235820       6.070000 
      15.184224       -1.234991       6.080000 
      15.201008       -1.258758       6.120000 
      15.215180       -1.299912       6.060000 
      15.231292       -1.274912       6.100000 
      15.247525       -1.243961       6.110000 
      15.262171       -1.268158       6.150000 
      15.278887       -1.278483       6.060000 
      15.293254       -1.299526       6.070000 
      15.308446       -1.315210       6.110000 
      15.323964       -1.296838       6.120000 
      15.340966       -1.267742       6.090000 
      15.355737       -1.221053       6.070000 
      15.370917       -1.244930       6.140000 
      15.388361       -1.312868       6.180000 
      15.402036       -1.279381       6.180000 
      15.417750       -1.179830       6.070000 
      15.432961       -1.168699       6.150000 
      15.448912       -1.214765       6.100000 
      15.465138       -1.244913       6.220000 
      15.480630       -1.255092       6.120000 
      15.497484       -1.285683       6.100000 
      15.513237       -1.337135       6.170000 
      15.527565       -1.349718       6.160000 
      15.542706       -1.283372       6.110000 
      15.559094       -1.235018       6.140000 
      15.572500       -1.212107       6.110000 
      15.588841       -1.166400       6.120000 
      15.603994       -1.175386       6.070000 
      15.618854       -1.247473       6.120000 
      15.635194       -1.239860       6.200000 
      15.650769       -1.136391       6.240000 
      15.666230       -1.136821       6.190000 
      15.680693       -1.245259       6.050000 
      15.696546       -1.271684       6.030000 
      15.713004       -1.215737       6.060000 
      15.728359       -1.196439       6.110000 
      15.743664       -1.247088       6.140000 
      15.758904       -1.299096       6.080000 
      15.774915       -1.341634       6.090000 
      15.790186       -1.349718       6.120000 
      15.807077       -1.278899       6.120000 
      15.822992       -1.222492       6.070000 
      15.839073       -1.230975       6.180000 
      15.853874       -1.265457       6.140000 
      15.869714       -1.280271       6.090000 
      15.884879       -1.301727       6.100000 
      15.900739       -1.319678       6.130000 
      15.915253       -1.243434       6.190000 
      15.930955       -1.151658       6.180000 
      15.946135       -1.131365       6.160000 
      15.961883       -1.139957       6.070000 
      15.978021       -1.119237       6.070000 
      15.994729       -1.086154       6.120000 
      16.009322       -1.079329       6.190000 
      16.038796       -1.091066       6.180000 
      16.055754       -1.073501       6.130000 
      16.069716       -1.056571       6.060000 
      16.084650       -1.055602       6.110000 
      16.100467       -1.081654       6.200000 
      16.116570       -1.129579       6.180000 
      16.131641       -1.187854       6.080000 
      16.148064       -1.204411       6.140000 
      16.163464       -1.159202       6.200000 
      16.178407       -1.135918       6.100000 
      16.193119       -1.147545       6.140000 
      16.209067       -1.165528       6.170000 
      16.224856       -1.229632       6.160000 
      16.239281       -1.305754       6.120000 
      16.256135       -1.334077       6.140000 
      16.270306       -1.377033       6.110000 
      16.286306       -1.413393       6.190000 
      16.301329       -1.332635       6.150000 
      16.317323       -1.208637       6.110000 
      16.332082       -1.175344       6.030000 
      16.348737       -1.226488       6.020000 
      16.364908       -1.213395       6.210000 
      16.380257       -1.169543       6.190000 
      16.396690       -1.170360       6.070000 
      16.412036       -1.159198       6.110000 
      16.427713       -1.106322       6.190000 
      16.442426       -1.077642       6.110000 
      16.459009       -1.135904       6.180000 
      16.475107       -1.228662       6.070000 
      16.490602       -1.258232       6.090000 
      16.506135       -1.234548       6.100000 
      16.520727       -1.230908       6.080000 
      16.537653       -1.251145       6.120000 
      16.553634       -1.272601       6.110000 
      16.568085       -1.285224       6.020000 
      16.583709       -1.250203       6.140000 
      16.600329       -1.228334       6.140000 
      16.616268       -1.289644       6.080000 
      16.632262       -1.391423       6.130000 
      16.649346       -1.381915       6.080000 
      16.663485       -1.245789       6.130000 
      16.678303       -1.161945       6.010000 
      16.692407       -1.193322       6.110000 
      16.707531       -1.219264       6.020000 
      16.739113       -1.233675       6.130000 
      16.754594       -1.259534       6.240000 
      16.770577       -1.244846       6.020000 
      16.786602       -1.208053       6.090000 
      16.802052       -1.191953       6.190000 
      16.817261       -1.155616       6.200000 
      16.831310       -1.146730       6.040000 
      16.846146       -1.200923       6.120000 
      16.862677       -1.265457       6.190000 
      16.879439       -1.310310       6.210000 
      16.892807       -1.377059       6.170000 
      16.908886       -1.438006       6.150000 
      16.923542       -1.382442       6.180000 
      16.939667       -1.270913       6.110000 
      16.954825       -1.218866       6.080000 
      16.970847       -1.235931       6.110000 
      16.986021       -1.288311       6.110000 
      17.001745       -1.303955       6.070000 
      17.016085       -1.252916       6.160000 
      17.032507       -1.200869       6.160000 
      17.048479       -1.157498       6.030000 
      17.063471       -1.140375       6.060000 
      17.080426       -1.183939       6.190000 
      17.094820       -1.251464       6.140000 
      17.110510       -1.323305       6.130000 
      17.127091       -1.296714       6.080000 
      17.143172       -1.192022       6.120000 
      17.158938       -1.132752       6.070000 
      17.174216       -1.181238       6.120000 
      17.188677       -1.247917       6.140000 
      17.205434       -1.239434       6.150000 
      17.221284       -1.194640       6.120000 
      17.236724       -1.200895       6.220000 
      17.250720       -1.216579       6.240000 
      17.267100       -1.213035       6.230000 
      17.281805       -1.240293       6.220000 
      17.297889       -1.239420       6.030000 
      17.313706       -1.201794       6.060000 
      17.327887       -1.162826       6.160000 
      17.343961       -1.098226       6.200000 
      17.358505       -1.122119       6.140000 
      17.373946       -1.272074       6.060000 
      17.389867       -1.342515       6.140000 
      17.406522       -1.237595       6.170000 
      17.421542       -1.162416       6.110000 
      17.436182       -1.185141       6.140000 
      17.452537       -1.180295       6.150000 
      17.467995       -1.119295       6.080000 
      17.483078       -1.111251       6.110000 
      17.499083       -1.135861       6.230000 
      17.513934       -1.130062       6.210000 
      17.529892       -1.140390       6.160000 
      17.545918       -1.189157       6.090000 
      17.562797       -1.208951       6.060000 
      17.577086       -1.172601       6.110000 
      17.591858       -1.127391       6.190000 
      17.607966       -1.091054       6.160000 
      17.623719       -1.111277       6.090000 
      17.638748       -1.164960       5.990000 
      17.653758       -1.192810       6.100000 
      17.669536       -1.188284       6.120000 
      17.684768       -1.146175       6.140000 
      17.700825       -1.095553       6.070000 
      17.715687       -1.105852       6.110000 
      17.731117       -1.134961       6.080000 
      17.746116       -1.124220       6.130000 
      17.760793       -1.111224       6.150000 
      17.777110       -1.130048       6.230000 
      17.792565       -1.164544       6.160000 
      17.807976       -1.169486       6.080000 
      17.824073       -1.153776       6.080000 
      17.838829       -1.145289       6.070000 
      17.853734       -1.119264       6.070000 
      17.867640       -1.081681       6.100000 
      17.884161       -1.066844       6.130000 
      17.900093       -1.111291       6.090000 
      17.914995       -1.189627       6.110000 
      17.931732       -1.244376       6.120000 
      17.947529       -1.271687       6.050000 
      17.977220       -1.280240       6.060000 
      17.993717       -1.230895       6.140000 
      18.009955       -1.205022       6.180000 
      18.025331       -1.254189       6.060000 
      18.040822       -1.250658       6.120000 
      18.055788       -1.178957       6.080000 
      18.070118       -1.187013       6.130000 
      18.085936       -1.229562       6.120000 
      18.102265       -1.218377       6.240000 
      18.117034       -1.186557       6.200000 
      18.133078       -1.184298       6.070000 
      18.149134       -1.210280       6.090000 
      18.166198       -1.193697       6.200000 
      18.182138       -1.153816       6.220000 
      18.196606       -1.122435       6.110000 
      18.211980       -1.090611       6.150000 
      18.228267       -1.110794       6.190000 
      18.243950       -1.158702       6.050000 
      18.260218       -1.158728       5.980000 
      18.274904       -1.111694       5.960000 
      18.289274       -1.101812       6.200000 
      18.305365       -1.174912       6.110000 
      18.320557       -1.242021       6.050000 
      18.337230       -1.213906       6.040000 
      18.352759       -1.138951       6.130000 
      18.366833       -1.108136       6.190000 
      18.383641       -1.098168       6.200000 
      18.399663       -1.091106       6.100000 
      18.415404       -1.056019       6.120000 
      18.430762       -1.051685       6.130000 
      18.445228       -1.119667       6.170000 
      18.462245       -1.179368       6.190000 
      18.477354       -1.172601       6.110000 
      18.492934       -1.156974       6.080000 
      18.508061       -1.160531       6.120000 
      18.522916       -1.199552       6.180000 
      18.538137       -1.234008       6.150000 
      18.553607       -1.217477       6.170000 
      18.569039       -1.170816       6.070000 
      18.584420       -1.117093       6.020000 
      18.600285       -1.114365       6.080000 
      18.616192       -1.156044       6.140000 
      18.630404       -1.143004       6.080000 
      18.645766       -1.110351       6.070000 
      18.660874       -1.100882       6.140000 
      18.676957       -1.100479       6.150000 
      18.693446       -1.105852       6.110000 
      18.706464       -1.130022       6.160000 
      18.722901       -1.169070       6.220000 
      18.738749       -1.183771       6.130000 
      18.753794       -1.156074       6.060000 
      18.768944       -1.138092       6.070000 
      18.783966       -1.156070       6.150000 
      18.799423       -1.120137       6.120000 
      18.815964       -1.081282       6.110000 
      18.844621       -1.125509       6.100000 
      18.861759       -1.179824       6.180000 
      18.877392       -1.172600       6.230000 
      18.893430       -1.156504       6.180000 
      18.907877       -1.154219       6.150000 
      18.924055       -1.163697       6.100000 
      18.939440       -1.135821       6.120000 
      18.956194       -1.076325       6.150000 
      18.972076       -1.090571       6.090000 
      18.988271       -1.155641       6.110000 
      19.005039       -1.162702       6.190000 
      19.018482       -1.142689       6.100000 
      19.033755       -1.163618       6.050000 
      19.048693       -1.230946       6.100000 
      19.065303       -1.237122       6.100000 
      19.079265       -1.204052       6.080000 
      19.094225       -1.170803       6.020000 
      19.110484       -1.130088       6.040000 
      19.125089       -1.106282       6.110000 
      19.140916       -1.105408       6.040000 
      19.156110       -1.118794       6.140000 
      19.173340       -1.115277       6.190000 
      19.189088       -1.079799       6.140000 
      19.204021       -1.068242       6.070000 
      19.219957       -1.108952       6.090000 
      19.236151       -1.179798       6.120000 
      19.251570       -1.188271       6.050000 
      19.267186       -1.158745       6.060000 
      19.282608       -1.146162       6.130000 
      19.298563       -1.124676       6.090000 
      19.313421       -1.105838       6.110000 
      19.330256       -1.105395       6.140000 
      19.345799       -1.118834       6.030000 
      19.360306       -1.116593       6.070000 
      19.376771       -1.095526       6.110000 
      19.392099       -1.134534       6.120000 
      19.408126       -1.193183       6.100000 
      19.423675       -1.158258       6.160000 
      19.439361       -1.070900       6.080000 
      19.455248       -1.042660       6.100000 
      19.470929       -1.077155       6.110000 
      19.484785       -1.129149       6.060000 
      19.499913       -1.187398       6.160000 
      19.515704       -1.199012       6.200000 
      19.530951       -1.134991       6.060000 
      19.546226       -1.095540       6.060000 
      19.561674       -1.116579       6.140000 
      19.576939       -1.118364       6.150000 
      19.594122       -1.099110       6.110000 
      19.609407       -1.070816       6.110000 
      19.625240       -1.035515       6.060000 
      19.640911       -1.031835       6.090000 
      19.656298       -1.062400       6.120000 
      19.671673       -1.126837       6.150000 
      19.686943       -1.194568       6.190000 
      19.703110       -1.161332       6.120000 
      19.718721       -1.086140       6.090000 
      19.734169       -1.036778       6.060000 
      19.749559       -1.030572       6.080000 
      19.763765       -1.047076       6.080000 
      19.779887       -1.064614       6.020000 
      19.795270       -1.118337       6.100000 
      19.809734       -1.150188       6.130000 
      19.825448       -1.108509       6.160000 
      19.841548       -1.092426       6.090000 
      19.856822       -1.125065       6.110000 
      19.871096       -1.163214       6.060000 
      19.886443       -1.158245       6.160000 
      19.903147       -1.100452       6.110000 
      19.918417       -1.047576       6.100000 
      19.933991       -1.065514       6.090000 
      19.949323       -1.129092       6.080000 
      19.965367       -1.133604       6.070000 
      19.980759       -1.083828       6.060000 
      19.996603       -1.056974       6.100000 
      20.010821       -1.049330       6.100000 
      20.026676       -1.046216       6.110000 
      20.042929       -1.035905       6.140000 
      20.056890       -1.060101       6.050000 
      20.072782       -1.115679       6.170000 
      20.086952       -1.142534       6.080000 
      20.103205       -1.144389       6.020000 
      20.117598       -1.119224       6.040000 
      20.134078       -1.081224       6.110000 
      20.149574       -1.060988       6.150000 
      20.165505       -1.081198       6.110000 
      20.180915       -1.118364       6.080000 
      20.196048       -1.134491       6.180000 
      20.211261       -1.105368       6.190000 
      20.227237       -1.089241       6.150000 
      20.241649       -1.110294       6.140000 
      20.257504       -1.089224       6.190000 
      20.271900       -1.041317       6.060000 
      20.287526       -1.042176       6.120000 
      20.318305       -1.099996       6.120000 
      20.334428       -1.157829       6.200000 
      20.349477       -1.159131       6.150000 
      20.364758       -1.116623       6.110000 
      20.381131       -1.119764       6.140000 
      20.397678       -1.181127       6.120000 
      20.411056       -1.193683       6.110000 
      20.426008       -1.182512       6.120000 
      20.441746       -1.181101       6.070000 
      20.457140       -1.130075       6.140000 
      20.471768       -1.095553       6.090000 
      20.487735       -1.121965       6.210000 
      20.502868       -1.142574       6.120000 
      20.518037       -1.139447       6.170000 
      20.533922       -1.100439       6.070000 
      20.548627       -1.065957       6.080000 
      20.565185       -1.081655       6.150000 
      20.581147       -1.119264       6.080000 
      20.610569       -1.145289       6.050000 
      20.625992       -1.153762       6.020000 
      20.642467       -1.169029       5.970000 
      20.656673       -1.158675       6.220000 
      20.673419       -1.099579       6.200000 
      20.688610       -1.036778       6.040000 
      20.705132       -1.017133       6.040000 
      20.720511       -1.049746       6.100000 
      20.736191       -1.090596       6.170000 
      20.750007       -1.096798       6.130000 
      20.764935       -1.091026       6.110000 
      20.781586       -1.054676       6.260000 
      20.796126       -1.035045       6.200000 
      20.812860       -1.041677       6.050000 
      20.828622       -1.035501       6.060000 
      20.843784       -1.060518       6.120000 
      20.859686       -1.120649       6.080000 
      20.889682       -1.161775       6.120000 
      20.906448       -1.165485       6.170000 
      20.921906       -1.127710       6.060000 
      20.951692       -1.101864       6.070000 
      20.969819       -1.074387       6.140000 
      20.984107       -1.056598       6.170000 
      20.999255       -1.055576       6.090000 
      21.015203       -1.080754       6.180000 
