

 time    ||    gripping force   ||   raspberry measurement 

      0       0.100000       -802.516364 
      0       0.100000       -802.516364 
      0       0.100000       -802.516364 
      0       0.050000       -802.516364 
      0       0.020000       -802.516364 
      0       0.050000       -802.516364 
      0       0.100000       -802.516364 
      0       0.070000       -802.516364 
      0       0.080000       -802.516364 
      0       0.080000       -802.516364 
      0       0.070000       -802.516364 
      0       0.070000       -802.516364 
      0       0.060000       -802.516364 
      0       0.080000       -802.516364 
      0       0.080000       -802.516364 
      0       0.060000       -802.516364 
      0       0.100000       -802.516364 
      0       0.030000       -802.516359 
      0       0.000000       -802.515166 
      0       1.130000       -802.407834 
      0       0.710000       -802.407834 
      0       0.340000       -798.853465 
      0       0.720000       -798.853465 
      0       0.260000       -755.551850 
      1       0.300000       -561.481404 
      1       0.330000       -241.491616 
      1       0.140000       -47.392999 
      1       0.400000       -4.084143 
      1       0.260000       -0.466166 
      1       0.140000       -0.279090 
      1       0.070000       -0.309721 
      1       0.110000       -0.400619 
      1       0.110000       -0.400619 
      1       0.170000       -0.400619 
      1       0.180000       -0.400619 
      1       0.030000       -0.454938 
      1       0.380000       -0.464713 
      1       0.260000       -0.467051 
      1       0.440000       -0.465640 
      2       0.250000       -0.465640 
      2       0.350000       -0.465640 
      2       0.690000       -0.467079 
      2       0.640000       -0.465640 
      2       0.350000       -0.467079 
      2       0.500000       -0.467079 
      2       13.230000       -0.465640 
      2       21.000000       -0.467079 
      2       48.510000       -0.467079 
      2       53.570000       -0.465640 
      2       74.330000       -0.467079 
      2       90.410000       -0.465640 
      2       96.060000       -0.465640 
      2       109.070000       -0.467079 
      2       113.550000       -0.467079 
      2       112.860000       -0.467079 
      3       110.950000       -0.465640 
      3       103.250000       -0.465640 
      3       88.500000       -0.467078 
      3       62.490000       -0.467078 
      3       44.820000       -0.465627 
      3       28.270000       -0.466635 
      3       19.690000       -0.460240 
      3       17.080000       -0.442827 
      3       17.380000       -0.423865 
      3       17.750000       -0.417604 
      3       17.750000       -0.315625 
      3       17.820000       -0.052586 
      3       17.860000       0.281950 
      3       17.810000       0.621252 
      3       17.940000       0.990579 
      4       18.180000       0.990579 
      4       18.590000       1.277895 
      4       18.740000       1.277895 
      4       18.830000       1.349999 
      4       18.830000       1.349999 
      4       18.680000       1.128201 
      4       18.630000       0.705111 
      4       18.640000       0.705111 
      4       18.970000       0.335775 
      4       20.090000       0.063678 
      4       20.810000       -0.093312 
      4       22.040000       -0.154745 
      4       22.690000       -0.154745 
      4       23.160000       -0.167922 
      4       23.170000       -0.167922 
      5       23.200000       -0.099666 
      5       23.270000       -0.069931 
      5       23.270000       -0.111322 
      5       23.200000       -0.163575 
      5       23.170000       -0.163575 
      5       23.180000       -0.163575 
      5       23.260000       -0.198311 
      5       23.130000       -0.257209 
      5       22.970000       -0.257209 
      5       22.720000       -0.257209 
      5       22.470000       -0.273183 
      5       22.210000       -0.242411 
      5       21.770000       -0.206478 
      5       21.500000       -0.216372 
      5       21.280000       -0.226617 
      6       21.100000       -0.193436 
      6       20.870000       -0.154884 
      6       20.620000       -0.070122 
      6       20.350000       0.071472 
      6       20.210000       0.170501 
      6       20.060000       0.151734 
      6       19.940000       0.096626 
      6       19.940000       0.070614 
      6       19.930000       0.014177 
      6       19.930000       0.014177 
      6       19.840000       -0.020788 
      6       19.910000       0.005610 
      6       19.930000       0.026233 
      6       19.950000       0.023522 
      6       19.940000       0.023522 
      6       19.900000       -0.011001 
      7       19.940000       -0.011001 
      7       19.940000       -0.032970 
      7       19.900000       -0.032970 
      7       19.880000       -0.036571 
      7       19.900000       -0.036571 
      7       19.900000       -0.102960 
      7       19.870000       -0.200108 
      7       19.920000       -0.254037 
      7       19.840000       -0.253915 
      7       19.870000       -0.253915 
      7       19.760000       -0.218630 
      7       19.720000       -0.184964 
      7       19.630000       -0.184964 
      7       19.530000       -0.207833 
      7       19.480000       -0.204675 
      8       19.340000       -0.164767 
      8       19.170000       -0.119047 
      8       19.130000       -0.078680 
      8       19.080000       -0.072005 
      8       19.080000       -0.007361 
      8       19.180000       0.066016 
      8       19.170000       0.017692 
      8       19.140000       0.017692 
      8       19.170000       -0.080447 
      8       19.130000       -0.080447 
      8       19.220000       -0.080451 
      8       19.210000       -0.046013 
      8       19.160000       -0.087622 
      8       19.140000       -0.126684 
      8       19.110000       -0.124390 
      9       19.220000       -0.141955 
      9       19.150000       -0.149442 
      9       19.250000       -0.118201 
      9       19.190000       -0.084509 
      9       19.190000       -0.102500 
      9       19.230000       -0.082707 
      9       19.250000       -0.082707 
      9       19.230000       -0.052366 
      9       19.320000       -0.123115 
      9       19.430000       -0.123115 
      9       19.680000       -0.222117 
      9       19.900000       -0.273309 
      9       20.290000       -0.322532 
      9       20.530000       -0.307305 
      9       20.830000       -0.193393 
      10       20.790000       -0.160365 
      10       21.100000       -0.197722 
      10       21.410000       -0.203334 
      10       21.530000       -0.175058 
      10       21.520000       -0.175058 
      10       21.690000       -0.048200 
      10       21.690000       0.088882 
      10       21.620000       0.088882 
      10       21.450000       0.056926 
      10       21.440000       -0.085944 
      10       21.350000       -0.177439 
      10       20.880000       -0.168951 
      10       20.780000       -0.118023 
      10       20.650000       -0.037467 
      10       20.560000       0.013053 
      11       20.410000       0.028888 
      11       20.380000       0.028888 
      11       20.100000       0.051704 
      11       19.930000       0.004988 
      11       19.830000       -0.085494 
      11       19.720000       -0.129054 
      11       19.750000       -0.129054 
      11       19.680000       -0.104729 
      11       19.700000       -0.089444 
      11       19.600000       -0.124125 
      11       19.650000       -0.124125 
      11       19.500000       -0.157881 
      11       19.590000       -0.156319 
      11       19.540000       -0.117988 
      11       19.510000       -0.146929 
      11       19.570000       -0.197385 
      12       19.520000       -0.197591 
      12       19.520000       -0.215237 
      12       19.560000       -0.215237 
      12       19.650000       -0.158776 
      12       19.580000       -0.051858 
      12       19.580000       -0.064431 
      12       19.600000       -0.181938 
      12       19.690000       -0.223465 
      12       19.770000       -0.178313 
      12       19.760000       -0.125920 
      12       19.860000       -0.151300 
      12       19.920000       -0.151300 
      12       19.950000       -0.193737 
      12       20.100000       -0.226348 
      12       20.220000       -0.272954 
      13       20.350000       -0.250998 
      13       20.350000       -0.192780 
      13       20.340000       -0.192780 
      13       20.330000       -0.192780 
      13       20.330000       -0.130333 
      13       20.380000       -0.064373 
      13       20.320000       -0.064373 
      13       20.240000       -0.016657 
      13       20.300000       -0.066180 
      13       20.320000       -0.139151 
      13       20.270000       -0.159056 
      13       20.290000       -0.180999 
      13       20.310000       -0.180999 
      13       20.070000       -0.195537 
      13       20.030000       -0.183930 
      13       20.000000       -0.110543 
      14       19.880000       -0.110543 
      14       19.910000       -0.008398 
      14       19.910000       -0.006012 
      14       19.880000       -0.099150 
      14       19.860000       -0.119798 
      14       19.910000       -0.061896 
      14       19.810000       -0.030606 
      14       19.890000       -0.030606 
      14       19.910000       -0.022333 
      14       19.830000       0.046230 
      14       19.890000       0.046230 
      14       19.970000       0.086071 
      14       19.900000       0.010331 
      14       19.860000       0.010331 
      14       19.880000       -0.051946 
      15       19.950000       -0.051946 
      15       19.940000       -0.054539 
      15       19.880000       -0.073498 
      15       19.870000       -0.098963 
      15       19.930000       -0.131672 
      15       19.840000       -0.121940 
      15       19.870000       -0.121940 
      15       19.890000       -0.045253 
      15       19.920000       0.019392 
      15       19.910000       0.045111 
      15       19.900000       0.008495 
      15       19.910000       0.008495 
      15       19.860000       -0.088972 
      15       19.870000       -0.185834 
      15       19.900000       -0.182977 
      16       19.880000       -0.156385 
      16       19.900000       -0.100221 
      16       19.870000       -0.015374 
      16       19.890000       0.043307 
      16       19.960000       0.043307 
      16       19.920000       0.034568 
      16       19.860000       -0.064828 
      16       19.920000       -0.084831 
      16       19.910000       0.033379 
      16       19.900000       0.140549 
      16       19.890000       0.093734 
      16       19.970000       0.093734 
      16       20.000000       -0.011300 
      16       20.050000       -0.056551 
      16       20.280000       -0.072802 
      17       20.320000       -0.109772 
      17       20.280000       -0.074112 
      17       20.280000       -0.007702 
      17       20.290000       -0.007200 
      17       20.310000       -0.002630 
      17       20.250000       0.009290 
      17       20.270000       0.005343 
      17       20.250000       -0.031666 
      17       20.230000       -0.046274 
      17       20.340000       0.039662 
      17       20.300000       0.124105 
      17       20.280000       0.079752 
      17       20.230000       0.007627 
      17       20.220000       0.007627 
      17       20.120000       0.007627 
      18       19.960000       -0.014745 
      18       19.970000       -0.014745 
      18       19.930000       0.032593 
      18       19.910000       0.053374 
      18       19.900000       0.053374 
      18       19.870000       -0.009140 
      18       20.000000       0.001599 
      18       19.920000       0.113282 
      18       19.970000       0.113282 
      18       19.920000       0.094911 
      18       20.010000       0.022592 
      18       19.960000       0.022592 
      18       19.890000       0.040456 
      18       20.000000       0.040456 
      18       19.950000       0.040456 
      19       19.910000       0.040456 
      19       19.990000       0.015723 
      19       19.880000       0.014706 
      19       19.930000       0.091672 
      19       20.010000       0.091672 
      19       19.830000       0.119135 
      19       19.960000       0.100306 
      19       19.920000       0.041897 
      19       19.890000       -0.044872 
      19       19.930000       -0.067583 
      19       19.960000       -0.067583 
      19       19.920000       -0.014999 
      19       19.950000       -0.022878 
      19       19.900000       -0.047425 
      19       19.890000       -0.029725 
      20       19.950000       -0.045341 
      20       19.990000       -0.068400 
      20       19.930000       -0.028208 
      20       19.950000       0.043870 
      20       19.920000       0.073265 
      20       19.920000       0.056033 
      20       19.910000       0.031574 
      20       19.940000       0.002397 
      20       19.900000       0.027709 
      20       19.910000       0.033958 
      20       19.880000       0.033958 
      20       19.900000       -0.018609 
      20       19.890000       -0.017628 
      20       19.950000       -0.017628 
      20       19.940000       -0.020126 
      21       19.930000       -0.097052 
      21       19.950000       -0.121418 
      21       20.000000       -0.086027 
      21       19.970000       -0.086027 
      21       19.870000       -0.035450 
      21       19.910000       0.023426 
      21       19.960000       0.023426 
      21       19.960000       0.044102 
      21       19.910000       0.044102 
      21       19.910000       0.078663 
      21       19.930000       0.090346 
      21       20.010000       0.040121 
      21       19.880000       0.006104 
      21       19.970000       0.006104 
      21       19.940000       -0.047377 
      22       19.940000       -0.107983 
      22       19.960000       -0.107983 
      22       19.920000       -0.107983 
      22       20.010000       -0.107983 
      22       20.000000       -0.107983 
      22       20.040000       -0.158499 
      22       20.000000       -0.189219 
      22       20.040000       -0.220253 
      22       20.030000       -0.220253 
      22       20.030000       -0.196167 
      22       20.130000       -0.076349 
      22       20.110000       -0.005831 
      22       20.180000       -0.015516 
      22       20.160000       0.007253 
      22       20.210000       -0.000318 
      23       20.170000       0.012542 
      23       20.240000       0.012542 
      23       20.080000       0.074564 
      23       20.220000       0.072803 
      23       20.210000       0.019493 
      23       20.200000       -0.042602 
      23       20.150000       -0.042849 
      23       20.120000       -0.009326 
      23       20.150000       -0.009326 
      23       20.230000       0.023219 
      23       20.110000       -0.008518 
      23       20.190000       -0.051905 
      23       20.160000       -0.074460 
      23       20.190000       -0.066577 
      23       20.180000       0.049396 
      24       20.130000       0.049396 
      24       20.190000       0.101674 
      24       20.170000       0.101674 
      24       20.070000       0.029674 
      24       20.150000       -0.018889 
      24       20.030000       -0.042412 
      24       20.030000       -0.077700 
      24       19.970000       -0.077700 
      24       19.890000       -0.116596 
      24       19.960000       -0.108622 
      24       19.960000       -0.110314 
      24       19.910000       -0.045184 
      24       19.920000       0.101121 
      24       19.910000       0.181358 
      24       19.890000       0.181358 
      25       19.870000       0.138300 
      25       19.880000       0.138300 
      25       19.910000       0.069480 
      25       19.920000       0.069480 
      25       19.900000       0.073263 
      25       19.890000       0.091058 
      25       19.870000       0.040539 
      25       19.940000       -0.024701 
      25       19.920000       -0.063458 
      25       19.940000       -0.104125 
      25       19.840000       -0.049734 
      25       19.920000       0.086804 
      25       19.930000       0.139751 
      25       19.900000       0.103248 
      25       19.960000       0.096953 
      26       19.860000       0.096953 
      26       19.890000       0.107026 
      26       19.960000       0.102009 
      26       19.890000       0.061933 
      26       19.880000       0.022708 
      26       19.920000       0.024730 
      26       19.890000       0.069280 
      26       19.860000       0.139576 
      26       19.870000       0.151966 
      26       19.870000       0.146420 
      26       19.890000       0.185797 
      26       19.930000       0.185797 
      26       19.910000       0.230512 
      26       19.910000       0.199772 
      26       19.940000       0.026996 
      26       19.930000       -0.063297 
      27       19.920000       0.024230 
      27       19.860000       0.052753 
      27       19.870000       0.028452 
      27       19.900000       0.063867 
      27       19.940000       0.084687 
      27       19.980000       0.062942 
      27       19.980000       0.078291 
      27       20.150000       0.041509 
      27       20.150000       -0.000473 
      27       20.250000       0.027777 
      27       20.200000       0.027777 
      27       20.230000       0.016028 
      27       20.310000       -0.005839 
      27       20.260000       -0.005839 
      27       20.230000       0.032290 
      28       20.310000       0.039119 
      28       20.280000       0.028107 
      28       20.200000       0.037053 
      28       20.260000       0.037053 
      28       20.240000       0.032349 
      28       20.210000       0.056363 
      28       20.210000       0.045591 
      28       20.140000       -0.023591 
      28       20.240000       0.000135 
      28       20.140000       0.000135 
      28       20.110000       0.042204 
      28       20.120000       0.013480 
      28       20.010000       -0.040400 
      28       19.940000       -0.112778 
      28       19.820000       -0.119106 
      29       19.810000       -0.030622 
      29       19.790000       -0.014802 
      29       19.770000       -0.014802 
      29       19.760000       -0.014802 
      29       19.800000       -0.099767 
      29       19.800000       -0.116068 
      29       19.830000       -0.097242 
      29       19.800000       -0.114290 
      29       19.870000       -0.035182 
      29       19.750000       0.085875 
      29       19.840000       0.093031 
      29       19.780000       0.074346 
      29       19.810000       0.052770 
      29       19.880000       0.052770 
      29       19.760000       0.052770 
      30       19.790000       0.044236 
      30       19.830000       0.029639 
      30       19.890000       -0.035041 
      30       19.830000       -0.038155 
      30       19.990000       0.002981 
      30       19.990000       0.070895 
      30       20.010000       0.136671 
      30       19.920000       0.173948 
      30       19.980000       0.209017 
      30       20.040000       0.139500 
      30       19.940000       0.001916 
      30       19.990000       -0.020274 
      30       20.010000       -0.020274 
      30       19.970000       -0.020274 
      30       20.020000       0.071260 
      31       19.960000       0.071260 
      31       20.000000       0.111823 
      31       19.980000       0.004215 
      31       19.980000       -0.053464 
      31       19.940000       0.054411 
      31       20.000000       0.054411 
      31       20.000000       0.137678 
      31       20.070000       0.080514 
      31       20.130000       -0.001153 
      31       20.180000       0.038953 
      31       20.200000       0.038953 
      31       20.190000       0.038953 
      31       20.150000       0.155513 
      31       20.160000       0.196262 
      32       20.210000       0.118274 
      32       20.170000       0.078238 
      32       20.190000       0.092762 
      32       20.190000       0.088048 
      32       20.160000       0.026613 
      32       20.220000       -0.028511 
      32       20.170000       -0.037656 
      32       20.130000       -0.014601 
      32       20.110000       -0.040217 
      32       20.190000       -0.045156 
      32       20.190000       0.019675 
      32       20.100000       0.019675 
      32       20.160000       0.044636 
      32       20.140000       -0.023573 
      32       20.140000       -0.111729 
      32       20.110000       -0.106972 
      33       20.120000       -0.141094 
      33       20.100000       -0.223385 
      33       20.060000       -0.191084 
      33       20.130000       -0.191084 
      33       19.990000       -0.092054 
      33       19.900000       -0.092054 
      33       19.900000       -0.074634 
      33       19.910000       -0.074634 
      33       19.920000       -0.111628 
      33       19.950000       -0.153515 
      33       19.920000       -0.164806 
      33       19.920000       -0.164806 
      33       19.930000       -0.045588 
      33       19.920000       0.099457 
      33       19.920000       0.111784 
      34       19.900000       0.111784 
      34       19.910000       0.026883 
      34       19.870000       0.026883 
      34       19.920000       -0.037292 
      34       19.900000       -0.029354 
      34       19.830000       -0.029354 
      34       19.860000       -0.029354 
      34       19.860000       0.001555 
      34       19.930000       0.059179 
      34       19.840000       0.090093 
      34       19.900000       0.042558 
      34       19.870000       0.001005 
      34       19.790000       -0.020041 
      34       19.930000       -0.051595 
      34       19.880000       -0.065000 
      35       19.920000       -0.016331 
      35       19.850000       0.003249 
      35       19.850000       -0.013583 
      35       19.850000       -0.052490 
      35       19.850000       -0.077305 
      35       19.880000       -0.077305 
      35       19.850000       -0.077305 
      35       19.890000       -0.078164 
      35       19.870000       -0.071776 
      35       19.920000       -0.020735 
      35       19.890000       0.050295 
      35       19.910000       0.142651 
      35       19.920000       0.148255 
      35       19.920000       0.099796 
      35       19.950000       0.077531 
      36       19.910000       0.090416 
      36       19.990000       0.113150 
      36       20.020000       0.054147 
      36       20.040000       -0.014942 
      36       20.050000       -0.014942 
      36       20.010000       -0.027840 
      36       19.980000       0.004929 
      36       20.020000       0.020754 
      36       20.040000       0.020754 
      36       20.070000       0.020754 
      36       20.150000       0.058366 
      36       20.190000       0.070952 
      36       20.160000       -0.017489 
      36       20.180000       -0.043927 
      36       20.170000       0.051795 
      37       20.130000       0.057538 
      37       20.190000       -0.021985 
      37       20.110000       -0.021985 
      37       20.120000       -0.059518 
      37       20.170000       -0.072166 
      37       20.190000       -0.026682 
      37       20.150000       0.056591 
      37       20.150000       0.114977 
      37       20.210000       0.111226 
      37       20.160000       0.037785 
      37       20.120000       0.049917 
      37       20.130000       0.108744 
      37       20.150000       0.113547 
      37       20.130000       0.129176 
      37       20.170000       0.138118 
      38       20.090000       0.099874 
      38       20.140000       0.099874 
      38       20.140000       0.052814 
      38       20.160000       0.001541 
      38       20.100000       -0.035999 
      38       20.160000       -0.049191 
      38       20.110000       -0.054731 
      38       20.100000       -0.094269 
      38       20.100000       -0.094269 
      38       20.000000       -0.094269 
      38       19.980000       -0.120733 
      38       19.890000       -0.147510 
      38       19.900000       -0.106553 
      38       19.910000       -0.030031 
      38       19.870000       0.003047 
      39       19.890000       0.020849 
      39       19.870000       -0.003809 
      39       19.870000       0.014045 
      39       19.890000       0.014045 
      39       19.840000       0.048441 
      39       19.940000       0.057353 
      39       19.900000       0.057353 
      39       19.900000       0.058031 
      39       19.920000       -0.003234 
      39       19.940000       -0.017904 
      39       19.850000       0.049329 
      39       19.900000       0.094441 
      39       19.920000       0.110504 
      39       19.860000       0.063109 
      39       19.920000       0.060503 
      39       19.980000       0.147073 
      40       19.900000       0.237197 
      40       19.900000       0.276365 
      40       19.910000       0.276365 
      40       19.930000       0.276365 
      40       19.860000       0.254184 
      40       19.900000       0.178831 
      40       19.900000       0.178831 
      40       19.970000       0.136736 
      40       19.910000       0.086460 
      40       19.940000       0.044002 
      40       19.930000       0.083813 
      40       19.890000       0.083813 
      40       19.880000       0.083813 
      40       19.920000       0.116287 
      40       19.960000       0.088950 
      41       19.910000       0.067631 
      41       19.920000       0.067631 
      41       19.860000       0.069199 
      41       19.870000       0.097313 
      41       19.890000       0.097313 
      41       19.850000       0.093257 
      41       19.900000       0.093257 
      41       19.930000       0.045703 
      41       19.960000       0.039120 
      41       19.980000       0.051035 
      41       20.020000       0.061761 
      41       20.050000       0.084060 
      41       20.000000       0.084060 
      41       20.080000       0.123275 
      42       20.070000       0.123275 
      42       20.130000       0.133922 
      42       20.090000       0.133922 
      42       20.160000       0.092719 
      42       20.190000       0.026588 
      42       20.110000       0.026588 
      42       20.110000       0.037368 
      42       20.170000       0.090727 
      42       20.110000       0.114157 
      42       20.210000       0.109949 
      42       20.120000       0.064900 
      42       20.130000       0.071416 
      42       20.130000       0.077254 
      42       20.170000       0.077254 
      42       20.170000       0.043316 
      42       20.090000       0.043316 
      43       20.170000       0.069868 
      43       20.160000       0.097988 
      43       20.080000       0.069571 
      43       20.190000       0.038632 
      43       20.070000       0.003657 
      43       20.170000       0.005002 
      43       20.220000       0.037691 
      43       20.150000       -0.002537 
      43       20.140000       -0.022928 
      43       20.040000       0.058923 
      43       20.050000       0.121315 
      43       20.030000       0.127284 
      43       20.020000       0.127284 
      43       20.020000       0.089095 
      43       19.970000       0.063467 
      44       20.000000       0.110248 
      44       20.020000       0.153478 
      44       20.030000       0.106295 
      44       20.030000       0.043071 
      44       20.060000       0.010749 
      44       20.010000       -0.007174 
      44       19.980000       0.014728 
      44       20.050000       0.050337 
      44       19.980000       0.070428 
      44       20.100000       0.038466 
      44       20.090000       -0.034922 
      44       20.070000       -0.087523 
      44       20.060000       -0.039015 
      44       20.020000       -0.039015 
      44       19.930000       0.016206 
      45       19.850000       0.037506 
      45       19.880000       0.060061 
      45       19.810000       0.089742 
      45       19.760000       0.063905 
      45       19.810000       0.063905 
      45       19.800000       -0.003571 
      45       19.810000       -0.027173 
      45       19.870000       0.018885 
      45       19.800000       0.018885 
      45       19.790000       0.105141 
      45       19.840000       0.184860 
      45       19.770000       0.129253 
      45       19.820000       0.010982 
      45       19.850000       -0.016278 
      45       19.760000       -0.016278 
      46       19.820000       -0.016278 
      46       19.840000       -0.005907 
      46       19.830000       0.000430 
      46       19.790000       0.069990 
      46       19.850000       0.124351 
      46       19.780000       0.105335 
      46       19.820000       0.103448 
      46       19.900000       0.108536 
      46       19.920000       0.079535 
      46       19.930000       0.079535 
      46       19.960000       -0.000676 
      46       20.200000       -0.073507 
      46       20.220000       -0.119245 
      46       20.350000       -0.137292 
      46       20.380000       -0.137292 
      47       20.340000       -0.137292 
      47       20.290000       -0.096697 
      47       20.290000       -0.053317 
      47       20.360000       -0.006928 
      47       20.310000       0.013427 
      47       20.390000       0.013427 
      47       20.350000       0.072024 
      47       20.350000       0.108416 
      47       20.400000       0.043143 
      47       20.150000       0.032490 
      47       19.970000       0.116866 
      47       19.980000       0.123248 
      47       19.900000       0.123248 
      47       19.870000       0.068794 
      47       19.920000       0.073421 
      47       19.890000       0.073421 
      48       19.910000       0.073421 
      48       19.890000       0.073421 
      48       19.900000       0.073421 
      48       19.850000       0.073421 
      48       19.900000       0.086361 
      48       19.900000       0.017744 
      48       19.890000       -0.056653 
      48       19.940000       -0.056653 
      48       19.890000       -0.047151 
      48       19.920000       -0.010380 
      48       19.880000       0.011963 
      48       19.910000       0.011963 
      48       19.900000       -0.065045 
      48       19.900000       -0.158669 
      48       19.860000       -0.130221 
      49       19.840000       -0.083545 
      49       19.900000       -0.051257 
      49       19.880000       0.043720 
      49       19.790000       0.043720 
      49       19.930000       0.043266 
      49       19.890000       0.043266 
      49       19.910000       0.043266 
      49       19.890000       -0.049821 
      49       19.880000       -0.145181 
      49       19.910000       -0.211609 
      49       19.880000       -0.153537 
      49       19.950000       -0.043425 
      49       19.940000       -0.043425 
      49       19.890000       0.005865 
      49       19.880000       -0.022573 
      50       19.920000       -0.022573 
      50       19.770000       -0.065407 
      50       19.920000       -0.086432 
      50       19.960000       -0.086432 
      50       19.870000       -0.086432 
      50       20.030000       -0.080305 
      50       20.020000       -0.033746 
      50       20.070000       -0.039712 
      50       20.110000       -0.100407 
      50       20.200000       -0.113202 
      50       20.110000       -0.033106 
      50       20.050000       0.075953 
      50       20.130000       0.146563 
      50       20.190000       0.100740 
      50       20.090000       -0.039530 
      50       20.150000       -0.099488 
      51       20.120000       -0.098962 
      51       20.150000       -0.106879 
      51       20.110000       -0.088925 
      51       20.110000       -0.081448 
      51       20.130000       -0.081448 
      51       20.100000       -0.120059 
      51       20.130000       -0.173451 
      51       20.120000       -0.114863 
      51       20.150000       -0.004750 
      51       20.130000       -0.018246 
      51       20.100000       -0.080358 
      51       20.090000       -0.125506 
      51       20.080000       -0.148358 
      51       20.120000       -0.060646 
      51       20.110000       0.000107 
      52       20.120000       0.008711 
      52       20.090000       -0.028331 
      52       20.090000       -0.055459 
      52       20.120000       -0.018548 
      52       20.070000       -0.025544 
      52       20.120000       -0.087684 
      52       20.160000       -0.115364 
      52       20.080000       -0.092314 
      52       20.100000       -0.092314 
      52       20.110000       -0.092314 
      52       20.080000       -0.042752 
      52       20.110000       0.033704 
      52       20.130000       0.044236 
      52       20.090000       0.044236 
      52       20.030000       -0.024715 
      53       20.080000       -0.024715 
      53       20.050000       -0.104977 
      53       19.990000       -0.109043 
      53       19.890000       -0.069113 
      53       19.910000       -0.003053 
      53       19.860000       0.032760 
      53       19.850000       0.010340 
      53       19.830000       -0.067876 
      53       19.880000       -0.067876 
      53       19.900000       -0.067876 
      53       19.870000       -0.130130 
      53       19.840000       -0.135515 
      53       19.900000       -0.092442 
      53       19.900000       0.033629 
      53       19.870000       0.155668 
      54       19.840000       0.135983 
      54       19.840000       0.061447 
      54       19.950000       0.076834 
      54       19.870000       0.076834 
      54       19.880000       0.076834 
      54       19.920000       0.095484 
      54       19.880000       0.044539 
      54       19.790000       0.037736 
      54       19.940000       0.070218 
      54       19.880000       0.018866 
      54       19.760000       -0.051803 
      54       19.880000       -0.139228 
      54       19.940000       -0.254007 
      54       19.900000       -0.298961 
      54       19.920000       -0.201923 
      54       19.920000       -0.057984 
      55       19.850000       -0.033832 
      55       19.970000       -0.071204 
      55       19.920000       -0.071204 
      55       19.990000       -0.071204 
      55       19.960000       -0.071204 
      55       19.960000       -0.056718 
      55       19.940000       -0.017072 
      55       20.020000       0.015031 
      55       19.980000       -0.008181 
      55       19.910000       -0.010744 
      55       19.970000       0.065229 
      55       19.960000       0.080977 
      55       19.970000       0.019847 
      55       19.990000       -0.009609 
      55       19.990000       0.045888 
      56       20.060000       0.068069 
      56       20.010000       -0.024429 
      56       19.990000       -0.068091 
      56       19.980000       -0.037741 
      56       19.960000       0.015957 
      56       19.960000       0.082305 
      56       19.980000       0.072575 
      56       19.970000       0.041785 
      56       20.010000       0.099855 
      56       19.930000       0.137870 
      56       19.990000       0.137870 
      56       20.000000       0.056254 
      56       20.080000       -0.029973 
      56       19.930000       -0.066098 
      56       20.050000       -0.075568 
      56       20.020000       -0.075568 
      57       20.050000       -0.075568 
      57       19.960000       -0.035000 
      57       20.030000       -0.035000 
      57       20.060000       -0.038159 
      57       19.970000       -0.100324 
      57       20.030000       -0.111721 
      57       19.970000       -0.099106 
      57       20.040000       -0.099106 
      57       20.000000       -0.099106 
      57       19.950000       -0.099106 
      57       20.030000       -0.099106 
      57       19.990000       -0.099106 
      57       20.070000       -0.026141 
      57       20.050000       0.078260 
      57       20.030000       0.095318 
      58       20.040000       0.066425 
      58       20.010000       0.059087 
      58       20.050000       0.065608 
      58       19.990000       0.097799 
      58       20.060000       0.097590 
      58       20.010000       0.008014 
      58       20.030000       -0.079619 
      58       19.970000       -0.079619 
      58       20.010000       -0.110168 
      58       19.980000       -0.115040 
      58       19.960000       -0.093691 
      58       20.070000       -0.088599 
      58       20.030000       -0.057250 
      58       20.060000       -0.018771 
      58       20.150000       0.021103 
      59       20.130000       0.012330 
      59       20.070000       0.013683 
      59       20.120000       0.020976 
      59       20.130000       0.004032 
      59       20.140000       0.044299 
      59       20.160000       0.117102 
      59       20.110000       0.117102 
      59       20.160000       0.142956 
      59       20.140000       0.142956 
      59       20.100000       0.130524 
      59       20.140000       0.112693 
      59       20.120000       0.112693 
      59       20.100000       0.112693 
      59       20.090000       0.112693 
      60       20.150000       0.127679 
      60       20.160000       0.133324 
      60       20.110000       0.095331 
      60       20.130000       0.033463 
      60       20.130000       0.008418 
      60       20.150000       0.015312 
      60       20.070000       0.084022 
      60       20.060000       0.173149 
      60       20.120000       0.186971 
      60       20.150000       0.098643 
      60       20.050000       0.020408 
      60       20.070000       0.031836 
      60       20.050000       0.085059 
      60       20.080000       0.126460 
      60       20.080000       0.110875 
      61       20.170000       0.110875 
