

 time    ||    gripping force   ||   raspberry measurement 

      0       0.160000       -803.012121 
      0       0.160000       -803.012121 
      0       0.160000       -803.012121 
      0       1.470000       -803.012121 
      0       0.230000       -803.012121 
      0       0.590000       -803.012121 
      0       0.490000       -803.012121 
      0       0.540000       -803.012121 
      0       0.450000       -803.012121 
      0       0.200000       -803.012121 
      0       0.380000       -803.012121 
      0       0.260000       -803.012121 
      0       0.240000       -803.012121 
      0       0.080000       -803.012121 
      0       0.360000       -803.012121 
      0       0.290000       -803.012121 
      1       0.730000       -803.012121 
      1       0.710000       -803.012121 
      1       0.640000       -803.012121 
      1       34.490000       -803.012121 
      1       31.630000       -794.982000 
      1       63.130000       -787.032180 
      1       98.050000       -779.161858 
      1       118.930000       -779.161858 
      1       119.390000       -779.161858 
      1       116.970000       -779.161858 
      1       116.300000       -779.161858 
      1       116.380000       -771.370240 
      1       115.270000       -763.656537 
      1       114.790000       -763.656537 
      1       114.520000       -756.019972 
      1       113.990000       -748.459772 
      1       113.960000       -740.975170 
      1       113.890000       -740.975170 
      1       113.440000       -740.975170 
      1       113.340000       -740.975170 
      1       113.260000       -733.564238 
      1       113.060000       -726.122350 
      1       112.820000       -726.122350 
      1       112.830000       -722.568436 
      1       112.750000       -679.272502 
      1       112.530000       -485.226293 
      2       112.450000       -485.226293 
      2       112.310000       -485.226293 
      2       112.070000       -485.226293 
      2       112.100000       -165.234437 
      2       111.990000       29.107994 
      2       111.850000       29.107994 
      2       111.820000       72.955242 
      2       111.770000       72.955242 
      2       111.740000       77.056288 
      2       111.590000       77.056288 
      2       111.570000       77.534537 
      2       111.470000       77.681331 
      2       111.410000       77.681331 
      2       111.400000       77.681331 
      2       111.330000       77.681331 
      2       111.320000       77.681331 
      2       111.230000       77.681331 
      2       111.040000       77.681331 
      2       111.010000       77.681331 
      2       110.970000       77.681331 
      2       110.840000       77.681331 
      2       110.860000       77.681331 
      3       110.750000       77.681331 
      3       110.550000       77.693308 
      3       110.100000       77.693308 
      3       108.510000       77.678457 
      3       107.010000       77.695660 
      3       102.910000       77.713021 
      3       96.890000       77.719415 
      3       89.910000       77.718406 
      3       81.210000       77.718406 
      3       76.380000       77.719858 
      3       71.350000       77.719858 
      3       71.720000       77.719858 
      3       72.070000       77.719858 
      3       73.030000       77.718420 
      3       74.370000       77.719858 
      4       75.290000       77.719858 
      4       75.880000       77.719858 
      4       75.970000       77.719858 
      4       76.630000       77.719858 
      4       76.610000       77.719858 
      4       76.640000       77.719858 
      4       76.660000       77.719858 
      4       76.630000       77.719858 
      4       77.070000       77.719858 
      4       77.130000       77.719858 
      4       77.990000       77.719858 
      4       78.290000       77.719858 
      4       79.040000       77.719858 
      4       79.280000       77.718420 
      4       79.340000       77.719858 
      4       79.350000       77.719858 
      5       79.360000       77.719858 
      5       79.340000       77.718419 
      5       79.340000       77.719818 
      5       79.310000       77.719818 
      5       79.280000       77.719818 
      5       79.360000       77.719818 
      5       79.350000       77.719818 
      5       79.300000       77.719818 
      5       79.350000       77.719818 
      5       79.290000       77.719818 
      5       79.370000       77.719818 
      5       79.300000       77.719818 
      5       79.380000       77.719818 
      5       79.300000       77.719818 
      5       79.260000       77.719818 
      6       79.310000       77.719818 
      6       79.330000       77.719818 
      6       79.230000       77.719818 
      6       79.320000       77.719818 
      6       79.240000       77.719818 
      6       79.310000       77.719818 
      6       79.320000       77.719818 
      6       79.230000       77.717076 
      6       79.240000       77.703177 
      6       79.260000       77.703177 
      6       79.230000       77.703177 
      6       79.320000       77.703177 
      6       79.240000       77.703177 
      6       79.200000       77.703177 
      6       79.220000       77.703177 
      7       79.190000       77.703177 
      7       79.300000       77.703177 
      7       79.180000       77.639045 
      7       79.260000       77.557886 
      7       79.260000       77.557886 
      7       79.530000       77.557886 
      7       79.760000       77.557886 
      7       79.750000       77.557886 
      7       79.810000       77.557886 
      7       79.800000       77.557886 
      7       79.730000       77.557886 
      7       79.770000       77.507636 
      7       79.760000       77.410290 
      7       79.830000       77.410290 
      7       79.750000       77.410290 
      7       79.760000       77.410290 
      8       79.780000       77.410290 
      8       79.720000       77.209047 
      8       79.790000       76.976838 
      8       79.750000       76.976838 
      8       79.740000       76.976838 
      8       79.720000       76.976838 
      8       79.710000       76.976838 
      8       79.690000       76.976838 
      8       79.680000       76.976838 
      8       79.680000       76.847296 
      8       79.670000       76.811330 
      8       79.740000       76.769207 
      8       79.730000       76.729272 
      8       79.710000       76.729272 
      8       79.680000       76.729272 
      9       79.700000       76.729272 
      9       79.660000       76.729272 
      9       79.710000       76.729272 
      9       79.640000       76.729272 
      9       79.720000       76.729272 
      9       79.660000       76.729272 
      9       79.660000       76.729272 
      9       79.660000       76.729272 
      9       79.720000       76.729272 
      9       79.650000       76.729272 
      9       79.660000       76.729272 
      9       79.630000       76.729272 
      9       79.670000       76.729272 
      9       79.660000       76.729272 
      9       79.680000       76.729272 
      10       79.620000       76.729272 
      10       79.630000       76.721631 
      10       79.690000       76.729271 
      10       79.670000       76.729271 
      10       79.630000       76.729271 
      10       79.660000       76.769139 
      10       79.680000       76.769139 
      10       79.660000       76.809033 
      10       79.640000       76.817533 
      10       79.710000       76.819831 
      10       79.600000       76.819831 
      10       79.620000       76.819831 
      10       79.690000       76.819831 
      10       79.660000       76.818419 
      10       79.600000       76.819831 
      11       79.660000       76.819831 
      11       79.640000       76.819831 
      11       79.610000       76.819831 
      11       79.660000       76.819831 
      11       79.610000       76.819831 
      11       79.670000       76.819831 
      11       79.610000       76.817533 
      11       79.630000       76.809033 
      11       79.660000       76.769139 
      11       79.700000       76.729271 
      11       79.620000       76.729271 
      11       79.620000       76.729271 
      11       79.600000       76.729271 
      11       79.580000       76.729271 
      11       79.630000       76.721631 
      12       79.600000       76.729245 
      12       79.550000       76.729245 
      12       79.630000       76.729245 
      12       79.610000       76.729245 
      12       79.540000       76.768253 
      12       79.630000       76.798235 
      12       79.610000       76.798235 
      12       79.610000       76.798235 
      12       79.550000       76.769139 
      12       79.560000       76.740016 
      12       79.640000       76.769139 
      12       79.560000       76.769139 
      12       79.630000       76.769139 
      12       79.620000       76.798262 
      12       79.500000       76.769139 
      13       79.620000       76.769139 
      13       79.570000       76.740043 
      13       79.620000       76.770025 
      13       79.600000       76.770025 
      13       79.600000       76.809060 
      13       79.620000       76.817533 
      13       79.640000       76.817533 
      13       79.560000       76.817533 
      13       79.610000       76.817533 
      13       79.600000       76.817533 
      13       79.580000       76.817533 
      13       79.560000       76.817533 
      13       79.550000       76.819831 
      13       79.610000       76.818419 
      13       79.590000       76.818419 
      14       79.600000       76.818419 
      14       79.550000       76.819872 
      14       79.530000       76.819872 
      14       79.540000       76.818876 
      14       79.570000       76.825687 
      14       79.530000       76.847586 
      14       79.620000       76.847586 
      14       79.530000       76.878980 
      14       79.540000       76.863283 
      14       79.590000       76.828788 
      14       79.570000       76.820731 
      14       79.580000       76.818446 
      14       79.490000       76.819858 
      14       79.550000       76.818420 
      14       79.540000       76.819858 
      14       79.480000       76.818420 
      15       79.560000       76.819858 
      15       79.580000       76.819858 
      15       79.530000       76.819858 
      15       79.530000       76.818420 
      15       79.580000       76.819858 
      15       79.500000       76.819858 
      15       79.510000       76.819858 
      15       79.570000       76.819858 
      15       79.520000       76.819858 
      15       79.570000       76.818420 
      15       79.490000       76.818420 
      15       79.540000       76.819858 
      15       79.560000       76.819858 
      15       79.480000       76.818420 
      15       79.590000       76.819858 
      16       79.550000       76.819858 
      16       79.530000       76.819858 
      16       79.490000       76.818420 
      16       79.420000       76.819858 
      16       79.530000       76.819858 
      16       79.800000       76.819858 
      16       81.480000       76.819858 
      16       82.810000       76.818420 
      16       84.050000       76.819858 
      16       84.650000       76.818420 
      16       84.580000       76.819858 
      16       84.530000       76.818420 
      16       84.540000       76.818420 
      16       84.470000       76.818420 
      16       84.490000       76.818420 
      17       84.500000       76.819858 
      17       84.480000       76.818420 
      17       84.530000       76.818420 
      17       84.460000       76.819858 
      17       84.450000       76.819858 
      17       84.410000       76.818419 
      17       84.410000       76.819831 
      17       84.420000       76.819831 
      17       84.400000       76.817533 
      17       84.410000       76.809060 
      17       84.380000       76.809060 
      17       84.340000       76.770025 
      17       84.410000       76.740070 
      17       84.420000       76.770025 
      17       84.330000       76.770025 
      18       84.380000       76.770025 
      18       84.320000       76.770025 
      18       84.340000       76.770025 
      18       84.300000       76.809060 
      18       84.350000       76.817533 
      18       84.320000       76.819845 
      18       84.340000       76.818863 
      18       84.300000       76.818863 
      18       84.360000       76.818863 
      18       84.280000       76.818863 
      18       84.290000       76.825257 
      18       84.290000       76.842616 
      18       84.290000       76.859725 
      18       84.300000       76.841730 
      18       83.940000       76.841730 
      19       83.850000       76.841730 
      19       83.880000       76.814459 
      19       83.850000       76.770495 
      19       83.850000       76.740969 
      19       83.860000       76.740969 
      19       83.730000       76.780811 
      19       83.530000       76.857024 
      19       83.180000       76.892379 
      19       82.800000       76.892379 
      19       82.020000       76.892379 
      19       81.290000       76.892379 
      19       80.250000       76.892379 
      19       79.640000       76.892379 
      19       78.910000       76.849857 
      19       78.610000       76.818490 
      20       78.630000       76.818490 
      20       78.630000       76.855669 
      20       78.690000       76.857911 
      20       78.710000       76.828345 
      20       78.720000       76.820718 
      20       78.710000       76.820718 
      20       78.690000       76.818473 
      20       78.770000       76.820732 
      20       78.770000       76.828801 
      20       78.720000       76.863739 
      20       78.740000       76.863739 
      20       78.700000       76.863739 
      20       78.770000       76.863739 
      20       78.750000       76.863739 
      20       78.750000       76.863739 
      21       78.800000       76.863739 
      21       78.800000       76.884809 
      21       78.810000       76.884809 
      21       78.780000       76.876752 
      21       78.800000       76.876752 
      21       78.780000       76.876752 
      21       78.750000       76.876752 
      21       78.790000       76.876752 
      21       78.760000       76.876752 
      21       78.830000       76.876752 
      21       78.790000       76.876752 
      21       78.770000       76.876752 
      21       78.780000       76.876752 
      21       78.820000       76.876752 
      21       78.840000       76.876752 
      21       78.830000       76.876752 
      22       78.730000       76.884809 
      22       78.800000       76.863713 
      22       78.790000       76.827915 
      22       78.760000       76.809933 
      22       78.850000       76.770052 
      22       78.810000       76.770052 
      22       78.850000       76.770052 
      22       78.810000       76.770052 
      22       78.810000       76.740070 
      22       78.850000       76.770025 
      22       78.810000       76.770025 
      22       78.850000       76.770025 
      22       78.810000       76.770025 
      22       78.830000       76.770025 
      22       78.790000       76.770025 
      23       78.780000       76.770025 
      23       78.850000       76.770025 
      23       78.840000       76.770025 
      23       78.750000       76.770025 
      23       78.770000       76.770025 
      23       78.830000       76.770025 
      23       78.860000       76.770025 
      23       78.810000       76.770025 
      23       78.870000       76.770025 
      23       78.830000       76.770025 
      23       78.790000       76.770025 
      23       78.800000       76.770025 
      23       78.830000       76.770025 
      23       78.770000       76.770025 
      24       78.800000       76.770025 
      24       78.890000       76.770025 
      24       78.870000       76.770025 
      24       78.910000       76.770025 
      24       78.840000       76.770025 
      24       78.770000       76.809060 
      24       78.820000       76.817533 
      24       78.870000       76.817533 
      24       78.880000       76.817533 
      24       78.910000       76.817533 
      24       78.820000       76.819831 
      24       78.920000       76.818419 
      24       78.830000       76.818419 
      24       78.860000       76.819858 
      24       78.900000       76.818420 
      25       78.780000       76.818420 
      25       78.900000       76.818420 
      25       78.970000       76.819858 
      25       78.830000       76.818406 
      25       78.920000       76.818406 
      25       78.850000       76.818406 
      25       79.050000       76.818406 
      25       79.000000       76.818406 
      25       78.990000       76.818406 
      25       79.070000       76.819401 
      25       79.040000       76.812564 
      25       78.990000       76.789805 
      25       79.120000       76.789805 
      25       79.050000       76.748499 
      25       79.070000       76.748499 
      25       79.090000       76.748499 
      26       78.970000       76.748499 
      26       79.130000       76.726600 
      26       79.020000       76.726600 
      26       79.090000       76.726600 
      26       79.120000       76.729675 
      26       79.050000       76.729675 
      26       79.120000       76.729675 
      26       79.080000       76.729675 
      26       79.050000       76.729675 
      26       79.120000       76.729675 
      26       79.100000       76.768266 
      26       79.110000       76.768266 
      26       79.190000       76.798208 
      26       79.100000       76.798208 
      26       79.510000       76.798208 
      27       79.630000       76.768252 
      27       79.770000       76.729245 
      27       79.960000       76.729245 
      27       79.960000       76.729245 
      27       80.010000       76.729245 
      27       80.010000       76.721631 
      27       80.030000       76.729245 
      27       79.930000       76.729245 
      27       80.010000       76.729245 
      27       80.020000       76.729245 
      27       80.020000       76.729245 
      27       80.010000       76.729245 
      27       79.960000       76.729245 
      27       80.000000       76.729245 
      27       79.940000       76.729245 
      28       79.960000       76.729245 
      28       80.010000       76.729245 
      28       79.940000       76.729245 
      28       79.990000       76.729245 
      28       79.960000       76.729245 
      28       80.000000       76.729245 
      28       79.990000       76.729245 
      28       79.910000       76.768253 
      28       79.980000       76.798235 
      28       79.910000       76.798235 
      28       79.980000       76.769139 
      28       79.950000       76.740016 
      28       79.990000       76.740016 
      28       79.990000       76.740016 
      28       79.950000       76.769139 
      28       79.920000       76.798235 
      29       80.000000       76.798235 
      29       79.980000       76.798235 
      29       80.000000       76.798235 
      29       80.010000       76.798235 
      29       79.980000       76.798235 
      29       79.960000       76.768253 
      29       79.930000       76.729245 
      29       79.970000       76.721631 
      29       79.990000       76.729271 
      29       79.960000       76.769139 
      29       79.980000       76.769139 
      29       79.990000       76.809006 
      29       79.970000       76.816647 
      29       80.010000       76.816647 
      29       79.970000       76.816647 
      30       80.000000       76.816647 
      30       80.020000       76.809033 
      30       79.990000       76.770025 
      30       79.990000       76.740070 
      30       80.010000       76.770025 
      30       79.960000       76.770025 
      30       80.020000       76.770025 
      30       79.980000       76.809060 
      30       79.980000       76.817520 
      30       79.970000       76.819375 
      30       80.000000       76.812564 
      30       79.970000       76.812564 
      30       79.940000       76.789805 
      30       79.930000       76.748472 
      30       79.980000       76.748472 
      30       79.970000       76.748472 
      31       79.960000       76.748472 
      31       79.950000       76.748472 
      31       79.980000       76.748472 
      31       80.050000       76.748472 
      31       79.950000       76.725714 
      31       80.030000       76.718876 
      31       80.000000       76.718876 
      31       80.010000       76.719885 
      31       80.050000       76.718863 
      31       79.960000       76.718863 
      31       80.030000       76.718863 
      31       79.990000       76.725257 
      31       79.950000       76.742643 
      31       80.010000       76.742643 
      31       80.020000       76.742643 
      32       79.980000       76.742643 
      32       79.990000       76.742643 
      32       79.970000       76.742643 
      32       80.010000       76.742643 
      32       80.000000       76.760639 
      32       79.980000       76.760639 
      32       80.000000       76.753415 
      32       80.030000       76.773651 
      32       80.010000       76.773651 
      32       80.000000       76.773651 
      32       79.950000       76.773651 
      32       80.010000       76.798651 
      32       79.960000       76.768266 
      32       79.990000       76.768266 
      32       80.030000       76.768266 
      33       79.970000       76.768266 
      33       79.950000       76.768266 
      33       80.010000       76.729218 
      33       79.990000       76.720744 
      33       80.000000       76.718446 
      33       79.950000       76.719858 
      33       79.940000       76.719858 
      33       79.920000       76.718420 
      33       79.940000       76.719858 
      33       79.960000       76.719858 
      33       80.000000       76.719858 
      33       79.900000       76.719858 
      33       79.970000       76.719858 
      33       79.950000       76.719858 
      33       80.010000       76.719858 
      34       79.980000       76.719858 
      34       79.900000       76.719858 
      34       79.980000       76.719858 
      34       79.900000       76.719858 
      34       79.970000       76.719858 
      34       79.950000       76.719858 
      34       79.890000       76.719858 
      34       79.970000       76.718446 
      34       79.890000       76.720731 
      34       79.960000       76.720731 
      34       79.950000       76.720731 
      34       79.930000       76.720731 
      34       79.890000       76.720731 
      34       79.940000       76.728788 
      34       79.890000       76.763283 
      35       79.970000       76.763283 
      35       79.930000       76.763283 
      35       79.950000       76.763283 
      35       79.960000       76.763283 
      35       79.930000       76.763283 
      35       79.920000       76.763283 
      35       79.900000       76.763283 
      35       79.880000       76.763283 
      35       79.950000       76.763283 
      35       79.950000       76.763283 
      35       79.930000       76.763283 
      35       79.910000       76.763283 
      35       79.950000       76.763283 
      35       79.890000       76.763283 
      35       79.920000       76.763283 
      36       79.880000       76.763283 
      36       79.910000       76.763283 
      36       79.880000       76.778980 
      36       79.910000       76.747586 
      36       79.940000       76.747586 
      36       79.930000       76.747586 
      36       79.880000       76.725687 
      36       79.910000       76.718876 
      36       79.910000       76.718876 
      36       79.880000       76.718876 
      36       79.870000       76.718876 
      36       79.910000       76.718876 
      36       79.890000       76.718876 
      36       79.950000       76.718876 
      36       79.930000       76.718876 
      37       79.880000       76.718876 
      37       79.930000       76.718876 
      37       79.870000       76.718876 
      37       79.940000       76.718876 
      37       79.880000       76.718876 
      37       79.910000       76.718876 
      37       79.900000       76.718876 
      37       79.870000       76.718876 
      37       79.960000       76.718876 
      37       79.940000       76.718876 
      37       79.880000       76.718876 
      37       79.880000       76.718876 
      37       79.850000       76.718876 
      37       79.890000       76.718876 
      37       79.900000       76.718876 
      37       79.860000       76.718876 
      38       79.900000       76.718876 
      38       79.890000       76.718876 
      38       79.930000       76.718876 
      38       79.890000       76.718876 
      38       79.860000       76.718876 
      38       79.870000       76.718876 
      38       79.900000       76.718876 
      38       79.890000       76.718876 
      38       79.920000       76.718876 
      38       79.900000       76.718876 
      38       79.940000       76.718876 
      38       79.860000       76.719872 
      38       79.890000       76.719872 
      38       79.870000       76.719872 
      38       79.900000       76.719872 
      39       79.830000       76.718420 
      39       79.870000       76.719858 
      39       79.950000       76.718420 
      39       79.880000       76.718420 
      39       79.910000       76.718420 
      39       79.860000       76.718420 
      39       79.840000       76.718420 
      39       79.890000       76.718420 
      39       79.840000       76.718420 
      39       79.860000       76.719858 
      39       79.870000       76.718446 
      39       79.850000       76.718446 
      39       79.890000       76.718446 
      39       79.900000       76.718446 
      39       79.820000       76.718446 
      40       79.850000       76.718446 
      40       79.830000       76.718446 
      40       79.860000       76.718446 
      40       79.960000       76.718446 
      40       79.850000       76.718446 
      40       79.850000       76.720744 
      40       79.810000       76.729218 
      40       79.810000       76.729218 
      40       79.900000       76.729218 
      40       79.830000       76.729218 
      40       79.920000       76.729218 
      40       79.830000       76.729218 
      40       79.910000       76.768252 
      40       79.850000       76.798208 
      40       79.880000       76.798208 
      41       79.850000       76.798208 
      41       79.870000       76.768252 
      41       79.770000       76.729218 
      41       79.890000       76.729218 
      41       79.880000       76.729218 
      41       79.830000       76.729218 
      41       79.900000       76.729218 
      41       79.780000       76.720744 
      41       79.830000       76.718446 
      41       79.760000       76.719859 
      41       79.870000       76.718446 
      41       79.890000       76.720744 
      41       79.930000       76.729218 
      41       79.820000       76.729218 
      41       79.870000       76.729218 
      41       79.800000       76.729218 
      42       79.830000       76.729218 
      42       79.880000       76.729218 
      42       79.770000       76.729218 
      42       79.810000       76.729218 
      42       79.880000       76.729218 
      42       79.850000       76.729218 
      42       79.840000       76.768252 
      42       79.830000       76.798208 
      42       79.830000       76.798208 
      42       79.870000       76.798208 
      42       79.850000       76.768252 
      42       79.900000       76.768252 
      42       79.830000       76.729218 
      42       79.800000       76.729218 
      42       79.810000       76.729218 
      43       79.780000       76.729218 
      43       79.870000       76.729218 
      43       79.800000       76.729218 
      43       79.830000       76.720744 
      43       79.860000       76.718446 
      43       79.800000       76.718446 
      43       79.830000       76.718446 
      43       79.830000       76.718446 
      43       79.770000       76.718446 
      43       79.870000       76.719858 
      43       80.060000       76.718420 
      43       80.070000       76.718420 
      43       80.170000       76.718420 
      43       80.170000       76.719858 
      43       80.170000       76.719858 
      43       80.110000       76.719858 
      44       80.180000       76.719858 
      44       80.130000       76.719858 
      44       80.130000       76.719858 
      44       80.170000       76.719858 
      44       80.180000       76.719858 
      44       80.130000       76.718420 
      44       80.170000       76.719858 
      44       80.130000       76.719858 
      44       80.180000       76.719858 
      44       80.140000       76.719858 
      44       80.110000       76.719858 
      44       80.160000       76.719858 
      44       80.180000       76.719858 
      44       80.160000       76.719858 
      44       80.140000       76.719858 
      45       80.230000       76.719858 
      45       80.120000       76.719858 
      45       80.170000       76.718420 
      45       80.160000       76.719858 
      45       80.160000       76.719858 
      45       80.120000       76.719858 
      45       80.200000       76.718446 
      45       80.170000       76.720744 
      45       80.140000       76.720744 
      45       80.180000       76.720744 
      45       80.150000       76.720744 
      45       80.130000       76.720744 
      45       80.150000       76.720744 
      45       80.130000       76.720744 
      45       80.140000       76.720744 
      46       80.170000       76.720744 
      46       80.180000       76.720744 
      46       80.150000       76.720744 
      46       80.150000       76.720744 
      46       80.180000       76.729218 
      46       80.120000       76.729218 
      46       80.090000       76.729218 
      46       80.180000       76.768252 
      46       80.160000       76.798235 
      46       80.130000       76.798235 
      46       80.190000       76.769125 
      46       80.140000       76.769125 
      46       80.120000       76.769125 
      46       80.130000       76.739586 
      46       80.170000       76.764196 
      47       80.140000       76.764196 
      47       80.140000       76.764196 
      47       80.150000       76.779893 
      47       80.120000       76.758384 
      47       80.130000       76.758384 
      47       80.150000       76.758384 
      47       80.100000       76.758384 
      47       80.130000       76.758384 
      47       80.160000       76.758384 
      47       80.110000       76.758384 
      47       80.180000       76.758384 
      47       80.200000       76.774081 
      47       80.100000       76.798664 
      47       80.110000       76.798664 
      47       80.140000       76.798664 
      48       80.110000       76.798664 
      48       80.150000       76.798664 
      48       80.160000       76.768266 
      48       80.070000       76.729218 
      48       80.110000       76.729218 
      48       80.170000       76.729218 
      48       80.140000       76.729218 
      48       80.160000       76.729218 
      48       80.140000       76.729218 
      48       80.100000       76.729218 
      48       80.160000       76.729218 
      48       80.110000       76.729218 
      48       80.150000       76.720744 
      48       80.150000       76.718446 
      48       80.140000       76.718446 
      48       80.070000       76.719858 
      49       80.090000       76.719858 
      49       80.100000       76.719858 
      49       80.120000       76.719858 
      49       80.080000       76.718406 
      49       80.130000       76.718406 
      49       80.150000       76.718406 
      49       80.140000       76.718406 
      49       80.130000       76.718406 
      49       80.130000       76.719415 
      49       80.120000       76.713021 
      49       80.100000       76.713021 
      49       80.110000       76.713021 
      49       80.080000       76.713021 
      49       80.110000       76.713021 
      49       80.160000       76.695661 
      50       80.090000       76.678525 
      50       80.140000       76.678525 
      50       80.140000       76.678525 
      50       80.110000       76.678525 
      50       80.140000       76.678525 
      50       80.120000       76.678525 
      50       80.120000       76.678525 
      50       80.130000       76.695661 
      50       80.110000       76.713021 
      50       80.080000       76.713021 
      50       80.060000       76.713021 
      50       80.100000       76.713021 
      50       80.110000       76.713021 
      50       80.080000       76.713021 
      50       80.080000       76.713021 
      51       80.050000       76.713021 
      51       80.110000       76.713021 
      51       80.100000       76.719415 
      51       80.070000       76.718406 
      51       80.110000       76.718406 
      51       80.110000       76.718406 
      51       80.090000       76.718406 
      51       80.130000       76.718406 
      51       80.150000       76.718406 
      51       80.140000       76.718406 
      51       80.080000       76.718406 
      51       80.050000       76.718406 
      51       80.100000       76.718406 
      51       80.050000       76.718406 
      51       80.140000       76.718406 
      52       80.070000       76.719858 
      52       80.080000       76.719858 
      52       80.090000       76.719858 
      52       80.060000       76.718420 
      52       80.070000       76.718420 
      52       80.080000       76.718420 
      52       80.100000       76.718420 
      52       80.100000       76.718420 
      52       80.090000       76.718420 
      52       80.140000       76.719858 
      52       80.040000       76.718420 
      52       80.090000       76.718420 
      52       80.100000       76.718420 
      52       80.020000       76.718420 
      52       80.170000       76.718420 
      53       80.060000       76.718420 
      53       80.080000       76.718420 
      53       80.080000       76.718420 
      53       80.080000       76.718420 
      53       80.120000       76.718420 
      53       80.070000       76.718420 
      53       80.130000       76.718420 
      53       80.040000       76.718420 
      53       80.090000       76.718420 
      53       80.050000       76.718420 
      53       80.020000       76.718420 
      53       80.090000       76.719858 
      53       80.060000       76.719858 
      53       80.010000       76.718406 
      53       80.050000       76.718406 
      54       80.090000       76.718406 
      54       80.040000       76.718406 
      54       80.020000       76.718406 
      54       80.080000       76.718406 
      54       79.990000       76.719415 
      54       80.100000       76.719415 
      54       80.120000       76.719415 
      54       80.080000       76.713021 
      54       80.050000       76.713021 
      54       80.040000       76.713021 
      54       80.080000       76.713021 
      54       80.010000       76.713021 
      54       80.070000       76.713021 
      54       80.070000       76.713021 
      54       80.090000       76.713021 
      55       80.080000       76.713021 
      55       80.050000       76.695661 
      55       80.080000       76.678525 
      55       80.030000       76.678525 
      55       79.990000       76.695661 
      55       80.110000       76.713021 
      55       80.110000       76.713021 
      55       80.060000       76.713021 
      55       80.160000       76.713021 
      55       80.040000       76.713021 
      55       80.080000       76.713021 
      55       80.060000       76.713021 
      55       80.010000       76.713021 
      55       80.120000       76.713021 
      55       80.030000       76.713021 
      55       80.100000       76.719415 
      56       80.060000       76.718406 
      56       80.060000       76.718406 
      56       80.130000       76.719858 
      56       80.040000       76.718420 
      56       80.100000       76.718420 
      56       80.060000       76.718420 
      56       79.980000       76.718420 
      56       80.010000       76.718420 
      56       80.030000       76.718420 
      56       80.050000       76.718420 
      56       80.030000       76.718420 
      56       79.990000       76.718420 
      56       80.040000       76.718420 
      56       79.940000       76.718420 
      56       80.070000       76.718420 
      57       80.020000       76.718420 
      57       80.040000       76.718420 
      57       80.080000       76.718420 
      57       80.030000       76.718420 
      57       80.070000       76.718420 
      57       80.040000       76.718420 
      57       80.110000       76.718420 
      57       80.010000       76.718420 
      57       80.030000       76.718420 
      57       79.990000       76.718420 
      57       80.040000       76.719858 
      57       80.040000       76.718420 
      57       80.040000       76.718420 
      57       80.060000       76.719858 
      57       80.040000       76.718446 
      58       80.030000       76.718446 
      58       80.040000       76.718446 
      58       79.970000       76.718446 
      58       79.980000       76.718446 
      58       79.970000       76.718446 
      58       79.980000       76.718446 
      58       80.030000       76.718446 
      58       79.980000       76.718446 
      58       80.070000       76.718446 
      58       80.030000       76.718446 
      58       79.940000       76.718446 
      58       80.010000       76.718446 
      58       80.030000       76.718446 
      58       79.990000       76.720744 
      58       80.030000       76.729218 
      59       80.000000       76.729218 
      59       80.070000       76.729218 
      59       79.990000       76.729218 
      59       79.970000       76.729218 
      59       80.080000       76.729218 
      59       79.980000       76.768252 
      59       80.060000       76.768252 
      59       79.970000       76.768252 
      59       80.040000       76.798208 
      59       80.060000       76.768252 
      59       80.010000       76.729218 
      59       80.020000       76.729218 
      59       80.010000       76.720744 
      59       80.000000       76.718446 
      59       80.060000       76.719858 
      59       79.940000       76.718420 
      60       80.040000       76.718420 
      60       80.060000       76.719858 
      60       80.010000       76.719858 
      60       80.040000       76.719858 
      60       80.030000       76.718420 
      60       79.980000       76.719858 
      60       80.060000       76.719858 
      60       79.980000       76.719858 
      60       80.020000       76.719858 
      60       80.060000       76.719858 
      60       79.900000       76.719858 
      60       80.050000       76.719858 
      60       80.000000       76.719858 
      60       80.040000       76.719858 
      60       80.080000       76.718420 
      61       79.960000       76.719858 
