Human trial picking the raspberry twin 

 time    ||     output     ||     loadcell

      0.000000       -799.000000       0.080000 
      0.016235       -799.000000       0.060000 
      0.032198       -799.000000       0.050000 
      0.047302       -799.000000       0.090000 
      0.063850       -799.000000       0.110000 
      0.079141       -799.000000       0.100000 
      0.108932       -799.000000       0.110000 
      0.124267       -799.000000       0.010000 
      0.140912       -799.000000       0.060000 
      0.156870       -798.999995       0.180000 
      0.172918       -798.998807       0.040000 
      0.188970       -798.891877       0.120000 
      0.203881       -795.350830       0.090000 
      0.220169       -752.212048       0.210000 
      0.235275       -558.877439       0.110000 
      0.250677       -240.122557       0.010000 
      0.266636       -46.787948       0.030000 
      0.281923       -3.649166       0.060000 
      0.297066       -0.108119       0.010000 
      0.313565       -0.001188       0.130000 
      0.328448       -0.000001       0.090000 
      0.344050       0.000004       0.090000 
      0.358425       0.000004       0.120000 
      0.373817       0.000004       0.160000 
      0.390885       0.000004       0.120000 
      0.406704       0.000004       0.010000 
      0.421957       0.000004       0.160000 
      0.437290       0.000004       0.050000 
      0.453780       0.000004       0.050000 
      0.468938       0.000004       0.050000 
      0.483504       0.000004       0.000000 
      0.500252       0.000004       0.050000 
      0.516144       0.000004       0.050000 
      0.532053       0.000004       0.010000 
      0.548243       0.000004       0.120000 
      0.563851       0.000004       0.060000 
      0.579114       0.000004       0.010000 
      0.595140       0.000004       0.040000 
      0.610456       0.000004       0.040000 
      0.626870       0.000004       0.140000 
      0.641579       0.000004       0.030000 
      0.657540       0.000004       0.000000 
      0.672202       0.000004       0.120000 
      0.688663       0.000004       0.100000 
      0.703948       0.000004       0.050000 
      0.719781       0.000004       0.060000 
      0.736405       0.000004       0.100000 
      0.749211       0.000004       0.090000 
      0.765104       0.000004       0.030000 
      0.780058       0.000004       0.150000 
      0.796618       0.000004       0.010000 
      0.810489       0.000004       0.070000 
      0.826460       0.000004       0.000000 
      0.841684       0.000004       0.030000 
      0.858328       0.000004       0.020000 
      0.874116       0.000004       0.030000 
      0.888410       0.000004       0.120000 
      0.904119       0.000004       0.070000 
      0.920298       0.000004       0.140000 
      0.935167       0.000004       0.040000 
      0.949231       0.000004       0.180000 
      0.965117       0.000004       0.020000 
      0.980237       0.000004       0.110000 
      0.996260       0.000004       0.070000 
      1.011896       0.000004       0.090000 
      1.027648       0.000004       0.000000 
      1.042166       0.000004       0.010000 
      1.072407       0.000004       0.100000 
      1.087587       0.000004       0.040000 
      1.103937       0.000004       0.080000 
      1.133904       0.000004       0.070000 
      1.149721       0.000004       0.080000 
      1.166255       0.000004       0.060000 
      1.181214       0.000004       0.080000 
      1.198183       0.000004       0.000000 
      1.214138       0.000004       0.130000 
      1.229995       0.000004       0.060000 
      1.244213       0.000004       0.090000 
      1.260713       0.000004       0.020000 
      1.276866       0.000004       0.120000 
      1.291273       0.000004       0.010000 
      1.306927       0.000004       0.050000 
      1.321748       0.000004       0.100000 
      1.338252       0.000004       0.130000 
      1.354467       0.000004       0.150000 
      1.368683       0.000004       0.070000 
      1.382987       0.000004       0.010000 
      1.398915       0.000004       0.110000 
      1.415449       0.000004       0.120000 
      1.430198       0.000004       0.090000 
      1.446189       0.000004       0.120000 
      1.461075       0.000004       0.010000 
      1.475250       0.000004       0.010000 
      1.490902       0.000004       0.080000 
      1.506112       0.000004       0.110000 
      1.522993       0.000004       0.020000 
      1.538013       0.000004       0.150000 
      1.554054       0.000004       0.090000 
      1.570953       0.000004       0.010000 
      1.586678       0.000004       0.010000 
      1.602104       0.000004       0.030000 
      1.617948       0.000004       0.000000 
      1.632902       0.000004       0.060000 
      1.650007       0.000004       0.090000 
      1.665980       0.000004       0.060000 
      1.681116       0.000004       0.100000 
      1.696109       0.000004       0.050000 
      1.711857       0.000004       0.120000 
      1.727806       0.000004       0.050000 
      1.742010       0.000004       0.030000 
      1.757824       0.000004       0.010000 
      1.772943       0.000004       0.030000 
      1.789534       0.000004       0.100000 
      1.818913       0.000004       0.060000 
      1.834005       0.000004       0.080000 
      1.849171       0.000004       0.090000 
      1.866452       0.000004       0.070000 
      1.882999       0.000004       0.080000 
      1.897958       0.000004       0.060000 
      1.912111       0.000004       0.070000 
      1.928135       0.000004       0.010000 
      1.943419       0.000004       0.100000 
      1.959280       0.000004       0.040000 
      1.975803       0.000004       0.060000 
      1.990940       0.000004       0.060000 
      2.006985       0.000004       0.030000 
      2.022433       0.000004       0.110000 
      2.038464       0.000004       0.010000 
      2.054445       0.000004       0.070000 
      2.070486       0.000004       0.050000 
      2.086485       0.000004       0.080000 
      2.101465       0.000004       0.010000 
      2.132277       0.000004       0.000000 
      2.149234       0.000004       0.050000 
      2.179621       0.000004       0.060000 
      2.211563       0.000004       0.070000 
      2.228016       0.000004       0.040000 
      2.243975       0.000004       0.030000 
      2.260003       0.000004       0.090000 
      2.275352       0.000004       0.060000 
      2.289600       0.000004       0.040000 
      2.320353       0.000004       0.070000 
      2.337136       0.000004       0.140000 
      2.353806       0.000004       0.070000 
      2.368533       0.000004       0.050000 
      2.383878       0.000004       0.030000 
      2.400026       0.000004       0.020000 
      2.416176       0.000004       0.070000 
      2.432293       0.000004       0.050000 
      2.448296       0.000004       0.050000 
      2.463619       0.000004       0.000000 
      2.479262       0.000004       0.030000 
      2.494706       0.000004       0.100000 
      2.510686       0.000004       0.010000 
      2.525843       0.000004       0.000000 
      2.540803       0.000004       0.030000 
      2.556106       0.000004       0.030000 
      2.572166       0.000004       0.080000 
      2.587814       0.000004       0.020000 
      2.603830       0.000004       0.030000 
      2.617271       0.000004       0.040000 
      2.632827       0.000004       0.000000 
      2.649096       0.000004       0.080000 
      2.665053       0.000004       0.020000 
      2.681012       0.000004       0.040000 
      2.696162       0.000004       0.050000 
      2.711378       0.000004       0.010000 
      2.726071       0.000004       0.010000 
      2.742326       0.000004       0.050000 
      2.758534       0.000004       0.060000 
      2.774588       0.000004       0.080000 
      2.788813       0.000004       0.020000 
      2.804761       0.000004       0.060000 
      2.820005       0.000004       0.100000 
      2.835415       0.000004       0.050000 
      2.849912       0.000004       0.020000 
      2.865378       0.000004       0.080000 
      2.881517       0.000004       0.010000 
      2.896752       0.000004       0.090000 
      2.912018       0.000004       0.030000 
      2.926974       0.000004       0.020000 
      2.942399       0.000004       0.030000 
      2.957464       0.000004       0.010000 
      2.988222       0.000004       0.030000 
      3.003563       0.000004       0.030000 
      3.020148       0.000004       0.010000 
      3.035192       0.000004       0.010000 
      3.051176       0.000004       0.050000 
      3.066472       0.000004       0.020000 
      3.081802       0.000004       0.010000 
      3.097444       0.000004       0.040000 
      3.111972       0.000004       0.080000 
      3.128547       0.000004       0.040000 
      3.143845       0.000004       0.000000 
      3.159280       0.000004       0.170000 
      3.174014       0.000004       0.150000 
      3.188944       0.000004       0.020000 
      3.205123       0.000004       0.060000 
      3.220370       0.000004       0.020000 
      3.236299       0.000004       0.150000 
      3.251972       0.000004       0.050000 
      3.281449       0.000004       0.010000 
      3.298413       0.000004       0.020000 
      3.313742       0.000004       0.060000 
      3.328986       0.000004       0.010000 
      3.343508       0.000004       0.100000 
      3.358839       0.000004       0.060000 
      3.389577       0.000004       0.040000 
      3.405882       0.000004       0.040000 
      3.420899       0.000004       0.100000 
      3.437488       0.000004       0.010000 
      3.451617       0.000004       0.010000 
      3.467273       0.000004       0.020000 
      3.482410       0.000004       0.020000 
      3.498123       0.000004       0.080000 
      3.514294       0.000004       0.010000 
      3.529584       0.000004       0.020000 
      3.559265       0.000004       0.030000 
      3.576009       0.000004       0.040000 
      3.592050       0.000004       0.010000 
      3.608124       0.000004       0.100000 
      3.623191       0.000004       0.010000 
      3.638687       0.000004       0.110000 
      3.654512       0.000004       0.080000 
      3.669559       0.000004       0.130000 
      3.685552       0.000004       0.100000 
      3.702003       0.000004       0.140000 
      3.717109       0.000004       0.140000 
      3.733393       0.000004       0.230000 
      3.749573       0.000004       0.120000 
      3.765029       0.000004       0.130000 
      3.779490       0.000004       0.010000 
      3.796730       0.000004       0.210000 
      3.811768       0.000004       0.020000 
      3.827086       0.000004       0.120000 
      3.842879       0.000004       0.090000 
      3.862301       0.000004       0.150000 
      3.873620       0.000004       0.030000 
      3.888287       0.000004       0.060000 
      3.904628       0.000004       0.090000 
      3.920811       0.000004       0.150000 
      3.935147       0.000004       0.000000 
      3.951240       0.000004       0.020000 
      3.967306       0.000004       0.010000 
      3.983261       0.000004       0.050000 
      3.996975       0.000004       0.020000 
      4.013073       0.000004       0.060000 
      4.027459       0.000004       0.050000 
      4.044132       0.000004       0.180000 
      4.058327       0.000004       0.100000 
      4.074336       0.000004       0.020000 
      4.104094       0.000004       0.130000 
      4.120950       0.000004       0.020000 
      4.136693       0.000004       0.040000 
      4.151755       0.000004       0.030000 
      4.166179       0.000004       0.060000 
      4.181737       0.000004       0.020000 
      4.197137       0.000004       0.050000 
      4.212218       0.000004       0.070000 
      4.228471       0.000004       0.030000 
      4.258538       0.000004       0.070000 
      4.275954       0.000004       0.040000 
      4.290915       0.000004       0.010000 
      4.306101       0.000004       0.030000 
      4.320346       0.000004       0.000000 
      4.336944       0.000004       0.100000 
      4.352885       0.000004       0.000000 
      4.368209       0.000004       0.030000 
      4.384081       0.000004       0.130000 
      4.399632       0.000004       0.120000 
      4.415196       0.000004       0.060000 
      4.430617       0.000004       0.140000 
      4.446033       0.000004       0.130000 
      4.461278       0.000004       0.100000 
      4.476588       0.000004       0.040000 
      4.492030       0.000004       0.120000 
      4.507996       0.000004       0.010000 
      4.522913       0.000004       0.130000 
      4.538502       0.000004       0.090000 
      4.553750       0.000004       0.150000 
      4.569240       0.000004       0.080000 
      4.584344       0.000004       0.060000 
      4.599888       0.000004       0.010000 
      4.616513       0.000004       0.120000 
      4.632620       0.000004       0.130000 
      4.647236       0.000004       0.010000 
      4.662040       0.000004       0.040000 
      4.677685       0.000004       0.060000 
      4.692189       0.000004       0.070000 
      4.708459       0.000004       0.100000 
      4.722826       0.000004       0.020000 
      4.738284       0.000004       0.060000 
      4.754380       0.000004       0.080000 
      4.769916       0.000004       0.030000 
      4.785181       0.000004       0.060000 
      4.800225       0.000004       0.070000 
      4.816188       0.000004       0.140000 
      4.831211       0.000004       0.090000 
      4.846622       0.000004       0.020000 
      4.862229       0.000004       0.080000 
      4.878317       0.000004       0.060000 
      4.908705       0.000004       0.060000 
      4.925421       0.000004       0.050000 
      4.940677       0.000004       0.040000 
      4.957717       0.000004       0.010000 
      4.971754       0.000004       0.080000 
      4.987351       0.000004       0.020000 
      5.002496       0.000004       0.020000 
      5.018390       0.000004       0.040000 
      5.034048       0.000004       0.070000 
      5.049838       0.000004       0.060000 
      5.066787       0.000004       0.010000 
      5.081714       0.000004       0.080000 
      5.097420       0.000004       0.040000 
      5.112392       0.000004       0.060000 
      5.129310       0.000004       0.020000 
      5.143585       0.000004       0.130000 
      5.159851       0.000004       0.150000 
      5.174147       0.000004       0.030000 
      5.190595       0.000004       0.010000 
      5.204873       0.000004       0.130000 
      5.221817       0.000004       0.120000 
      5.237218       0.000004       0.000000 
      5.252669       0.000004       0.080000 
      5.268388       0.000004       0.040000 
      5.283579       0.000004       0.060000 
      5.299907       0.000004       0.080000 
      5.314430       0.000004       0.040000 
      5.330020       0.000004       0.120000 
      5.344342       0.000004       0.020000 
      5.360491       0.000004       0.080000 
      5.375306       0.000004       0.030000 
      5.391945       0.000004       0.100000 
      5.407176       0.000004       0.040000 
      5.422409       0.000004       0.040000 
      5.438466       0.000004       0.020000 
      5.453951       0.000004       0.040000 
      5.470071       0.000004       0.100000 
      5.484884       0.000004       0.060000 
      5.500565       0.000004       0.030000 
      5.516731       0.000004       0.110000 
      5.532442       0.000004       0.050000 
      5.548383       0.000004       0.020000 
      5.608479       0.000004       0.080000 
      5.623963       0.000004       0.050000 
      5.640839       0.000004       0.060000 
      5.656494       0.000004       0.010000 
      5.672405       0.000004       0.000000 
      5.688739       0.000004       0.100000 
      5.702730       0.000004       0.080000 
      5.718681       0.000004       0.010000 
      5.735320       0.000004       0.090000 
      5.764966       0.000004       0.120000 
      5.782017       0.000004       0.090000 
      5.796594       0.000004       0.110000 
      5.812337       0.000004       0.000000 
      5.828380       0.000004       0.070000 
      5.843797       0.000004       0.060000 
      5.859988       0.000004       0.010000 
      5.875431       0.000004       0.090000 
      5.889639       0.000004       0.040000 
      5.919457       0.000004       0.070000 
      5.936923       0.000004       0.180000 
      5.951304       0.000004       0.110000 
      5.967970       0.000004       0.030000 
      5.983673       0.000004       0.090000 
      5.997664       0.000004       0.020000 
      6.028548       0.000004       0.010000 
      6.044310       0.000004       0.000000 
      6.060555       0.000004       0.000000 
      6.076122       0.000004       0.020000 
      6.090324       0.000004       0.020000 
      6.105705       0.000004       0.070000 
      6.121897       0.000004       0.130000 
      6.138086       0.000004       0.010000 
      6.152268       0.000004       0.010000 
      6.183713       0.000004       0.100000 
      6.199515       0.000004       0.090000 
      6.215307       0.000004       0.030000 
      6.230175       0.000004       0.080000 
      6.244995       0.000004       0.100000 
      6.259459       0.000004       0.040000 
      6.275894       0.000004       0.080000 
      6.290274       0.000004       0.030000 
      6.307026       0.000004       0.020000 
      6.322898       0.000004       0.060000 
      6.339202       0.000004       0.030000 
      6.354816       0.000004       0.010000 
      6.370855       0.000004       0.000000 
      6.386302       0.000004       0.170000 
      6.401704       0.000004       0.130000 
      6.417112       0.000004       0.080000 
      6.432926       0.000004       0.020000 
      6.448948       0.000004       0.060000 
      6.464112       0.000004       0.080000 
      6.479690       0.000004       0.020000 
      6.509395       0.000004       0.030000 
      6.526082       0.000004       0.050000 
      6.541755       0.000004       0.010000 
      6.558497       0.000004       0.070000 
      6.572768       0.000004       0.050000 
      6.588379       0.000004       0.010000 
      6.603685       0.000004       0.020000 
      6.619038       0.000004       0.020000 
      6.634448       0.000004       0.100000 
      6.649672       0.000004       0.040000 
      6.665026       0.000004       0.050000 
      6.680489       0.000004       0.010000 
      6.695865       0.000004       0.090000 
      6.711831       0.000004       0.080000 
      6.727266       0.000004       0.050000 
      6.743028       0.000004       0.060000 
      6.758960       0.000004       0.020000 
      6.773561       0.000004       0.100000 
      6.788963       0.000004       0.050000 
      6.805283       0.000004       0.010000 
      6.819838       0.000004       0.040000 
      6.836026       0.000004       0.010000 
      6.850199       0.000004       0.020000 
      6.867191       0.000004       0.010000 
      6.883294       0.000004       0.030000 
      6.898246       0.000004       0.030000 
      6.913532       0.000004       0.160000 
      6.928781       0.000004       0.620000 
      6.943882       0.000004       0.910000 
      6.960084       0.000004       0.660000 
      6.976325       0.000004       0.370000 
      6.991348       0.000004       0.290000 
      7.006994       0.000004       0.400000 
      7.022410       0.000004       0.450000 
      7.037364       0.000004       0.760000 
      7.053420       0.000004       1.140000 
      7.068673       0.000004       2.070000 
      7.086195       0.000004       2.390000 
      7.100791       0.000004       1.260000 
      7.115214       0.000004       0.590000 
      7.132262       0.000004       3.350000 
      7.148257       0.000004       11.560000 
      7.163654       0.000004       16.450000 
      7.179202       0.000004       23.880000 
      7.193193       0.000004       25.980000 
      7.210140       0.000004       32.360000 
      7.224102       0.000004       37.020000 
      7.240402       0.000004       49.230000 
      7.255371       0.000004       56.280000 
      7.271937       0.000004       64.810000 
      7.287255       0.000018       88.820000 
      7.302338       0.000462       102.960000 
      7.317137       0.005928       116.230000 
      7.331618       0.032395       132.970000 
      7.348389       0.101057       137.180000 
      7.362668       0.267836       143.870000 
      7.378330       0.569495       150.880000 
      7.393485       0.850500       159.890000 
      7.409245       0.974325       177.990000 
      7.424559       0.999037       185.090000 
      7.440031       1.012146       191.560000 
      7.455434       1.066946       203.170000 
      7.470946       1.183947       210.010000 
      7.486367       1.347625       222.060000 
      7.501794       1.583394       226.930000 
      7.516944       1.837573       231.050000 
      7.532180       1.970806       237.570000 
      7.548408       2.012616       240.510000 
      7.564436       2.101476       245.780000 
      7.579504       2.355680       248.860000 
      7.593971       2.702563       251.000000 
      7.610469       2.903407       252.850000 
      7.626803       2.945631       253.050000 
      7.642512       2.951058       256.130000 
      7.658346       2.954697       259.090000 
      7.673428       2.975377       265.870000 
      7.688613       2.995050       268.810000 
      7.704766       3.005511       276.140000 
      7.719622       3.033241       279.870000 
      7.735855       3.110915       283.390000 
      7.750078       3.303659       290.300000 
      7.767150       3.579266       293.750000 
      7.782580       3.721404       303.920000 
      7.798667       3.765386       311.390000 
      7.813744       3.830391       324.110000 
      7.829144       3.825901       327.260000 
      7.844078       3.750213       327.870000 
      7.859704       3.664986       324.560000 
      7.874828       3.617996       321.090000 
      7.890000       3.547512       317.190000 
      7.907109       3.418610       313.210000 
      7.922447       3.423457       313.940000 
      7.938883       3.590674       318.890000 
      7.954134       3.745698       320.920000 
      7.970439       3.888792       322.800000 
      7.985394       3.977925       323.530000 
      8.000454       4.005914       325.230000 
      8.016088       4.054367       330.970000 
      8.031907       4.202787       334.320000 
      8.046947       4.445754       338.560000 
      8.062486       4.676137       338.630000 
      8.078474       4.826763       338.740000 
      8.095344       4.891850       339.360000 
      8.109725       4.912838       339.060000 
      8.123939       4.894593       335.300000 
      8.139645       4.839331       333.560000 
      8.156585       4.746667       333.500000 
      8.172351       4.565078       339.330000 
      8.187227       4.447348       343.220000 
      8.202070       4.486220       350.040000 
      8.218316       4.659748       353.230000 
      8.232789       4.862683       361.390000 
      8.249604       4.951471       368.340000 
      8.265096       4.958256       384.130000 
      8.279835       4.975753       390.990000 
      8.296276       4.994605       395.690000 
      8.310272       4.999561       399.040000 
      8.325433       4.999991       399.310000 
      8.340943       5.000004       395.920000 
      8.356065       5.000004       392.880000 
      8.372848       5.000004       389.010000 
      8.388746       5.000006       379.720000 
      8.403773       5.000140       373.960000 
      8.418546       5.004571       364.840000 
      8.433623       5.058562       363.550000 
      8.450259       5.300533       364.250000 
      8.465204       5.699475       369.300000 
      8.480837       5.941446       372.980000 
      8.495969       5.995437       376.230000 
      8.512250       5.999842       381.370000 
      8.528084       5.999116       384.400000 
      8.543884       5.989206       394.000000 
      8.559307       5.951583       399.350000 
      8.574039       5.919289       403.880000 
      8.589222       5.939469       413.040000 
      8.604676       5.924171       417.490000 
      8.619879       5.841339       424.450000 
      8.635993       5.807704       427.930000 
      8.650207       5.876720       340.320000 
      8.666161       5.958724       251.260000 
      8.682314       5.993249       143.390000 
      8.697362       5.999521       9.160000 
      8.713509       6.000018       12.900000 
      8.727598       6.000945       0.980000 
      8.743073       6.012657       2.070000 
      8.759382       6.072762       9.240000 
      8.774596       6.212616       8.490000 
      8.788753       6.399585       1.740000 
      8.805018       6.582614       4.600000 
      8.820611       6.704815       10.530000 
      8.836435       6.663048       11.840000 
      8.852230       5.962720       1.540000 
      8.870610       3.793123       1.650000 
      8.883522       1.078414       11.320000 
      8.899063       0.189442       10.870000 
      8.914466       1.006408       5.860000 
      8.930621       1.752552       3.760000 
      8.945580       1.969979       8.350000 
      8.961621       1.993700       10.570000 
      8.977017       1.941266       6.450000 
      8.992155       1.694906       4.370000 
      9.008245       1.241853       9.780000 
      9.023324       0.753869       12.260000 
      9.038349       0.250530       5.920000 
      9.053130       -0.236626       4.510000 
      9.069174       -0.764557       5.950000 
      9.084204       -1.240528       10.310000 
      9.099315       -1.602513       7.880000 
      9.116045       -1.860268       3.450000 
      9.130258       -1.975147       5.230000 
      9.147037       -1.998128       9.060000 
      9.162408       -1.999941       6.830000 
      9.177323       -1.999995       3.800000 
      9.192612       -1.999996       5.890000 
      9.209656       -1.999996       8.510000 
      9.224682       -1.999996       6.530000 
      9.241015       -1.999996       4.500000 
      9.256259       -1.999982       6.990000 
      9.270381       -1.999552       9.210000 
      9.287260       -1.994570       8.990000 
      9.302436       -1.974912       5.210000 
      9.316384       -1.949303       5.840000 
      9.332180       -1.927391       10.010000 
      9.348447       -1.914338       9.190000 
      9.364688       -1.944846       6.860000 
      9.380677       -1.953289       6.430000 
      9.395291       -1.899566       8.380000 
      9.410319       -1.841733       8.370000 
      9.427068       -1.836334       6.120000 
      9.443049       -1.869540       5.130000 
      9.458402       -1.883812       7.900000 
      9.473516       -1.856987       8.580000 
      9.489333       -1.849803       5.430000 
      9.506373       -1.916136       4.950000 
      9.521593       -1.958701       7.640000 
      9.537341       -1.953346       8.150000 
      9.552382       -1.951118       6.920000 
      9.569013       -1.949289       5.210000 
      9.582911       -1.950715       6.380000 
      9.598865       -1.949276       8.360000 
      9.614868       -1.950702       6.790000 
      9.628968       -1.948847       5.360000 
      9.644398       -1.945746       7.370000 
      9.659865       -1.930035       8.700000 
      9.674013       -1.929619       6.860000 
      9.691084       -1.940790       6.220000 
      9.705246       -1.930062       7.810000 
      9.720307       -1.935448       8.650000 
      9.736645       -1.970386       8.190000 
      9.752232       -1.994153       6.240000 
      9.768569       -1.999526       6.660000 
      9.782757       -1.999539       8.230000 
      9.798098       -1.994596       7.420000 
      9.814055       -1.975799       6.250000 
      9.828934       -1.960102       6.290000 
      9.845096       -1.975799       7.260000 
      9.860097       -1.994597       7.650000 
      9.876773       -1.999553       6.080000 
      9.891262       -1.999982       5.800000 
      9.907902       -1.999996       7.520000 
      9.923063       -1.999996       7.680000 
      9.937526       -1.999996       6.790000 
      9.954027       -1.999996       6.170000 
      9.969167       -1.999996       6.910000 
      9.984420       -1.999996       7.770000 
      9.999368       -1.999996       7.130000 
      10.014319       -1.999996       6.500000 
      10.029615       -1.999996       7.250000 
      10.046313       -1.999996       7.840000 
      10.062033       -1.999996       7.140000 
      10.077527       -1.999996       6.530000 
      10.093731       -1.999996       7.250000 
      10.109093       -1.999996       7.810000 
      10.123487       -1.999996       7.580000 
      10.138592       -1.999996       6.380000 
      10.154277       -1.999996       6.630000 
      10.169894       -1.999996       7.570000 
      10.184305       -1.999996       7.230000 
      10.200758       -1.999996       6.580000 
      10.216186       -1.999996       6.710000 
      10.232161       -1.999996       7.200000 
      10.248286       -1.999996       7.120000 
      10.264255       -1.999996       6.530000 
      10.279321       -1.999996       6.870000 
      10.294810       -1.999996       7.470000 
      10.309996       -1.999996       7.610000 
      10.324975       -1.999982       6.600000 
      10.339721       -1.999552       6.540000 
      10.355755       -1.994570       7.620000 
      10.372256       -1.974899       7.580000 
      10.388266       -1.948847       7.150000 
      10.403268       -1.921562       6.700000 
      10.418985       -1.885212       7.100000 
      10.435006       -1.887067       7.470000 
      10.450750       -1.925093       6.960000 
      10.465157       -1.969500       6.570000 
      10.481039       -1.993684       7.100000 
      10.496856       -1.994140       7.470000 
      10.512792       -1.975785       6.750000 
      10.528505       -1.960101       6.440000 
      10.544472       -1.975799       6.590000 
      10.559854       -1.994583       7.340000 
      10.575548       -1.999109       7.130000 
      10.590168       -1.994583       6.550000 
      10.606034       -1.975799       6.800000 
      10.621375       -1.960101       7.180000 
      10.637033       -1.975772       7.170000 
      10.652193       -1.993697       6.840000 
      10.668101       -1.988311       7.020000 
      10.683700       -1.946162       7.330000 
      10.699267       -1.895124       7.110000 
      10.715254       -1.900896       6.740000 
      10.729841       -1.916150       6.800000 
      10.744809       -1.908079       7.410000 
      10.760288       -1.921522       7.320000 
      10.776666       -1.924636       6.680000 
      10.791852       -1.929162       6.820000 
      10.806432       -1.940333       7.070000 
      10.823298       -1.924662       7.250000 
      10.838289       -1.911224       6.920000 
      10.854736       -1.929592       6.710000 
      10.869380       -1.958688       6.990000 
      10.886326       -1.939460       7.200000 
      10.901993       -1.884755       6.920000 
      10.917591       -1.863299       6.820000 
      10.932522       -1.885185       7.100000 
      10.947575       -1.944416       7.320000 
      10.964451       -1.977486       6.810000 
      10.980651       -1.945302       6.720000 
      10.996457       -1.895983       7.210000 
      11.011245       -1.911707       7.260000 
      11.026393       -1.965000       7.180000 
      11.040887       -1.993697       6.820000 
      11.057042       -1.999056       7.040000 
      11.072611       -1.993683       7.330000 
      11.088214       -1.964557       7.030000 
      11.103881       -1.906308       6.760000 
      11.118656       -1.871800       6.960000 
      11.133903       -1.905865       7.240000 
      11.147972       -1.959158       7.220000 
      11.163410       -1.969500       6.840000 
      11.179427       -1.959618       6.810000 
      11.194258       -1.975341       7.210000 
      11.209670       -1.989170       7.190000 
      11.226108       -1.974442       6.830000 
      11.240945       -1.948404       6.880000 
      11.256113       -1.916606       7.070000 
      11.272769       -1.866401       7.150000 
      11.287799       -1.870927       6.990000 
      11.303281       -1.935391       6.800000 
      11.318750       -1.964100       7.200000 
      11.334238       -1.958718       7.320000 
      11.348650       -1.969486       6.930000 
      11.364982       -1.959561       6.880000 
      11.380223       -1.909934       7.010000 
      11.395064       -1.879786       7.220000 
      11.410460       -1.873154       7.120000 
      11.426080       -1.863202       6.770000 
      11.442267       -1.895969       6.920000 
      11.458263       -1.907109       7.180000 
      11.472302       -1.864557       7.130000 
      11.488845       -1.792856       6.890000 
      11.503878       -1.774041       6.880000 
      11.520552       -1.826905       7.110000 
      11.534897       -1.819264       7.010000 
      11.550182       -1.800026       6.880000 
      11.566660       -1.845276       6.850000 
      11.582239       -1.872556       7.090000 
      11.597298       -1.826048       7.140000 
      11.613030       -1.774457       6.960000 
      11.629901       -1.798224       6.950000 
      11.645357       -1.824193       7.210000 
      11.661356       -1.847060       7.180000 
      11.676332       -1.850148       6.940000 
      11.691007       -1.778469       6.960000 
      11.706588       -1.717093       7.110000 
      11.737319       -1.706765       6.980000 
      11.753732       -1.725133       6.880000 
      11.769395       -1.751145       7.130000 
      11.783705       -1.778456       7.220000 
      11.799252       -1.815652       6.940000 
      11.816558       -1.823280       6.910000 
      11.830855       -1.817907       7.110000 
      11.846054       -1.786500       7.120000 
      11.862402       -1.719361       7.080000 
      11.878394       -1.707208       6.790000 
      11.895088       -1.728291       6.850000 
      11.910043       -1.767755       7.100000 
      11.924995       -1.856004       6.960000 
      11.939096       -1.888270       6.910000 
      11.954944       -1.882485       6.870000 
      11.969508       -1.885612       7.050000 
      11.985987       -1.843850       7.140000 
      12.001049       -1.790250       6.950000 
      12.016662       -1.764005       6.970000 
      12.032278       -1.723443       7.030000 
      12.048108       -1.672562       7.150000 
      12.063401       -1.697877       7.100000 
      12.077338       -1.701185       6.940000 
      12.092536       -1.652597       7.030000 
      12.110286       -1.599930       7.060000 
      12.125131       -1.631473       6.950000 
      12.141065       -1.672517       7.030000 
      12.156268       -1.638560       7.020000 
      12.172302       -1.559632       7.060000 
      12.185884       -1.506778       6.980000 
      12.201680       -1.483038       6.960000 
      12.218111       -1.496480       7.120000 
      12.232072       -1.581171       7.130000 
      12.246814       -1.681998       7.020000 
      12.263694       -1.722323       7.070000 
      12.278663       -1.674872       7.090000 
      12.295589       -1.620180       7.100000 
      12.310880       -1.627405       7.050000 
      12.327192       -1.643931       6.990000 
      12.341203       -1.651159       7.020000 
      12.357068       -1.660088       6.980000 
      12.372720       -1.700009       6.990000 
      12.388213       -1.740347       6.930000 
      12.403002       -1.754232       6.930000 
      12.418632       -1.780271       7.040000 
      12.433023       -1.812924       7.030000 
      12.448113       -1.809407       7.070000 
      12.464993       -1.754689       6.920000 
      12.479990       -1.717066       7.010000 
      12.494136       -1.729619       7.130000 
      12.509159       -1.753759       7.090000 
      12.525158       -1.721066       6.930000 
      12.540718       -1.673141       7.030000 
      12.555977       -1.687427       7.010000 
      12.586239       -1.676282       6.920000 
      12.602859       -1.674028       7.030000 
      12.618102       -1.743061       7.110000 
      12.633642       -1.791815       7.030000 
      12.649305       -1.818433       6.950000 
      12.664896       -1.803442       7.030000 
      12.680624       -1.737746       7.040000 
      12.696537       -1.704054       7.040000 
      12.712309       -1.756514       6.970000 
      12.727318       -1.759628       6.980000 
      12.742302       -1.725150       6.990000 
      12.756240       -1.762359       7.080000 
      12.772329       -1.832178       7.030000 
      12.787566       -1.853761       7.000000 
      12.802530       -1.795858       7.000000 
      12.818850       -1.715263       7.040000 
      12.833270       -1.602252       7.010000 
      12.848710       -1.513148       6.980000 
      12.865080       -1.542244       7.020000 
      12.880839       -1.630475       7.090000 
      12.896359       -1.674913       7.010000 
      12.911171       -1.713425       7.010000 
      12.926311       -1.785613       7.130000 
      12.942317       -1.812924       7.140000 
      12.957078       -1.803998       6.960000 
      12.972320       -1.793253       6.980000 
      12.988519       -1.754645       7.010000 
      13.004254       -1.668283       7.040000 
      13.018885       -1.635449       7.050000 
      13.034169       -1.718435       7.030000 
      13.049843       -1.780170       7.030000 
      13.066655       -1.784297       7.040000 
      13.081656       -1.730451       7.000000 
      13.097324       -1.695553       6.990000 
      13.113091       -1.721549       6.970000 
      13.128070       -1.738062       7.000000 
      13.143306       -1.726048       7.040000 
      13.159236       -1.708926       7.020000 
      13.174497       -1.721132       6.950000 
      13.189717       -1.720137       7.090000 
      13.205046       -1.716206       7.040000 
      13.220920       -1.754206       6.990000 
      13.236881       -1.803578       6.940000 
      13.252958       -1.783785       7.150000 
      13.268395       -1.722049       7.120000 
      13.283788       -1.720650       7.070000 
      13.299116       -1.786567       7.000000 
      13.314477       -1.818794       6.990000 
      13.330071       -1.834091       7.010000 
      13.345522       -1.864503       6.930000 
      13.360700       -1.864114       6.970000 
      13.376001       -1.830035       6.960000 
      13.391117       -1.811210       7.040000 
      13.406771       -1.823750       6.940000 
      13.421888       -1.828662       7.010000 
      13.438086       -1.770400       6.960000 
      13.454079       -1.701436       7.050000 
      13.468399       -1.713023       7.130000 
      13.484468       -1.775342       7.060000 
      13.499514       -1.835846       7.100000 
      13.515041       -1.845232       6.950000 
      13.529998       -1.771785       6.970000 
      13.546179       -1.766417       6.950000 
      13.562234       -1.879757       6.990000 
      13.578154       -1.929463       6.980000 
      13.593987       -1.838534       7.070000 
      13.609716       -1.701812       6.920000 
      13.624851       -1.648072       6.850000 
      13.640749       -1.671340       7.070000 
      13.656549       -1.694624       7.060000 
      13.671552       -1.704912       7.020000 
      13.686282       -1.723307       6.940000 
      13.701478       -1.729562       6.960000 
      13.718222       -1.682098       7.160000 
      13.733492       -1.661045       7.110000 
      13.748451       -1.745732       6.980000 
      13.764522       -1.817393       6.990000 
      13.779600       -1.792784       6.980000 
      13.794075       -1.734978       6.940000 
      13.809296       -1.701339       7.060000 
      13.825122       -1.681681       6.930000 
      13.840774       -1.684742       6.920000 
      13.855257       -1.720622       6.960000 
      13.871482       -1.736719       6.980000 
      13.887703       -1.710280       7.030000 
      13.903044       -1.641276       7.010000 
      13.918708       -1.619750       6.930000 
      13.934045       -1.656044       7.020000 
      13.949771       -1.637619       7.010000 
      13.965078       -1.586154       7.110000 
      13.981223       -1.560988       6.910000 
      13.997134       -1.576255       6.930000 
      14.012812       -1.599566       6.960000 
      14.028778       -1.618767       7.050000 
      14.044611       -1.620192       7.070000 
      14.060446       -1.597711       7.020000 
      14.075846       -1.573168       6.940000 
      14.090991       -1.545747       6.960000 
      14.106836       -1.592023       6.900000 
      14.122857       -1.683772       7.010000 
      14.137935       -1.733148       7.030000 
      14.153354       -1.723266       7.050000 
      14.168834       -1.699995       7.030000 
      14.183138       -1.676644       6.980000 
      14.199125       -1.664157       7.010000 
      14.214943       -1.682885       6.980000 
      14.229666       -1.650175       6.930000 
      14.246238       -1.543518       6.970000 
      14.260516       -1.487484       7.020000 
      14.277033       -1.471327       7.090000 
      14.293315       -1.454770       6.990000 
      14.308415       -1.457901       7.040000 
      14.324960       -1.490597       7.070000 
      14.340209       -1.574872       7.110000 
      14.354565       -1.651946       6.970000 
      14.370755       -1.652832       7.110000 
      14.387075       -1.586543       7.100000 
      14.402033       -1.549333       7.040000 
      14.417658       -1.580281       7.070000 
      14.433920       -1.554645       6.980000 
      14.448101       -1.481268       7.050000 
      14.463210       -1.490557       7.090000 
      14.478728       -1.550215       7.110000 
      14.495802       -1.537175       7.090000 
      14.511557       -1.486570       7.000000 
      14.526215       -1.465944       6.920000 
      14.540380       -1.495066       7.090000 
      14.557201       -1.515693       7.070000 
      14.572103       -1.508066       7.000000 
      14.588784       -1.521522       6.940000 
      14.604100       -1.524622       7.020000 
      14.619646       -1.528706       7.080000 
      14.635848       -1.534477       6.990000 
      14.649626       -1.494596       6.950000 
      14.666447       -1.440834       7.000000 
      14.681467       -1.430062       7.000000 
      14.698601       -1.435391       7.020000 
      14.714326       -1.404992       7.140000 
      14.729724       -1.385212       7.040000 
      14.744975       -1.403637       6.950000 
      14.761030       -1.438548       7.140000 
      14.791968       -1.514337       7.120000 
      14.808380       -1.547420       7.060000 
      14.823142       -1.499122       7.000000 
      14.837831       -1.442163       7.000000 
      14.853216       -1.441760       6.980000 
      14.869955       -1.494597       6.950000 
      14.884991       -1.533604       7.070000 
      14.900607       -1.518324       6.960000 
      14.916918       -1.480741       7.040000 
      14.932021       -1.455159       7.050000 
      14.947411       -1.452031       7.010000 
      14.962903       -1.459175       7.050000 
      14.978262       -1.487398       7.010000 
      14.993802       -1.468999       7.050000 
      15.009170       -1.360531       7.080000 
      15.023560       -1.287541       6.980000 
      15.039889       -1.319734       6.990000 
      15.055117       -1.345743       6.980000 
      15.072042       -1.295541       6.990000 
      15.087069       -1.305909       7.070000 
      15.102293       -1.400382       7.050000 
      15.118344       -1.434048       7.030000 
      15.133947       -1.417951       7.010000 
      15.149689       -1.440749       7.050000 
      15.165009       -1.440319       7.120000 
      15.181062       -1.412579       7.020000 
      15.194989       -1.410710       7.000000 
      15.210166       -1.370400       6.970000 
      15.226264       -1.319361       6.880000 
      15.242398       -1.323309       6.950000 
      15.257172       -1.335488       7.060000 
      15.272968       -1.378430       7.060000 
      15.288532       -1.430463       6.990000 
      15.305408       -1.415595       6.960000 
      15.321551       -1.371771       7.000000 
      15.337512       -1.309368       7.020000 
      15.353499       -1.280781       7.070000 
      15.369318       -1.265457       6.950000 
      15.384680       -1.230532       6.970000 
      15.399558       -1.217066       7.030000 
      15.414980       -1.253789       7.050000 
      15.429862       -1.298152       7.110000 
      15.446037       -1.258675       7.090000 
      15.460840       -1.170457       7.040000 
      15.476878       -1.136804       6.930000 
      15.492450       -1.147129       6.990000 
      15.508020       -1.160102       6.990000 
      15.523638       -1.204496       7.030000 
      15.537951       -1.253303       7.050000 
      15.553939       -1.240373       7.140000 
      15.569031       -1.201839       7.160000 
      15.584357       -1.247146       7.060000 
      15.600793       -1.359144       7.020000 
      15.615847       -1.427709       6.990000 
      15.632045       -1.421950       7.020000 
      15.647147       -1.389600       6.950000 
      15.662203       -1.332803       7.050000 
      15.693155       -1.299098       6.990000 
      15.708983       -1.342215       7.050000 
      15.725370       -1.357276       7.030000 
      15.740335       -1.330588       7.080000 
      15.755383       -1.304413       6.970000 
      15.770564       -1.302764       6.960000 
      15.786773       -1.308953       7.010000 
      15.802253       -1.345303       6.980000 
      15.818227       -1.364557       7.030000 
      15.834233       -1.354662       7.030000 
      15.849669       -1.361030       7.100000 
      15.865845       -1.386415       7.010000 
      15.881533       -1.375811       6.980000 
      15.896404       -1.282444       7.040000 
      15.911933       -1.219418       7.050000 
      15.927174       -1.210739       7.080000 
      15.942999       -1.250756       7.090000 
      15.958435       -1.289185       6.970000 
      15.973999       -1.299553       6.990000 
      15.989508       -1.305395       7.040000 
      16.005245       -1.325079       6.980000 
      16.020487       -1.350675       6.970000 
      16.036444       -1.372144       6.990000 
      16.051527       -1.379797       7.000000 
      16.067441       -1.325039       7.010000 
      16.083645       -1.275023       7.020000 
      16.098836       -1.286001       6.990000 
      16.114208       -1.277694       7.000000 
      16.129661       -1.271689       7.060000 
      16.144721       -1.333232       7.080000 
      16.160707       -1.335723       7.070000 
      16.176238       -1.305920       6.980000 
      16.190377       -1.274347       7.060000 
      16.206380       -1.251211       7.040000 
      16.222050       -1.231378       7.110000 
      16.236511       -1.240833       7.030000 
      16.253052       -1.293240       6.910000 
      16.268307       -1.317380       6.990000 
      16.283470       -1.244819       7.010000 
      16.300223       -1.149360       7.010000 
      16.315119       -1.122905       7.060000 
      16.330456       -1.101393       7.090000 
      16.347207       -1.095594       7.050000 
      16.363198       -1.151992       7.030000 
      16.378858       -1.217491       7.010000 
      16.394303       -1.253289       7.030000 
      16.409010       -1.226920       7.080000 
      16.425177       -1.204013       7.090000 
      16.440788       -1.265929       7.130000 
      16.456780       -1.290912       6.960000 
      16.472261       -1.220662       6.990000 
      16.502615       -1.131878       7.100000 
      16.518272       -1.142203       7.070000 
      16.534673       -1.210307       7.030000 
      16.550460       -1.236719       7.070000 
      16.566816       -1.220622       7.090000 
      16.581761       -1.184715       6.970000 
      16.597158       -1.180781       6.940000 
      16.612149       -1.190097       6.970000 
      16.627945       -1.181184       6.990000 
      16.643615       -1.188798       7.000000 
      16.658944       -1.229092       6.990000 
      16.673857       -1.210294       6.970000 
      16.688164       -1.149347       7.080000 
      16.704782       -1.156987       7.050000 
      16.719668       -1.184255       7.110000 
      16.735254       -1.174899       7.050000 
      16.751807       -1.159175       7.060000 
      16.767286       -1.164557       7.010000 
      16.782296       -1.140803       6.910000 
      16.796946       -1.095567       6.920000 
      16.813506       -1.111667       6.930000 
      16.828550       -1.164127       7.090000 
      16.843081       -1.183342       6.990000 
      16.858659       -1.156074       7.060000 
      16.875383       -1.138535       7.000000 
      16.890623       -1.161430       7.090000 
      16.906145       -1.143045       6.940000 
      16.921205       -1.106321       6.990000 
      16.937362       -1.093742       7.070000 
      16.952658       -1.143061       6.970000 
      16.967604       -1.238074       7.030000 
      16.982200       -1.218710       7.040000 
      16.997360       -1.116236       7.040000 
      17.012951       -1.120153       6.990000 
      17.028778       -1.185166       6.920000 
      17.044376       -1.137176       7.000000 
      17.059837       -1.051632       7.100000 
      17.075183       -1.036777       7.000000 
      17.090903       -1.065054       6.980000 
      17.106541       -1.070414       6.940000 
      17.121675       -1.065528       7.050000 
      17.137171       -1.106724       7.090000 
      17.152776       -1.175342       7.110000 
      17.167886       -1.242077       7.060000 
      17.182890       -1.278857       7.040000 
      17.198835       -1.242520       7.020000 
      17.214496       -1.180727       7.050000 
      17.228934       -1.130479       7.030000 
      17.244931       -1.100063       7.100000 
      17.261160       -1.071757       7.100000 
      17.277252       -1.047199       7.020000 
      17.292486       -1.091014       6.970000 
      17.307780       -1.190126       7.000000 
      17.322623       -1.249191       7.030000 
      17.338116       -1.224635       7.010000 
      17.355218       -1.115238       6.990000 
      17.369678       -1.058871       7.060000 
      17.384976       -1.107208       7.020000 
      17.402035       -1.188781       7.030000 
      17.432678       -1.238977       7.020000 
      17.448232       -1.247893       7.100000 
      17.463405       -1.244389       7.020000 
      17.479822       -1.213838       6.940000 
      17.494319       -1.157014       7.020000 
      17.509368       -1.120624       7.010000 
      17.525271       -1.150715       7.100000 
      17.540783       -1.177929       7.080000 
      17.556587       -1.144416       7.030000 
      17.571260       -1.084729       7.060000 
      17.586363       -1.057470       7.050000 
      17.601376       -1.055589       6.940000 
      17.617035       -1.080325       7.030000 
      17.631638       -1.113381       7.180000 
      17.647264       -1.115249       7.150000 
      17.663321       -1.084272       7.120000 
      17.678246       -1.080741       7.060000 
      17.692902       -1.089198       7.090000 
      17.709125       -1.069970       6.980000 
      17.738570       -1.035891       6.990000 
      17.755179       -1.035918       7.050000 
      17.770393       -1.070843       7.090000 
      17.785662       -1.099539       7.070000 
      17.801006       -1.123306       6.990000 
      17.816468       -1.134921       6.980000 
      17.830866       -1.105395       7.050000 
      17.847305       -1.089684       6.970000 
      17.877413       -1.115680       7.050000 
      17.893375       -1.112978       7.080000 
      17.908553       -1.075785       7.090000 
      17.923964       -1.041277       7.070000 
      17.939667       -1.054259       7.100000 
      17.954282       -1.080268       7.010000 
      17.970667       -1.049290       7.020000 
      17.986615       -1.021606       7.020000 
      18.002037       -1.049746       7.020000 
      18.016968       -1.086096       6.980000 
      18.032845       -1.083386       7.050000 
      18.048214       -1.099122       7.070000 
      18.063831       -1.106198       6.990000 
      18.080685       -1.070053       7.080000 
      18.095802       -1.085172       6.950000 
      18.111167       -1.137245       6.970000 
      18.126928       -1.151491       7.060000 
      18.142107       -1.170885       7.070000 
      18.157122       -1.162675       6.980000 
      18.172227       -1.126504       7.050000 
      18.188269       -1.090128       7.070000 
      18.205376       -1.100022       7.000000 
      18.220262       -1.110724       7.080000 
      18.234353       -1.083425       7.040000 
      18.249718       -1.075772       7.000000 
      18.296591       -1.070399       7.020000 
      18.312999       -1.054259       7.030000 
      18.328717       -1.051145       7.060000 
      18.342906       -1.049303       7.000000 
      18.358816       -1.051158       7.060000 
      18.389079       -1.054675       7.040000 
      18.405034       -1.074899       7.060000 
      18.420452       -1.088741       7.070000 
      18.436009       -1.069970       7.040000 
      18.450906       -1.036334       7.060000 
      18.467486       -1.041290       7.090000 
      18.481883       -1.094140       7.060000 
      18.498013       -1.128192       6.980000 
      18.513233       -1.093683       7.050000 
      18.530299       -1.035434       7.060000 
      18.543631       -1.006295       7.040000 
      18.558674       -1.000466       7.120000 
      18.575216       -1.000009       7.130000 
      18.590806       -0.999996       7.030000 
      18.606950       -0.999996       6.920000 
      18.621938       -0.999996       7.160000 
      18.638190       -0.999996       7.050000 
      18.654523       -1.000009       6.980000 
      18.668827       -1.000466       7.020000 
      18.685707       -1.006281       7.040000 
      18.701346       -1.035004       7.060000 
      18.732007       -1.088727       6.930000 
      18.748766       -1.109394       6.950000 
      18.764338       -1.078429       7.050000 
      18.779667       -1.056544       7.010000 
      18.794927       -1.049760       7.090000 
      18.810041       -1.051601       7.050000 
      18.826201       -1.059632       7.010000 
      18.839961       -1.093710       6.930000 
      18.856237       -1.104868       7.010000 
      18.871653       -1.059202       7.040000 
      18.888783       -1.035461       7.040000 
      18.902658       -1.041676       7.010000 
      18.918871       -1.035018       7.040000 
      18.934816       -1.053790       7.050000 
      18.965073       -1.080254       7.000000 
      18.981161       -1.049290       7.090000 
      18.997008       -1.021606       7.140000 
      19.012289       -1.049733       7.010000 
      19.027083       -1.085667       7.000000 
      19.042747       -1.078430       7.010000 
      19.058556       -1.080298       6.980000 
      19.074322       -1.089614       7.000000 
      19.089646       -1.074912       6.940000 
      19.105026       -1.054232       6.960000 
      19.122115       -1.045746       7.010000 
      19.138014       -1.024650       7.050000 
      19.168026       -1.005422       7.020000 
      19.184988       -1.000882       6.980000 
      19.200105       -1.005408       6.920000 
      19.216069       -1.024193       6.970000 
      19.229715       -1.039890       7.010000 
      19.244925       -1.024193       7.010000 
      19.260075       -1.005395       7.020000 
      19.275977       -1.000452       7.000000 
      19.291039       -1.000466       6.980000 
      19.307488       -1.005838       7.070000 
      19.322858       -1.029592       7.020000 
      19.338017       -1.064100       7.040000 
      19.354065       -1.064530       7.090000 
      19.369395       -1.034991       7.030000 
      19.384829       -1.030048       6.950000 
      19.400514       -1.040790       7.060000 
      19.416465       -1.029619       7.080000 
      19.431833       -1.030049       6.990000 
      19.446908       -1.046189       6.930000 
      19.463780       -1.054246       7.000000 
      19.479522       -1.074885       6.990000 
      19.493551       -1.088727       7.020000 
      19.508949       -1.069500       7.080000 
      19.525780       -1.030035       7.050000 
      19.540763       -1.005851       7.080000 
      19.572688       -1.000453       7.050000 
      19.589704       -1.000023       7.060000 
      19.604532       -1.000439       7.080000 
      19.620812       -1.005395       7.020000 
      19.635774       -1.024206       7.070000 
      19.649772       -1.040333       7.080000 
      19.666695       -1.029592       7.100000 
      19.696707       -1.029592       7.050000 
      19.712683       -1.040333       7.070000 
      19.729146       -1.024220       7.010000 
      19.744106       -1.005838       6.960000 
      19.761029       -1.005838       7.020000 
      19.775989       -1.024206       6.950000 
      19.790954       -1.039903       6.990000 
      19.805941       -1.024636       6.980000 
      19.821872       -1.010794       7.010000 
      19.838853       -1.024636       7.040000 
      19.854335       -1.039903       6.980000 
      19.870090       -1.024193       7.010000 
      19.885884       -1.005408       6.950000 
      19.900111       -1.000882       7.060000 
      19.915913       -1.005408       7.020000 
      19.931123       -1.024193       7.090000 
      19.948227       -1.039890       7.040000 
      19.964510       -1.024206       6.960000 
      19.979638       -1.005838       7.030000 
      19.994949       -1.005838       7.040000 
      20.010882       -1.024206       7.080000 
      20.025669       -1.039903       7.020000 
      20.040751       -1.024636       6.980000 
      20.056404       -1.010794       7.010000 
      20.072400       -1.024636       6.990000 
      20.087278       -1.039917       7.130000 
      20.102317       -1.024636       7.030000 
      20.116563       -1.010794       7.030000 
      20.132081       -1.024636       7.030000 
      20.148352       -1.039903       6.990000 
      20.162835       -1.024193       7.060000 
      20.179295       -1.005395       7.020000 
      20.194611       -1.000452       6.980000 
      20.209493       -1.000452       6.990000 
      20.225325       -1.005395       6.980000 
      20.239194       -1.024193       7.040000 
      20.254267       -1.039903       7.000000 
      20.270006       -1.024636       6.950000 
      20.285180       -1.010807       7.030000 
      20.302246       -1.025079       6.970000 
      20.318293       -1.045302       6.960000 
      20.334254       -1.048390       6.920000 
      20.348461       -1.045302       6.950000 
      20.363630       -1.025079       6.930000 
      20.380504       -1.010807       7.060000 
      20.396818       -1.024636       7.100000 
      20.412213       -1.039917       7.060000 
      20.426744       -1.024650       6.950000 
      20.442995       -1.011250       7.000000 
      20.458724       -1.030478       7.030000 
      20.473660       -1.069500       7.060000 
      20.490566       -1.088284       7.080000 
      20.505395       -1.069486       7.000000 
      20.522402       -1.030048       7.040000 
      20.538321       -1.006295       7.100000 
      20.553158       -1.005852       7.090000 
      20.568968       -1.024206       7.020000 
      20.584320       -1.039890       7.060000 
      20.599459       -1.024193       7.080000 
      20.614953       -1.005408       7.030000 
      20.631526       -1.000882       6.960000 
      20.646776       -1.005408       6.940000 
      20.662349       -1.024193       7.080000 
      20.678353       -1.039903       7.040000 
      20.693983       -1.024649       6.960000 
      20.709905       -1.011237       7.030000 
      20.724757       -1.030048       6.990000 
      20.739640       -1.064544       7.040000 
      20.754300       -1.069486       7.040000 
      20.770837       -1.053802       7.070000 
      20.786409       -1.046176       6.950000 
      20.801626       -1.030062       7.000000 
      20.816684       -1.030049       7.040000 
      20.832899       -1.045733       7.060000 
      20.849044       -1.048417       6.990000 
      20.864972       -1.045732       6.970000 
      20.879498       -1.030035       7.030000 
      20.896472       -1.029605       7.000000 
      20.911359       -1.040347       6.970000 
      20.942759       -1.024649       7.000000 
      20.959481       -1.010794       6.950000 
      20.975202       -1.024636       6.970000 
      20.990854       -1.039903       7.080000 
      21.006330       -1.024193       7.040000 
