Human trial picking the raspberry twin 

 time    ||     output     ||     loadcell

      0.000000       -809.995161       0.080000 
      0.045309       -809.995161       0.070000 
      0.076545       -809.995161       0.070000 
      0.107404       -809.995161       0.360000 
      0.139211       -809.995161       0.100000 
      0.169122       -809.995161       0.140000 
      0.200708       -809.995161       0.030000 
      0.231262       -809.995161       0.160000 
      0.262753       -809.995161       0.160000 
      0.294299       -809.995156       0.170000 
      0.325901       -809.993952       0.100000 
      0.357365       -809.885550       0.250000 
      0.388846       -806.295752       0.050000 
      0.419779       -762.563070       0.100000 
      0.450732       -566.566783       0.230000 
      0.481874       -243.423536       0.000000 
      0.513307       -47.427249       0.300000 
      0.543819       -3.694566       0.010000 
      0.574609       -0.104769       0.090000 
      0.621351       0.003634       0.150000 
      0.652688       0.004838       0.180000 
      0.683529       0.004843       0.060000 
      0.715417       0.004843       0.030000 
      0.746323       0.004843       0.090000 
      0.778294       0.004843       0.210000 
      0.809703       0.004843       0.030000 
      0.840917       0.004843       0.000000 
      0.873267       0.004843       0.130000 
      0.903989       0.004843       0.000000 
      0.935678       0.004830       0.110000 
      0.965588       0.004386       0.100000 
      0.996684       -0.000999       0.180000 
      1.027674       -0.024753       0.040000 
      1.058396       -0.059248       0.040000 
      1.089794       -0.059248       0.060000 
      1.120245       -0.024753       0.060000 
      1.151634       -0.001013       0.060000 
      1.182538       0.003943       0.220000 
      1.213486       -0.000570       0.010000 
      1.243998       -0.019354       0.070000 
      1.275436       -0.035051       0.060000 
      1.307419       -0.019354       0.190000 
      1.338573       -0.000569       0.050000 
      1.369702       0.003957       0.270000 
      1.400605       -0.000569       0.130000 
      1.431808       -0.019354       0.270000 
      1.463372       -0.035051       0.090000 
      1.494526       -0.019367       0.180000 
      1.525893       -0.000999       0.100000 
      1.556207       -0.000999       0.180000 
      1.586060       -0.019381       0.120000 
      1.617415       -0.035495       0.010000 
      1.648057       -0.024767       0.140000 
      1.694870       -0.025210       0.290000 
      1.726493       -0.041337       0.100000 
      1.757749       -0.048964       0.050000 
      1.789488       -0.064648       0.170000 
      1.821402       -0.059691       0.090000 
      1.883240       -0.024767       0.030000 
      1.915152       -0.000999       0.150000 
      1.946100       0.004386       0.100000 
      1.977021       0.004830       0.070000 
      2.007999       0.004843       0.230000 
      2.039629       0.004843       0.190000 
      2.070866       0.004830       0.240000 
      2.102286       0.004400       0.030000 
      2.134176       -0.000556       0.140000 
      2.165093       -0.019354       0.020000 
      2.197006       -0.035051       0.010000 
      2.227925       -0.019354       0.030000 
      2.258842       -0.000556       0.100000 
      2.290418       0.004400       0.030000 
      2.320815       0.004830       0.020000 
      2.352219       0.004830       0.010000 
      2.383776       0.004400       0.030000 
      2.415262       -0.000556       0.150000 
      2.446989       -0.019354       0.160000 
      2.478247       -0.035051       0.010000 
      2.509343       -0.019381       0.070000 
      2.540335       -0.001456       0.080000 
      2.570253       -0.006842       0.060000 
      2.601171       -0.048964       0.080000 
      2.631091       -0.099169       0.110000 
      2.663005       -0.084332       0.250000 
      2.693926       -0.040950       0.170000 
      2.724741       -0.049837       0.160000 
      2.755079       -0.075415       0.030000 
      2.787186       -0.043565       0.000000 
      2.817934       -0.005955       0.180000 
      2.849210       0.003957       0.200000 
      2.880126       0.004816       0.010000 
      2.911233       0.004829       0.110000 
      2.942198       0.004400       0.080000 
      2.972632       -0.000583       0.110000 
      3.004055       -0.020241       0.090000 
      3.034627       -0.045863       0.040000 
      3.066543       -0.068192       0.170000 
      3.097463       -0.085757       0.050000 
      3.129378       -0.068635       0.030000 
      3.160294       -0.051262       0.090000 
      3.191211       -0.044438       0.290000 
      3.222170       -0.040491       0.040000 
      3.253358       -0.020268       0.110000 
      3.284342       -0.006868       0.050000 
      3.315633       -0.031039       0.160000 
      3.347047       -0.088871       0.040000 
      3.378402       -0.123783       0.100000 
      3.410315       -0.094244       0.140000 
      3.441232       -0.054792       0.050000 
      3.472150       -0.041350       0.010000 
      3.504065       -0.019838       0.070000 
      3.535008       -0.001013       0.010000 
      3.565820       -0.001013       0.340000 
      3.597898       -0.019811       0.170000 
      3.628439       -0.040451       0.230000 
      3.659257       -0.043565       0.170000 
      3.690099       -0.040920       0.020000 
      3.721095       -0.026083       0.020000 
      3.752807       -0.035565       0.210000 
      3.784446       -0.083889       0.090000 
      3.816360       -0.099169       0.050000 
      3.847278       -0.049394       0.110000 
      3.879192       -0.011797       0.100000 
      3.910110       -0.020254       0.260000 
      3.942167       -0.035091       0.040000 
      3.974153       -0.019798       0.110000 
      4.004280       -0.005955       0.160000 
      4.034203       -0.019824       0.010000 
      4.066433       -0.035978       0.010000 
      4.096495       -0.031053       0.210000 
      4.127063       -0.060232       0.050000 
      4.158364       -0.130512       0.040000 
      4.189496       -0.163761       0.090000 
      4.219650       -0.167278       0.180000 
      4.250961       -0.156121       0.060000 
      4.282179       -0.098284       0.120000 
      4.313097       -0.052619       0.150000 
      4.344013       -0.031952       0.080000 
      4.375928       -0.054833       0.130000 
      4.406846       -0.105026       0.080000 
      4.437670       -0.108999       0.020000 
      4.469267       -0.086714       0.100000 
      4.500829       -0.104530       0.250000 
      4.531505       -0.156147       0.140000 
      4.563575       -0.161906       0.070000 
      4.594097       -0.139994       0.090000 
      4.625323       -0.095600       0.020000 
      4.656873       -0.055732       0.210000 
      4.702501       -0.052592       0.130000 
      4.733344       -0.073644       0.040000 
      4.764832       -0.105442       0.160000 
      4.796100       -0.094727       0.050000 
      4.827550       -0.079916       0.100000 
      4.857875       -0.098315       0.080000 
      4.888793       -0.127411       0.230000 
      4.919710       -0.174073       0.050000 
      4.951625       -0.149336       0.260000 
      4.982542       -0.071460       0.170000 
      5.013487       -0.066491       0.070000 
      5.044632       -0.124723       0.400000 
      5.075490       -0.129249       0.080000 
      5.106394       -0.085303       0.310000 
      5.136026       -0.088057       0.210000 
      5.167048       -0.144894       0.150000 
      5.199076       -0.209538       0.160000 
      5.230241       -0.232713       0.060000 
      5.260841       -0.220752       0.220000 
      5.292295       -0.198674       0.060000 
      5.324030       -0.191599       0.060000 
      5.354504       -0.168205       0.060000 
      5.385793       -0.140477       0.330000 
      5.417173       -0.096031       0.000000 
      5.448759       -0.060272       0.460000 
      5.479116       -0.066904       0.030000 
      5.509867       -0.076829       0.210000 
      5.541720       -0.109056       0.210000 
      5.572637       -0.180358       0.220000 
      5.604551       -0.203156       0.010000 
      5.635469       -0.181275       0.040000 
      5.666387       -0.184389       0.010000 
      5.697617       -0.224293       0.060000 
      5.729158       -0.206355       0.180000 
      5.760190       -0.155763       0.030000 
      5.791446       -0.206385       0.040000 
      5.822909       -0.288814       0.000000 
      5.853750       -0.283042       0.350000 
      5.885008       -0.236411       0.030000 
      5.915872       -0.236451       0.370000 
      5.947165       -0.284372       0.080000 
      5.978260       -0.305012       0.060000 
      6.009207       -0.278990       0.610000 
      6.040611       -0.275902       2.720000 
      6.071156       -0.284801       1.720000 
      6.101514       -0.270490       1.370000 
      6.134210       -0.253920       7.850000 
      6.164590       -0.254776       14.030000 
      6.196261       -0.217597       24.090000 
      6.227116       -0.180014       35.340000 
      6.257465       -0.242251       45.680000 
      6.288631       -0.305938       54.940000 
      6.320454       -0.333240       66.460000 
      6.351241       -0.396072       78.930000 
      6.383156       -0.446111       100.580000 
      6.414070       -0.430150       125.600000 
      6.445986       -0.352440       138.400000 
      6.476903       -0.296555       157.140000 
      6.507825       -0.233639       173.540000 
      6.538915       -0.145903       193.780000 
      6.570720       -0.056150       205.000000 
      6.601361       -0.006895       221.310000 
      6.632247       0.003929       248.020000 
      6.663290       0.004816       268.600000 
      6.695207       0.004844       297.450000 
      6.725311       0.004938       310.530000 
      6.756773       0.008067       321.020000 
      6.788522       0.046721       339.640000 
      6.820472       0.226052       350.200000 
      6.850387       0.544237       355.530000 
      6.882304       0.761208       371.440000 
      6.913753       0.840199       385.150000 
      6.943673       0.925388       398.750000 
      6.975592       0.988176       411.070000 
      7.007503       1.004065       136.920000 
      7.037428       1.014326       7.850000 
      7.069342       1.082199       2.680000 
      7.100259       1.321097       6.240000 
      7.131174       1.689639       6.730000 
      7.162094       1.942853       4.940000 
      7.192987       2.102300       5.830000 
      7.224894       2.385604       6.610000 
      7.255919       2.767616       4.690000 
      7.285702       3.058638       6.340000 
      7.316348       3.357409       7.300000 
      7.347919       3.716462       4.180000 
      7.378587       3.964175       7.610000 
      7.410666       3.949496       4.850000 
      7.442576       2.958634       7.520000 
      7.473899       1.042100       5.360000 
      7.504617       -0.008788       8.000000 
      7.535217       -0.299044       4.360000 
      7.566493       -0.799443       7.550000 
      7.598455       -1.480730       4.860000 
      7.628963       -1.881795       6.980000 
      7.659339       -1.990536       4.460000 
      7.689667       -2.048013       7.030000 
      7.721226       -2.186173       5.060000 
      7.753113       -2.379431       6.670000 
      7.784215       -2.513828       6.240000 
      7.816053       -2.543468       6.880000 
      7.847700       -2.478036       6.590000 
      7.878693       -2.424310       6.950000 
      7.910756       -2.376759       6.940000 
      7.942046       -2.285813       5.990000 
      7.972800       -2.248204       7.850000 
      8.004223       -2.297400       6.350000 
      8.035955       -2.370087       8.010000 
      8.065917       -2.437213       5.870000 
      8.096306       -2.473629       7.690000 
      8.127280       -2.434055       5.550000 
      8.159280       -2.373288       7.050000 
      8.190339       -2.382574       5.660000 
      8.221351       -2.431906       6.500000 
      8.252077       -2.373578       5.850000 
      8.282733       -2.323951       6.140000 
      8.314494       -2.342153       5.570000 
      8.344419       -2.295237       6.120000 
      8.376329       -2.250821       5.630000 
      8.408274       -2.298812       5.860000 
      8.438322       -2.363732       6.570000 
      8.469674       -2.420780       5.960000 
      8.500820       -2.468608       6.920000 
      8.531797       -2.515339       6.370000 
      8.562714       -2.537668       7.180000 
      8.594629       -2.534151       6.350000 
      8.624524       -2.489771       7.050000 
      8.655472       -2.431939       5.890000 
      8.686358       -2.417237       7.110000 
      8.718049       -2.463705       5.950000 
      8.748960       -2.501427       7.050000 
      8.779511       -2.475335       6.160000 
      8.810037       -2.455248       6.960000 
      8.840794       -2.379846       5.880000 
      8.872640       -2.271970       6.550000 
      8.903513       -2.243650       6.520000 
      8.933829       -2.296070       6.210000 
      8.964501       -2.358375       6.430000 
      8.995282       -2.377563       5.920000 
      9.027292       -2.339524       6.320000 
      9.059214       -2.273645       6.160000 
      9.089510       -2.218549       6.320000 
      9.120191       -2.174133       5.760000 
      9.150368       -2.230223       6.710000 
      9.182105       -2.376687       5.870000 
      9.213670       -2.393673       6.810000 
      9.244701       -2.265191       5.870000 
      9.274778       -2.250780       6.560000 
      9.305506       -2.327380       5.960000 
      9.336112       -2.291126       6.620000 
      9.367586       -2.235525       6.140000 
      9.398056       -2.217583       6.370000 
      9.429165       -2.198768       6.120000 
      9.460151       -2.197886       6.230000 
      9.491497       -2.203684       6.110000 
      9.522910       -2.235508       5.900000 
      9.553614       -2.240894       6.440000 
      9.583984       -2.233267       6.130000 
      9.615639       -2.262003       6.690000 
      9.646722       -2.263678       6.270000 
      9.677118       -2.255761       6.530000 
      9.708336       -2.262779       6.240000 
      9.739416       -2.250775       6.310000 
      9.771163       -2.179917       5.970000 
      9.802335       -2.142334       6.340000 
      9.833377       -2.172263       6.140000 
      9.864883       -2.218051       6.570000 
      9.895788       -2.247980       6.180000 
      9.926503       -2.210370       6.310000 
      9.958425       -2.138666       6.120000 
      9.988835       -2.117180       6.390000 
      10.019434       -2.091544       5.910000 
      10.051352       -2.070628       6.210000 
      10.083378       -2.115298       5.920000 
      10.114306       -2.157048       6.010000 
      10.145967       -2.162447       6.140000 
      10.178141       -2.211284       6.290000 
      10.208417       -2.235924       6.420000 
      10.239267       -2.237792       6.080000 
      10.271052       -2.281191       6.360000 
      10.301290       -2.283432       6.110000 
      10.333466       -2.247621       6.350000 
      10.364385       -2.205885       6.000000 
      10.396152       -2.126137       6.260000 
      10.426598       -2.072401       5.950000 
      10.458355       -2.102370       6.330000 
      10.488804       -2.165601       6.250000 
      10.520032       -2.219381       6.360000 
      10.550812       -2.270906       6.270000 
      10.581440       -2.323813       6.560000 
      10.612076       -2.376716       6.280000 
      10.642501       -2.364576       6.410000 
      10.672728       -2.266020       6.320000 
      10.703568       -2.225240       6.410000 
      10.733906       -2.264604       6.590000 
      10.764671       -2.218451       6.110000 
      10.795268       -2.096128       6.320000 
      10.827421       -2.049063       6.140000 
      10.858823       -2.096983       6.440000 
      10.889323       -2.164661       6.220000 
      10.919315       -2.212156       6.580000 
      10.949626       -2.223796       6.020000 
      10.980928       -2.171390       6.420000 
      11.027079       -2.126180       6.060000 
      11.058845       -2.171833       6.480000 
      11.090305       -2.229196       6.300000 
      11.121255       -2.236393       6.300000 
      11.151500       -2.205858       6.380000 
      11.198704       -2.136438       6.160000 
      11.229703       -2.114496       6.240000 
      11.261345       -2.146706       6.380000 
      11.291265       -2.119838       6.490000 
      11.322206       -2.095671       6.260000 
      11.353065       -2.141780       6.030000 
      11.384108       -2.183915       6.570000 
      11.414912       -2.193787       6.050000 
      11.445558       -2.188845       6.210000 
      11.476169       -2.160161       6.230000 
      11.507036       -2.106855       6.330000 
      11.537607       -2.090701       6.090000 
      11.583821       -2.135065       6.360000 
      11.614465       -2.148490       5.960000 
      11.645492       -2.100999       6.290000 
      11.677510       -2.071890       6.170000 
      11.708881       -2.119824       6.410000 
      11.739489       -2.170017       6.460000 
      11.771088       -2.148977       6.210000 
      11.802858       -2.136411       6.010000 
      11.834333       -2.170503       6.540000 
      11.865156       -2.202700       6.170000 
      11.895862       -2.185301       6.410000 
      11.927704       -2.128284       6.220000 
      11.959572       -2.097469       6.420000 
      11.990133       -2.069602       6.260000 
      12.021919       -2.053062       6.220000 
      12.053322       -2.066061       6.400000 
      12.084622       -2.138165       6.250000 
      12.115340       -2.190616       6.090000 
      12.147174       -2.151165       6.050000 
      12.179345       -2.121639       6.310000 
      12.210728       -2.091088       6.300000 
      12.242074       -2.060285       6.180000 
      12.273839       -2.072263       6.260000 
      12.303864       -2.100126       6.200000 
      12.335357       -2.137696       6.350000 
      12.366945       -2.150305       6.380000 
      12.397892       -2.098701       6.310000 
      12.428749       -2.062947       6.500000 
      12.460634       -2.074504       6.220000 
      12.492073       -2.105038       6.350000 
      12.523710       -2.089731       6.070000 
      12.554688       -2.059775       6.400000 
      12.586521       -2.065977       6.280000 
      12.617145       -2.065145       6.400000 
      12.648676       -2.049891       6.470000 
      12.679957       -2.053048       6.370000 
      12.711274       -2.085315       5.940000 
      12.742492       -2.164647       6.190000 
      12.773479       -2.223326       6.310000 
      12.804440       -2.212585       6.180000 
      12.835860       -2.170020       6.330000 
      12.867202       -2.119797       6.270000 
      12.898517       -2.071000       6.220000 
      12.929322       -2.026567       6.210000 
      12.960703       -2.012281       6.310000 
      12.992025       -2.049850       6.160000 
      13.022526       -2.104569       6.290000 
      13.053279       -2.108099       6.310000 
      13.083557       -2.075889       6.210000 
      13.115019       -2.055236       6.420000 
      13.146122       -2.065131       6.310000 
      13.177367       -2.060162       6.500000 
      13.207771       -2.030636       6.280000 
      13.239761       -2.031482       6.210000 
      13.269726       -2.070530       6.300000 
      13.299649       -2.108556       6.360000 
      13.330015       -2.115783       6.290000 
      13.360151       -2.103187       6.290000 
      13.391007       -2.110398       6.360000 
      13.422930       -2.084372       6.280000 
      13.453539       -2.031079       6.370000 
      13.483660       -2.012684       6.200000 
      13.515189       -2.049434       6.110000 
      13.546503       -2.099600       6.210000 
      13.578056       -2.088858       6.510000 
      13.608812       -2.054806       6.420000 
      13.640457       -2.047179       6.340000 
      13.672340       -2.049434       6.250000 
      13.703575       -2.065104       6.330000 
      13.734620       -2.065091       6.170000 
      13.764321       -2.048964       6.120000 
      13.794408       -2.040894       6.350000 
      13.824965       -2.019824       6.040000 
      13.854999       -2.001013       6.140000 
      13.884778       -2.001013       6.480000 
      13.915398       -2.019811       6.400000 
      13.946784       -2.040491       6.530000 
      13.977246       -2.044894       6.490000 
      14.008581       -2.057104       6.400000 
      14.039616       -2.098244       6.480000 
      14.071514       -2.150318       6.280000 
      14.102433       -2.138568       6.110000 
      14.133365       -2.110468       6.260000 
      14.165280       -2.114814       5.960000 
      14.196227       -2.110424       6.350000 
      14.226467       -2.073604       6.290000 
      14.257479       -2.046306       6.240000 
      14.288001       -2.020254       6.280000 
      14.318932       -2.000597       6.430000 
      14.349636       -1.996057       6.050000 
      14.381184       -2.001026       6.190000 
      14.411864       -2.025197       6.220000 
      14.443309       -2.064674       6.300000 
      14.474449       -2.084332       6.340000 
      14.505920       -2.075446       6.080000 
      14.536928       -2.073604       6.180000 
      14.568320       -2.081271       6.430000 
      14.599307       -2.050293       6.140000 
      14.629861       -2.040977       6.160000 
      14.660963       -2.084789       6.450000 
      14.692234       -2.105025       6.190000 
      14.722768       -2.079003       6.340000 
      14.754096       -2.076345       6.410000 
      14.785068       -2.090201       6.220000 
      14.815434       -2.094727       6.250000 
      14.846678       -2.095157       6.370000 
      14.877829       -2.095600       6.390000 
      14.908645       -2.100569       6.290000 
      14.940557       -2.119784       6.340000 
      14.971833       -2.139994       6.260000 
      15.003372       -2.137695       6.300000 
      15.034153       -2.110411       6.510000 
      15.065613       -2.050293       6.490000 
      15.097668       -2.011825       6.340000 
      15.128894       -2.020281       6.190000 
      15.159489       -2.035991       6.150000 
      15.190981       -2.031052       6.530000 
      15.221622       -2.060192       6.380000 
      15.252656       -2.129182       6.230000 
      15.283988       -2.147577       6.260000 
      15.314901       -2.095157       6.290000 
      15.345351       -2.042723       6.040000 
      15.376093       -2.060662       6.020000 
      15.407140       -2.123810       6.460000 
      15.438463       -2.123367       6.270000 
      15.469482       -2.054806       6.170000 
      15.500916       -2.012711       6.020000 
      15.533004       -2.026579       6.330000 
      15.563653       -2.070960       6.080000 
      15.595156       -2.118441       6.400000 
      15.626848       -2.152950       6.200000 
      15.657527       -2.129665       5.950000 
      15.688802       -2.061548       6.280000 
      15.720293       -2.047706       6.440000 
      15.750853       -2.114438       6.190000 
      15.782338       -2.170016       6.250000 
      15.813653       -2.154323       6.150000 
      15.845271       -2.159278       6.360000 
      15.875127       -2.194173       6.130000 
      15.905837       -2.153446       6.280000 
      15.936657       -2.061119       6.170000 
      15.968402       -2.018983       6.270000 
      15.999843       -2.055276       6.320000 
      16.031251       -2.123380       6.240000 
      16.062307       -2.123783       6.180000 
      16.092251       -2.059749       6.250000 
      16.122185       -2.031052       6.480000 
      16.153514       -2.036408       6.280000 
      16.185362       -2.024780       6.370000 
      16.216072       -2.024754       6.290000 
      16.246816       -2.035521       6.090000 
      16.278327       -2.020267       6.300000 
      16.309934       -2.011811       6.240000 
      16.341070       -2.049837       6.350000 
      16.372185       -2.104569       6.360000 
      16.403650       -2.108126       6.400000 
      16.435076       -2.076775       6.080000 
      16.465158       -2.066047       6.180000 
      16.495153       -2.113968       6.450000 
      16.527020       -2.145349       6.210000 
      16.559150       -2.103200       6.220000 
      16.590621       -2.081288       6.360000 
      16.621640       -2.084788       6.200000 
      16.653082       -2.064688       6.180000 
      16.684500       -2.025197       6.380000 
      16.715840       -2.001026       6.110000 
      16.746465       -1.996070       6.290000 
      16.777187       -2.001026       6.430000 
      16.808266       -2.025196       6.170000 
      16.840214       -2.064648       6.360000 
      16.870132       -2.083459       6.440000 
      16.902015       -2.065091       6.360000 
      16.932932       -2.030609       6.310000 
      16.963882       -2.025666       6.420000 
      16.994800       -2.041364       6.270000 
      17.024714       -2.049407       6.260000 
      17.055638       -2.070073       6.280000 
      17.085551       -2.084775       6.070000 
      17.115445       -2.075472       6.390000 
      17.147389       -2.074034       6.290000 
      17.178310       -2.086200       6.410000 
      17.209195       -2.068205       6.090000 
      17.241173       -2.045863       6.280000 
      17.271569       -2.020241       6.200000 
      17.302743       -2.000583       6.390000 
      17.334167       -1.995600       6.340000 
      17.365069       -1.995171       6.180000 
      17.396194       -1.995171       6.480000 
      17.427461       -1.995614       6.100000 
      17.458682       -2.000999       6.390000 
      17.488963       -2.024753       6.230000 
      17.519708       -2.059248       6.180000 
      17.549610       -2.059248       6.130000 
      17.579233       -2.024753       6.210000 
      17.610813       -2.000999       6.070000 
      17.642135       -1.995627       6.230000 
      17.673673       -1.995641       6.380000 
      17.704722       -2.001456       6.030000 
      17.735520       -2.030595       6.450000 
      17.765363       -2.088844       6.490000 
      17.796307       -2.123340       6.260000 
      17.827555       -2.088872       6.320000 
      17.858787       -2.031509       6.330000 
      17.891246       -2.013141       6.710000 
      17.921459       -2.054846       6.190000 
      17.952303       -2.124240       6.280000 
      17.983475       -2.134151       6.440000 
      18.015403       -2.103187       6.240000 
      18.047009       -2.092029       6.350000 
      18.077588       -2.068661       6.430000 
      18.109531       -2.045890       6.150000 
      18.140547       -2.020684       6.390000 
      18.171314       -2.005982       6.320000 
      18.202468       -2.019811       6.290000 
      18.232506       -2.035508       6.300000 
      18.263923       -2.024753       6.290000 
      18.294935       -2.024753       6.260000 
      18.325877       -2.035508       6.320000 
      18.357774       -2.019811       6.290000 
      18.388691       -2.005955       6.300000 
      18.418643       -2.019797       6.310000 
      18.449561       -2.035065       6.450000 
      18.480478       -2.019354       6.390000 
      18.511365       -2.000556       6.390000 
      18.543278       -1.995614       6.000000 
      18.574196       -1.995614       6.300000 
      18.605113       -2.000570       6.160000 
      18.637026       -2.019824       6.290000 
      18.667943       -2.041337       6.230000 
      18.698861       -2.054349       6.160000 
      18.730775       -2.088844       6.170000 
      18.761868       -2.099586       6.260000 
      18.793358       -2.048964       6.030000 
      18.825235       -2.006398       6.250000 
      18.856345       -1.996057       6.220000 
      18.887334       -1.995197       6.550000 
      18.919293       -1.995600       6.100000 
      18.949957       -2.000556       6.360000 
      18.980870       -2.019354       6.190000 
      19.012077       -2.035065       6.160000 
      19.042676       -2.019797       6.340000 
      19.074234       -2.005955       6.490000 
      19.104753       -2.019824       6.310000 
      19.135642       -2.035964       6.260000 
      19.166561       -2.030596       6.260000 
      19.197717       -2.054363       6.350000 
      19.228681       -2.100029       6.480000 
      19.259949       -2.088871       6.370000 
      19.290937       -2.054793       6.350000 
      19.320854       -2.046736       6.360000 
      19.352737       -2.044021       6.470000 
      19.383019       -2.040478       6.310000 
      19.414267       -2.020254       6.140000 
      19.446289       -2.006412       6.250000 
      19.477340       -2.025196       6.340000 
      19.507744       -2.059262       6.340000 
      19.539583       -2.059248       6.330000 
      19.569584       -2.024753       6.420000 
      19.601206       -2.000999       6.190000 
      19.631988       -1.995614       6.370000 
      19.678987       -1.995171       6.250000 
      19.708964       -1.995170       6.170000 
      19.739174       -1.995600       6.330000 
      19.771163       -2.000569       6.230000 
      19.801353       -2.019797       6.600000 
      19.832787       -2.040450       6.180000 
      19.864387       -2.043551       6.240000 
      19.895687       -2.040450       6.430000 
      19.926353       -2.019797       6.060000 
      19.957525       -2.000569       6.300000 
      19.988576       -1.995600       6.180000 
      20.019546       -1.995170       6.290000 
      20.050927       -1.995170       6.450000 
      20.082151       -1.995600       6.160000 
      20.113125       -2.000556       6.380000 
      20.144433       -2.019354       6.380000 
      20.175261       -2.035051       6.290000 
      20.206416       -2.019354       6.250000 
      20.237160       -2.000583       6.470000 
      20.268981       -1.996500       6.270000 
      20.300139       -2.006412       6.430000 
      20.332264       -2.048950       6.540000 
      20.363987       -2.099143       6.390000 
      20.394643       -2.083459       6.490000 
      20.425149       -2.030609       6.200000 
      20.456512       -2.007285       6.400000 
      20.487011       -2.025223       6.220000 
      20.517788       -2.059262       6.270000 
      20.549536       -2.059248       6.130000 
      20.580479       -2.024753       6.190000 
      20.611814       -2.000999       6.350000 
      20.642623       -1.995627       6.260000 
      20.673222       -1.995614       6.470000 
      20.704785       -2.000556       6.110000 
      20.736766       -2.019354       6.390000 
      20.767755       -2.035051       6.280000 
      20.799480       -2.019354       6.310000 
      20.830077       -2.000556       6.090000 
      20.860970       -1.995600       6.480000 
      20.891468       -1.995170       6.290000 
      20.921861       -1.995157       6.160000 
      20.953331       -1.995157       6.410000 
      20.984551       -1.995157       6.410000 
      21.015279       -1.995157       6.420000 
