Human trial picking the raspberry twin 

 time    ||     output     ||     loadcell

      0.000000       -801.990476       0.140000 
      0.030901       -801.990476       0.100000 
      0.061867       -801.990476       0.200000 
      0.093156       -801.990476       0.090000 
      0.124805       -801.990476       0.250000 
      0.155811       -801.990476       0.160000 
      0.186590       -801.990476       0.050000 
      0.232908       -801.990476       0.310000 
      0.264629       -801.990476       0.040000 
      0.296050       -801.990471       0.050000 
      0.327360       -801.989279       0.040000 
      0.358900       -801.881947       0.140000 
      0.389697       -798.327605       0.220000 
      0.421705       -755.026850       0.220000 
      0.453081       -560.966328       0.010000 
      0.484445       -241.014620       0.010000 
      0.516094       -46.954099       0.020000 
      0.548099       -3.653343       0.060000 
      0.579638       -0.099001       0.110000 
      0.610646       0.008331       0.200000 
      0.640568       0.009523       0.080000 
      0.671877       0.009528       0.050000 
      0.701936       0.009528       0.160000 
      0.732264       0.009528       0.080000 
      0.763238       0.009528       0.150000 
      0.794497       0.009528       0.090000 
      0.825869       0.009528       0.140000 
      0.857013       0.009528       0.030000 
      0.887624       0.009528       0.130000 
      0.918095       0.009528       0.110000 
      0.964687       0.009528       0.180000 
      0.995215       0.009528       0.160000 
      1.026906       0.009528       0.340000 
      1.057894       0.009528       0.050000 
      1.090014       0.009528       0.160000 
      1.121255       0.009528       0.180000 
      1.152122       0.009528       0.080000 
      1.183635       0.009528       0.090000 
      1.214699       0.009528       0.290000 
      1.245451       0.009528       0.130000 
      1.275950       0.009528       0.270000 
      1.306688       0.009528       0.140000 
      1.338579       0.009528       0.160000 
      1.370037       0.009528       0.260000 
      1.401209       0.009528       0.060000 
      1.431859       0.009528       0.030000 
      1.462826       0.009528       0.090000 
      1.493634       0.009528       0.040000 
      1.524980       0.009528       0.100000 
      1.555728       0.009528       0.220000 
      1.587158       0.009528       0.100000 
      1.619071       0.009528       0.040000 
      1.665108       0.009528       0.150000 
      1.695028       0.009528       0.130000 
      1.724947       0.009528       0.150000 
      1.756580       0.009528       0.200000 
      1.787504       0.009528       0.200000 
      1.817712       0.009528       0.180000 
      1.849196       0.009528       0.160000 
      1.879149       0.009528       0.200000 
      1.909064       0.009528       0.040000 
      1.939209       0.009528       0.170000 
      1.969143       0.009528       0.180000 
      1.999082       0.009528       0.040000 
      2.030964       0.009528       0.120000 
      2.062033       0.009528       0.220000 
      2.093089       0.009528       0.020000 
      2.123043       0.009528       0.040000 
      2.154013       0.009528       0.110000 
      2.185308       0.009528       0.010000 
      2.216924       0.009528       0.310000 
      2.247861       0.009528       0.270000 
      2.278704       0.009528       0.190000 
      2.309771       0.009528       0.250000 
      2.341460       0.009528       0.240000 
      2.373239       0.009528       0.200000 
      2.420780       0.009528       0.370000 
      2.452796       0.009528       0.120000 
      2.483460       0.009528       0.140000 
      2.514628       0.009528       0.100000 
      2.546513       0.009528       0.040000 
      2.577864       0.009528       0.050000 
      2.608875       0.009528       0.040000 
      2.640401       0.009528       0.020000 
      2.687026       0.009528       0.130000 
      2.717544       0.009528       0.140000 
      2.749020       0.009528       0.280000 
      2.780162       0.009528       0.080000 
      2.810752       0.009528       0.050000 
      2.841352       0.009528       0.210000 
      2.873127       0.009528       0.160000 
      2.904364       0.009528       0.010000 
      2.936487       0.009528       0.300000 
      2.967628       0.009528       0.120000 
      2.999549       0.009528       0.200000 
      3.030823       0.009528       0.170000 
      3.061569       0.009515       0.260000 
      3.092336       0.009085       0.060000 
      3.139125       0.004129       0.080000 
      3.170555       -0.014669       0.000000 
      3.200904       -0.030366       0.090000 
      3.231772       -0.014669       0.020000 
      3.262919       0.004129       0.240000 
      3.293124       0.009085       0.330000 
      3.324543       0.009515       0.080000 
      3.354897       0.009528       0.050000 
      3.386713       0.009528       0.110000 
      3.418264       0.009528       0.070000 
      3.449655       0.009528       0.080000 
      3.480434       0.009528       0.170000 
      3.510380       0.009528       0.030000 
      3.541602       0.009528       0.260000 
      3.572551       0.009528       0.040000 
      3.603436       0.009528       0.170000 
      3.650531       0.009528       0.020000 
      3.682478       0.009528       0.040000 
      3.712697       0.009528       0.030000 
      3.743733       0.009528       0.020000 
      3.774709       0.009528       0.120000 
      3.806409       0.009528       0.130000 
      3.837437       0.009528       0.130000 
      3.869526       0.009528       0.250000 
      3.900477       0.009528       0.050000 
      3.931095       0.009528       0.180000 
      3.962701       0.009528       0.260000 
      3.993359       0.009528       0.090000 
      4.024566       0.009528       0.010000 
      4.055836       0.009528       0.130000 
      4.086963       0.009528       0.080000 
      4.117318       0.009528       0.070000 
      4.147982       0.009528       0.080000 
      4.178994       0.009528       0.140000 
      4.209981       0.009528       0.010000 
      4.241326       0.009528       0.010000 
      4.272763       0.009528       0.210000 
      4.303645       0.009528       0.160000 
      4.334557       0.009528       0.120000 
      4.365448       0.009528       0.100000 
      4.396117       0.009528       0.160000 
      4.426759       0.009528       0.240000 
      4.457993       0.009528       0.210000 
      4.489246       0.009528       0.080000 
      4.520163       0.009528       0.010000 
      4.551495       0.009528       0.190000 
      4.582582       0.009528       0.120000 
      4.613232       0.009528       0.180000 
      4.644538       0.009528       0.180000 
      4.676229       0.009528       0.050000 
      4.706736       0.009528       0.120000 
      4.737994       0.009528       0.200000 
      4.769758       0.009528       0.040000 
      4.801562       0.009528       0.340000 
      4.831812       0.009528       0.210000 
      4.862971       0.009528       0.260000 
      4.893533       0.009528       0.320000 
      4.925080       0.009528       0.230000 
      4.956446       0.009528       0.280000 
      4.986720       0.009528       0.200000 
      5.017751       0.009528       0.160000 
      5.049366       0.009528       0.340000 
      5.079697       0.009528       0.100000 
      5.109928       0.009528       0.080000 
      5.156922       0.009528       0.080000 
      5.187690       0.009528       0.240000 
      5.219515       0.009528       0.160000 
      5.249861       0.009528       0.110000 
      5.281218       0.009528       0.150000 
      5.313154       0.009528       0.240000 
      5.343228       0.009528       0.160000 
      5.374702       0.009528       0.200000 
      5.406257       0.009528       0.110000 
      5.436930       0.009528       0.050000 
      5.468100       0.009528       0.070000 
      5.498955       0.009528       0.070000 
      5.529446       0.009528       0.110000 
      5.560649       0.009528       0.090000 
      5.591599       0.009528       0.010000 
      5.622232       0.009528       0.060000 
      5.653447       0.009528       0.150000 
      5.685594       0.009528       0.200000 
      5.715671       0.009528       0.110000 
      5.746865       0.009528       0.240000 
      5.778356       0.009528       0.140000 
      5.809075       0.009528       0.080000 
      5.839303       0.009528       0.110000 
      5.870503       0.009528       0.050000 
      5.901023       0.009528       0.050000 
      5.932048       0.009528       0.190000 
      5.963614       0.009528       0.190000 
      5.994820       0.009528       0.400000 
      6.026022       0.009528       0.110000 
      6.057080       0.009528       0.300000 
      6.088243       0.009528       0.310000 
      6.118824       0.009528       0.260000 
      6.149707       0.009528       0.230000 
      6.180946       0.009528       0.050000 
      6.212267       0.009528       0.060000 
      6.243288       0.009528       0.350000 
      6.273080       0.009528       0.110000 
      6.304829       0.009528       0.070000 
      6.336653       0.009528       0.100000 
      6.366903       0.009528       0.090000 
      6.398864       0.009528       0.050000 
      6.430384       0.009528       0.130000 
      6.461357       0.009528       0.020000 
      6.492107       0.009528       0.180000 
      6.523144       0.009528       0.170000 
      6.554636       0.009528       0.010000 
      6.585389       0.009528       0.210000 
      6.615672       0.009528       0.180000 
      6.646875       0.009528       0.150000 
      6.677713       0.009528       0.000000 
      6.709531       0.009528       0.040000 
      6.739480       0.009528       0.050000 
      6.770587       0.009528       0.110000 
      6.801551       0.009528       0.220000 
      6.832790       0.009528       0.120000 
      6.863533       0.009528       0.490000 
      6.895169       0.009528       0.150000 
      6.925678       0.009528       0.240000 
      6.957726       0.009528       0.390000 
      6.989055       0.009528       0.130000 
      7.020013       0.009528       0.080000 
      7.050918       0.009528       0.190000 
      7.082700       0.009528       0.210000 
      7.113166       0.009528       0.350000 
      7.143728       0.009528       0.190000 
      7.174560       0.009528       0.000000 
      7.204511       0.009528       0.260000 
      7.235248       0.009528       0.110000 
      7.266324       0.009528       0.040000 
      7.296757       0.009528       0.720000 
      7.327882       0.009528       1.950000 
      7.359166       0.009528       2.570000 
      7.390438       0.009528       2.400000 
      7.421621       0.009528       2.620000 
      7.452329       0.009528       3.780000 
      7.483196       0.009528       4.900000 
      7.513985       0.009528       7.230000 
      7.544683       0.009528       9.760000 
      7.576108       0.009528       11.550000 
      7.607025       0.009528       14.950000 
      7.637527       0.009528       19.550000 
      7.668982       0.009528       24.380000 
      7.700671       0.009528       30.240000 
      7.732053       0.009528       37.980000 
      7.763254       0.009528       45.400000 
      7.794881       0.009528       50.790000 
      7.825583       0.009528       59.720000 
      7.855994       0.009542       70.250000 
      7.886802       0.010025       83.280000 
      7.918670       0.016741       98.060000 
      7.948908       0.056719       108.780000 
      7.979748       0.164732       129.010000 
      8.011326       0.296569       150.310000 
      8.042498       0.400117       172.080000 
      8.074106       0.554878       195.580000 
      8.105169       0.757368       209.850000 
      8.135092       0.882117       227.830000 
      8.165012       0.911232       244.760000 
      8.196926       0.935983       260.540000 
      8.226877       0.958808       274.330000 
      8.258758       0.984445       280.060000 
      8.289678       1.004157       290.910000 
      8.320593       1.010966       302.110000 
      8.351549       1.034779       313.010000 
      8.382462       1.153633       326.090000 
      8.414376       1.415842       346.740000 
      8.445264       1.701911       362.260000 
      8.476179       1.887959       324.160000 
      8.508094       2.019500       2.610000 
      8.539011       2.255431       26.690000 
      8.570317       2.633307       25.440000 
      8.602261       2.961120       18.990000 
      8.634218       3.294705       10.400000 
      8.664603       3.708449       15.880000 
      8.696166       3.957363       7.410000 
      8.727461       4.044523       14.850000 
      8.757988       4.156239       12.940000 
      8.789103       4.414037       3.170000 
      8.820380       4.762386       2.290000 
      8.850925       4.948496       8.470000 
      8.882069       4.829742       7.720000 
      8.913385       4.102297       2.110000 
      8.944531       2.882213       2.110000 
      8.975639       2.082088       2.840000 
      9.007612       1.636708       6.890000 
      9.038496       0.962146       7.540000 
      9.069338       0.139244       5.070000 
      9.100051       -0.521574       3.590000 
      9.131213       -0.949002       3.520000 
      9.162636       -1.279897       5.400000 
      9.193472       -1.560267       5.010000 
      9.224700       -1.733813       6.220000 
      9.255602       -1.868393       6.310000 
      9.287346       -1.919043       3.990000 
      9.319132       -1.903484       3.960000 
      9.349806       -1.917827       5.500000 
      9.380599       -1.939779       7.190000 
      9.412158       -1.965388       6.760000 
      9.443262       -1.985046       6.040000 
      9.474175       -1.990028       5.850000 
      9.505095       -1.990445       6.450000 
      9.537041       -1.990029       6.960000 
      9.567965       -1.985073       6.560000 
      9.598854       -1.966275       5.860000 
      9.630767       -1.950578       6.330000 
      9.661681       -1.966275       6.880000 
      9.692631       -1.985073       6.730000 
      9.724547       -1.990029       5.520000 
      9.755466       -1.990459       5.260000 
      9.786340       -1.990472       5.590000 
      9.818270       -1.990472       6.020000 
      9.850327       -1.990472       5.860000 
      9.881299       -1.990472       5.360000 
      9.911450       -1.990459       4.740000 
      9.942543       -1.990029       4.690000 
      9.974531       -1.985073       5.440000 
      10.004633       -1.966275       5.340000 
      10.036624       -1.950551       5.580000 
      10.068686       -1.965362       5.080000 
      10.100236       -1.973375       5.220000 
      10.146770       -1.930393       5.570000 
      10.178834       -1.856863       5.900000 
      10.210104       -1.837635       6.020000 
      10.241974       -1.885530       6.010000 
      10.273522       -1.924551       5.860000 
      10.304692       -1.914669       6.270000 
      10.336297       -1.901713       6.100000 
      10.367812       -1.920968       6.020000 
      10.399032       -1.960419       6.020000 
      10.430535       -1.984173       5.980000 
      10.462832       -1.984602       6.160000 
      10.494342       -1.965791       5.970000 
      10.524990       -1.944279       5.690000 
      10.555788       -1.930823       5.690000 
      10.586911       -1.890929       5.550000 
      10.618791       -1.856004       5.670000 
      10.649646       -1.867175       5.670000 
      10.680953       -1.890942       5.430000 
      10.711698       -1.920081       5.500000 
      10.742537       -1.960379       5.400000 
      10.773334       -1.983716       5.440000 
      10.804562       -1.978747       5.140000 
      10.835680       -1.935779       5.370000 
      10.867621       -1.875688       5.250000 
      10.899042       -1.853776       5.230000 
      10.930114       -1.875245       5.070000 
      10.960858       -1.930393       5.640000 
      10.991926       -1.955007       5.440000 
      11.023074       -1.949677       5.570000 
      11.054535       -1.966234       5.870000 
      11.086329       -1.984616       5.930000 
      11.117823       -1.984186       5.850000 
      11.149844       -1.960849       6.100000 
      11.181156       -1.925897       5.880000 
      11.212444       -1.919625       6.200000 
      11.243919       -1.919595       5.460000 
      11.274802       -1.861306       5.810000 
      11.305500       -1.796412       5.620000 
      11.335853       -1.816456       5.840000 
      11.367425       -1.851960       5.460000 
      11.398463       -1.847850       5.390000 
      11.430541       -1.868560       5.480000 
      11.461658       -1.894459       5.480000 
      11.492129       -1.940748       5.160000 
      11.522846       -1.979633       5.330000 
      11.553259       -1.989558       5.610000 
      11.584252       -1.989545       5.170000 
      11.616252       -1.979216       5.140000 
      11.646174       -1.936195       5.390000 
      11.676871       -1.879744       5.230000 
      11.707832       -1.861332       5.330000 
      11.738551       -1.837135       5.400000 
      11.768905       -1.810240       5.440000 
      11.800666       -1.841581       5.410000 
      11.830851       -1.872958       5.810000 
      11.861575       -1.849608       5.820000 
      11.892135       -1.782486       5.860000 
      11.923535       -1.760434       5.640000 
      11.954701       -1.809354       5.890000 
      11.985723       -1.841550       5.740000 
      12.016315       -1.875203       5.860000 
      12.046809       -1.854993       5.860000 
      12.078064       -1.804411       5.790000 
      12.109041       -1.794087       6.010000 
      12.140367       -1.799468       5.710000 
      12.170711       -1.836209       5.560000 
      12.201237       -1.859963       5.570000 
      12.232537       -1.863103       5.430000 
      12.263370       -1.858191       5.380000 
      12.294854       -1.834880       5.310000 
      12.325537       -1.871231       5.330000 
      12.357703       -1.919984       5.320000 
      12.388878       -1.913326       4.980000 
      12.420465       -1.889532       5.150000 
      12.451028       -1.855020       5.220000 
      12.481608       -1.790942       5.310000 
      12.512611       -1.732250       5.230000 
      12.543800       -1.727294       5.430000 
      12.574656       -1.766718       5.330000 
      12.605660       -1.813783       5.470000 
      12.635581       -1.848694       5.540000 
      12.665598       -1.829896       5.650000 
      12.697010       -1.774318       5.740000 
      12.728671       -1.742064       5.680000 
      12.758724       -1.715569       5.700000 
      12.789025       -1.695442       5.730000 
      12.819991       -1.685086       5.660000 
      12.850945       -1.661332       5.910000 
      12.881866       -1.631794       5.780000 
      12.913428       -1.651048       5.810000 
      12.944503       -1.707056       5.610000 
      12.976097       -1.743849       5.600000 
      13.007524       -1.784576       5.550000 
      13.038920       -1.805242       5.660000 
      13.069936       -1.787287       5.420000 
      13.100661       -1.757735       5.490000 
      13.131761       -1.704828       5.290000 
      13.162138       -1.695912       5.370000 
      13.193527       -1.702140       5.110000 
      13.225460       -1.681087       5.400000 
      13.255948       -1.712029       5.150000 
      13.286727       -1.797155       5.210000 
      13.317662       -1.824480       5.310000 
      13.363715       -1.737138       5.430000 
      13.395578       -1.710699       5.310000 
      13.427638       -1.811014       5.470000 
      13.458782       -1.825338       5.660000 
      13.489985       -1.712910       5.220000 
      13.520758       -1.579746       5.710000 
      13.551233       -1.504967       5.570000 
      13.582803       -1.562316       5.710000 
      13.613379       -1.689489       5.770000 
      13.643305       -1.741093       5.800000 
      13.674219       -1.702958       5.880000 
      13.704507       -1.624152       5.620000 
      13.735012       -1.577101       5.860000 
      13.765909       -1.647947       5.880000 
      13.797487       -1.744195       5.800000 
      13.828639       -1.782387       5.780000 
      13.860013       -1.778734       5.530000 
      13.891668       -1.736664       5.550000 
      13.922698       -1.686459       5.310000 
      13.953519       -1.701270       5.520000 
      13.984921       -1.743792       5.420000 
      14.016063       -1.724967       5.210000 
      14.046949       -1.660879       5.340000 
      14.078568       -1.649678       5.220000 
      14.108762       -1.660375       5.220000 
      14.139744       -1.590485       5.320000 
      14.171250       -1.521025       5.120000 
      14.202343       -1.537122       5.380000 
      14.233824       -1.550104       5.340000 
      14.264690       -1.525454       5.170000 
      14.294671       -1.525025       5.230000 
      14.324950       -1.544719       5.310000 
      14.355667       -1.513408       5.490000 
      14.386676       -1.487873       5.310000 
      14.417233       -1.607085       5.550000 
      14.447905       -1.771505       5.540000 
      14.478348       -1.800255       5.580000 
      14.509273       -1.696274       5.890000 
      14.541321       -1.609384       5.900000 
      14.573411       -1.656379       5.580000 
      14.603740       -1.751847       5.570000 
      14.634746       -1.720383       5.770000 
      14.666661       -1.552876       5.510000 
      14.698231       -1.419255       5.600000 
      14.729805       -1.459645       5.650000 
      14.761401       -1.562590       5.620000 
      14.792835       -1.587259       5.430000 
      14.823507       -1.513286       5.620000 
      14.854562       -1.420954       5.510000 
      14.885666       -1.348364       5.170000 
      14.917408       -1.304895       5.190000 
      14.949090       -1.307553       5.340000 
      14.980055       -1.297214       5.210000 
      15.011830       -1.314753       5.150000 
      15.042788       -1.395331       5.360000 
      15.073537       -1.418695       5.280000 
      15.104694       -1.374359       5.410000 
      15.135764       -1.354676       5.470000 
      15.166793       -1.387829       5.540000 
      15.197801       -1.500813       5.470000 
      15.228938       -1.636526       5.250000 
      15.260066       -1.675977       5.540000 
      15.292508       -1.583232       5.430000 
      15.323412       -1.456366       5.590000 
      15.354750       -1.377543       5.690000 
      15.385881       -1.334878       5.760000 
      15.417179       -1.288325       5.540000 
      15.448280       -1.241609       5.500000 
      15.478956       -1.282029       5.700000 
      15.510085       -1.362590       5.850000 
      15.541580       -1.364901       5.780000 
      15.572375       -1.291832       5.490000 
      15.603559       -1.296801       5.570000 
      15.634596       -1.389515       5.680000 
      15.666471       -1.407413       5.720000 
      15.697018       -1.324111       5.490000 
      15.727774       -1.251034       5.410000 
      15.759046       -1.214268       5.530000 
      15.790738       -1.191483       5.260000 
      15.822855       -1.245219       5.450000 
      15.853475       -1.317784       5.380000 
      15.884529       -1.333107       5.400000 
      15.915829       -1.389961       5.270000 
      15.947762       -1.440167       5.520000 
      15.978881       -1.410624       5.620000 
      16.009770       -1.358191       5.300000 
      16.041753       -1.287373       5.370000 
      16.072805       -1.291482       5.530000 
      16.103657       -1.372034       5.460000 
      16.134819       -1.407940       5.520000 
      16.165859       -1.413326       5.810000 
      16.197011       -1.401603       5.810000 
      16.227029       -1.355104       5.670000 
      16.257786       -1.345219       5.550000 
      16.289848       -1.354148       5.650000 
      16.321731       -1.345209       5.550000 
      16.352534       -1.418268       5.820000 
      16.384459       -1.483119       5.550000 
      16.415374       -1.383327       5.650000 
      16.446681       -1.252434       5.700000 
      16.478794       -1.237167       5.440000 
      16.510020       -1.303968       5.640000 
      16.540495       -1.406514       5.620000 
      16.571365       -1.398457       5.570000 
      16.602980       -1.259104       5.330000 
      16.634717       -1.177132       5.530000 
      16.665622       -1.211610       5.370000 
      16.695714       -1.319139       5.560000 
      16.727306       -1.363519       5.260000 
      16.758945       -1.317353       5.470000 
      16.790563       -1.275718       5.400000 
      16.821468       -1.270789       5.610000 
      16.852596       -1.360016       5.490000 
      16.883654       -1.430269       5.420000 
      16.914639       -1.402584       5.620000 
      16.945544       -1.395361       5.560000 
      16.976591       -1.395343       5.440000 
      17.007628       -1.338423       5.600000 
      17.038129       -1.270788       5.650000 
      17.069006       -1.211070       5.460000 
      17.100756       -1.153360       5.580000 
      17.131356       -1.135364       5.590000 
      17.163266       -1.182885       5.540000 
      17.193674       -1.215113       5.600000 
      17.224936       -1.248805       5.440000 
      17.256865       -1.295774       5.550000 
      17.287526       -1.290029       5.340000 
      17.318617       -1.279758       5.440000 
      17.349405       -1.307955       5.430000 
      17.380475       -1.326354       5.460000 
      17.411250       -1.378387       5.310000 
      17.442065       -1.454009       5.450000 
      17.473704       -1.423623       5.470000 
      17.504564       -1.333941       5.410000 
      17.535005       -1.293227       5.290000 
      17.565809       -1.259960       5.640000 
      17.596564       -1.228693       5.310000 
      17.627549       -1.234854       5.460000 
      17.658654       -1.299897       5.380000 
      17.689642       -1.314142       5.570000 
      17.721668       -1.254620       5.460000 
      17.752803       -1.225884       5.350000 
      17.783556       -1.225437       5.350000 
      17.814851       -1.185114       5.620000 
      17.846652       -1.132250       5.490000 
      17.877464       -1.133110       5.510000 
      17.907803       -1.195938       5.620000 
      17.938615       -1.274691       5.430000 
      17.969718       -1.315584       5.450000 
      18.000246       -1.340597       5.580000 
      18.031578       -1.355891       5.590000 
      18.062553       -1.263976       5.750000 
      18.093076       -1.172631       5.420000 
      18.124029       -1.172990       5.160000 
      18.153917       -1.203481       5.400000 
      18.183869       -1.200341       5.470000 
      18.214781       -1.151021       5.460000 
      18.245699       -1.137608       5.500000 
      18.276622       -1.190445       5.460000 
      18.308539       -1.242449       5.450000 
      18.339493       -1.219138       5.530000 
      18.370407       -1.132666       5.280000 
      18.402353       -1.103570       5.400000 
      18.433275       -1.190942       5.500000 
      18.464192       -1.283673       5.320000 
      18.496107       -1.283273       5.450000 
      18.527026       -1.250067       5.550000 
      18.557976       -1.241594       5.340000 
      18.589287       -1.233480       5.440000 
      18.619162       -1.205713       5.570000 
      18.650732       -1.144722       5.420000 
      18.682649       -1.096355       5.570000 
      18.713568       -1.067631       5.790000 
      18.744334       -1.056433       5.390000 
      18.776081       -1.095428       5.610000 
      18.807791       -1.143778       5.500000 
      18.839134       -1.130366       5.430000 
      18.870318       -1.085560       5.350000 
      18.901741       -1.096327       5.610000 
      18.932491       -1.125867       5.310000 
      18.964162       -1.119652       5.520000 
      18.995196       -1.120485       5.160000 
      19.026372       -1.135779       5.500000 
      19.058247       -1.133937       5.420000 
      19.089279       -1.117397       5.300000 
      19.120233       -1.104357       5.530000 
      19.150833       -1.129923       5.480000 
      19.181755       -1.119582       5.410000 
      19.211781       -1.050604       5.590000 
      19.243252       -1.013842       5.590000 
      19.274674       -1.050604       5.600000 
      19.306422       -1.119582       5.470000 
      19.336495       -1.129923       5.490000 
      19.367585       -1.104371       5.470000 
      19.398180       -1.117880       5.640000 
      19.429039       -1.140639       5.640000 
      19.458991       -1.175300       5.640000 
      19.489912       -1.222628       5.860000 
      19.520820       -1.220953       5.570000 
      19.551714       -1.152765       5.540000 
      19.582664       -1.117410       5.650000 
      19.614575       -1.085959       5.560000 
      19.645499       -1.049745       5.560000 
      19.676380       -1.037552       5.660000 
      19.708294       -1.026380       5.570000 
      19.738247       -1.049678       5.730000 
      19.770130       -1.094901       5.310000 
      19.800082       -1.078800       5.530000 
      19.831998       -1.026354       5.180000 
      19.863882       -1.007556       5.460000 
      19.894388       -1.039350       5.540000 
      19.925552       -1.070758       5.420000 
      19.956985       -1.045622       5.620000 
      19.987605       -1.042564       5.390000 
      20.018558       -1.115085       5.550000 
      20.049986       -1.188172       5.590000 
      20.081047       -1.172462       5.380000 
      20.112668       -1.095857       5.240000 
      20.143956       -1.032652       5.630000 
      20.174707       -1.026394       5.470000 
      20.205712       -1.055061       5.590000 
      20.237327       -1.055490       5.570000 
      20.268313       -1.031753       5.440000 
      20.298888       -1.055520       5.580000 
      20.328542       -1.119554       5.430000 
      20.360172       -1.124067       5.520000 
      20.390856       -1.073862       5.560000 
      20.421686       -1.042078       5.660000 
      20.452523       -1.016482       5.410000 
      20.483619       -1.007166       5.340000 
      20.513692       -1.045608       5.340000 
      20.544700       -1.105712       5.420000 
      20.574606       -1.132567       5.470000 
      20.605864       -1.129896       5.280000 
      20.637823       -1.090459       5.430000 
      20.668869       -1.050604       5.480000 
      20.700786       -1.042951       5.240000 
      20.730702       -1.050134       5.410000 
      20.762537       -1.084173       5.510000 
      20.793518       -1.094901       5.170000 
      20.824854       -1.044279       5.430000 
      20.856691       -1.001714       5.390000 
      20.887517       -0.991398       5.310000 
      20.918895       -0.991385       5.210000 
      20.949501       -1.001297       5.560000 
      20.980692       -1.039779       5.540000 
      21.012661       -1.081945       5.690000 
