

 time    ||    gripping force   ||   raspberry measurement 

      0       60.040000       -794.880000 
      0       53.180000       -794.880000 
      0       41.990000       -794.880000 
      0       41.750000       -794.880000 
      0       34.870000       -794.880000 
      0       29.880000       -794.880000 
      0       27.280000       -794.880000 
      1       15.260000       -786.931200 
      1       14.220000       -779.061888 
      1       10.650000       -771.271264 
      2       11.640000       -763.557382 
      2       29.550000       -755.816491 
      2       34.600000       -752.293709 
      2       38.090000       -709.379418 
      2       49.920000       -517.075530 
      2       51.160000       -200.135199 
      2       51.110000       -8.105470 
      3       51.240000       34.618746 
      3       51.310000       38.097556 
      3       51.260000       38.123718 
      3       51.110000       38.046846 
      3       51.150000       38.027995 
      3       51.090000       38.019908 
      3       50.990000       38.003342 
      3       50.990000       37.995728 
      3       51.030000       38.046847 
      3       51.370000       38.093470 
      3       51.550000       38.131610 
      3       51.510000       38.262091 
      3       51.480000       38.418440 
      3       51.530000       38.484887 
      4       51.480000       38.494760 
      4       51.520000       38.551668 
      4       51.580000       38.609125 
      4       52.280000       38.608156 
      4       55.390000       38.559849 
      4       55.460000       38.534266 
      4       56.000000       38.607770 
      4       56.470000       38.628796 
      5       56.870000       38.583143 
      5       56.950000       38.549965 
      5       56.810000       38.521751 
      5       56.880000       38.568846 
      5       56.780000       38.670091 
      5       56.780000       38.752576 
      5       56.760000       38.761550 
      5       56.990000       38.725270 
      5       57.150000       38.756718 
      5       57.350000       38.801013 
      5       57.520000       38.787214 
      5       59.580000       38.806486 
      6       60.600000       38.910857 
      6       60.570000       38.973660 
      6       60.500000       38.948107 
      6       60.410000       38.909156 
      6       60.490000       38.896587 
      6       60.630000       38.950876 
      6       60.870000       38.999643 
      6       60.890000       38.975502 
      7       60.850000       38.946809 
      7       60.860000       38.975919 
      7       60.790000       39.004169 
      7       60.790000       38.964718 
      7       60.750000       38.893487 
      7       60.740000       38.877816 
      7       60.670000       38.946793 
      7       60.680000       39.009568 
      7       60.700000       39.018471 
      8       60.600000       39.001985 
      8       60.670000       38.979933 
      8       60.620000       38.978271 
      8       60.700000       38.979933 
      8       60.540000       39.002025 
      8       60.590000       39.019814 
      8       60.590000       39.026195 
      8       60.550000       39.024340 
      8       60.600000       39.016270 
      9       60.530000       38.980915 
      9       60.510000       38.955306 
      9       60.490000       38.949105 
      9       60.500000       38.939609 
      9       60.540000       38.977815 
      9       60.510000       39.014415 
      9       60.480000       39.025779 
      9       60.560000       39.025200 
      9       60.470000       39.026665 
      10       60.580000       39.025227 
      10       60.450000       39.026665 
      10       60.440000       39.025227 
      10       60.440000       39.026665 
      10       60.560000       39.025226 
      10       60.490000       39.026638 
      10       60.480000       39.024340 
      10       60.460000       39.015840 
      10       60.400000       38.975946 
      10       60.460000       38.936078 
      11       60.420000       38.928438 
      11       60.420000       38.936078 
      11       60.470000       38.975946 
      11       60.390000       39.015840 
      11       60.410000       39.024313 
      11       60.410000       39.025752 
      11       60.410000       39.014428 
      11       60.390000       38.978244 
      11       60.460000       38.944525 
      11       60.360000       38.966586 
      11       60.440000       38.955236 
      11       60.380000       38.897596 
      12       60.340000       38.897017 
      12       60.380000       38.967432 
      12       60.360000       39.012226 
      12       60.350000       39.009958 
      12       60.360000       38.956678 
      12       60.370000       38.914955 
      12       60.430000       38.919065 
      12       60.400000       38.904600 
      12       60.350000       38.912824 
      13       60.320000       38.944481 
      13       60.380000       38.967016 
      13       60.330000       38.960236 
      13       60.330000       38.981345 
      13       60.410000       39.016283 
      13       60.350000       39.024353 
      13       60.320000       39.026638 
      13       60.370000       39.025226 
      13       60.350000       39.026638 
      13       60.290000       39.024353 
      13       60.320000       39.016283 
      13       60.320000       38.981345 
      14       60.320000       38.960275 
      14       60.300000       38.968319 
      14       60.340000       38.959832 
      14       60.340000       38.975946 
      14       60.330000       38.992059 
      14       60.250000       38.983573 
      15       60.360000       38.991616 
      15       60.250000       38.970546 
      15       60.300000       38.935568 
      15       60.320000       38.926209 
      15       60.370000       38.909083 
      15       60.370000       38.854961 
      15       60.370000       38.816342 
      15       60.280000       38.902468 
      16       60.310000       38.988845 
      16       60.250000       38.974616 
      16       60.310000       38.946809 
      16       60.340000       38.976805 
      16       60.320000       39.014967 
      16       60.310000       39.013085 
      16       60.350000       38.972389 
      16       60.290000       38.915412 
      16       60.270000       38.909211 
      16       60.330000       38.931109 
      16       60.410000       38.975503 
      17       60.360000       39.015370 
      17       60.290000       39.018511 
      17       60.320000       38.997472 
      17       60.300000       38.966078 
      17       60.330000       38.980915 
      17       60.370000       39.005499 
      17       60.260000       38.975946 
      17       60.350000       38.946393 
      17       60.290000       38.970976 
      17       60.330000       38.985814 
      18       60.250000       38.954393 
      18       60.280000       38.932494 
      18       60.260000       38.925710 
      18       60.300000       38.927565 
      18       60.330000       38.936025 
      18       60.300000       38.975060 
      18       60.350000       39.005042 
      18       60.180000       38.975946 
      18       60.280000       38.946850 
      18       60.230000       38.976832 
      18       60.300000       39.015840 
      19       60.270000       39.023454 
      19       60.270000       39.015840 
      19       60.280000       38.976832 
      19       60.290000       38.946850 
      19       60.230000       38.975946 
      19       60.280000       39.005069 
      19       60.300000       38.975946 
      19       60.280000       38.946823 
      19       60.200000       38.975919 
      19       60.300000       39.004182 
      19       60.220000       38.965148 
      20       60.210000       38.898456 
      20       60.290000       38.897030 
      20       60.240000       38.967030 
      20       60.270000       39.008143 
      20       60.250000       39.001528 
      20       60.220000       38.984419 
      20       60.240000       38.991643 
      20       60.200000       38.970560 
      20       60.300000       38.936038 
      20       60.280000       38.932494 
      21       60.300000       38.944051 
      21       60.310000       38.942376 
      21       60.250000       38.909986 
      21       60.240000       38.913723 
      21       60.200000       38.950324 
      21       60.260000       38.996182 
      21       60.210000       39.019344 
      21       60.290000       39.025725 
      21       60.180000       39.018484 
      21       60.280000       38.986230 
      21       60.250000       38.911412 
      22       60.230000       38.866588 
      22       60.220000       38.874645 
      22       60.250000       38.890302 
      22       60.260000       38.949949 
      22       60.240000       38.993774 
      22       60.230000       38.945476 
      22       60.270000       38.877776 
      22       60.260000       38.893473 
      22       60.250000       38.964262 
      22       60.260000       38.998327 
      22       60.290000       38.946323 
      22       60.240000       38.882758 
      22       60.220000       38.912727 
      23       60.240000       38.985774 
      23       60.230000       39.011313 
      23       60.240000       38.979945 
      23       60.230000       38.883118 
      23       60.260000       38.818251 
      23       60.230000       38.877746 
      23       60.290000       38.956231 
      23       60.190000       38.978147 
      23       60.250000       39.001971 
      23       60.220000       39.019800 
      23       60.230000       39.025765 
      23       60.240000       39.019344 
      23       60.240000       38.996169 
      24       60.220000       38.949881 
      24       60.190000       38.908337 
      24       60.170000       38.886246 
      24       60.210000       38.908337 
      24       60.200000       38.949881 
      25       60.220000       38.996169 
      25       60.230000       39.019358 
      25       60.180000       39.026208 
      25       60.150000       39.025200 
      25       60.240000       39.026221 
      25       60.240000       39.019801 
      25       60.190000       39.001555 
      25       60.240000       38.973661 
      25       60.210000       38.943706 
      25       60.230000       38.896614 
      25       60.220000       38.917254 
      26       60.210000       38.986244 
      26       60.230000       39.013112 
      26       60.230000       39.001985 
      26       60.180000       38.985305 
      26       60.190000       39.002025 
      26       60.250000       39.014429 
      26       60.240000       39.002025 
      26       60.220000       38.985319 
      26       60.230000       39.002467 
      26       60.230000       39.019787 
      26       60.130000       39.024893 
      27       60.260000       39.009043 
      27       60.210000       38.954947 
      27       60.210000       38.915886 
      27       60.190000       38.996612 
      27       60.170000       39.058765 
      27       60.280000       39.003783 
      27       60.140000       38.941841 
      27       60.220000       38.928008 
      27       60.240000       38.925294 
      27       60.220000       38.927539 
      27       60.230000       38.935608 
      27       60.180000       38.970533 
      28       60.180000       38.991200 
      28       60.220000       38.979033 
      28       60.170000       38.977801 
      28       60.200000       38.974520 
      28       60.200000       38.977371 
      28       60.230000       38.974064 
      28       60.170000       38.971972 
      28       60.140000       38.949867 
      29       60.180000       38.932091 
      29       60.160000       38.926113 
      29       60.220000       38.932078 
      29       60.140000       38.949451 
      29       60.220000       38.967446 
      29       60.260000       38.960249 
      29       60.200000       38.981332 
      29       60.170000       39.015840 
      29       60.260000       39.018941 
      29       60.160000       39.001985 
      29       60.220000       38.979477 
      29       60.170000       38.972429 
      29       60.230000       38.950337 
      30       60.140000       38.937934 
      30       60.210000       38.955723 
      30       60.250000       38.996625 
      30       60.250000       39.019344 
      30       60.210000       39.025308 
      30       60.190000       39.013945 
      30       60.170000       38.971959 
      30       60.180000       38.909556 
      30       60.210000       38.879158 
      30       60.190000       38.861162 
      31       60.190000       38.881359 
      31       60.230000       38.915827 
      31       60.220000       38.918525 
      31       60.180000       38.897499 
      31       60.250000       38.866991 
      31       60.190000       38.892627 
      31       60.230000       38.965578 
      31       60.170000       39.014967 
      31       60.170000       39.024313 
      32       60.230000       39.026598 
      32       60.190000       39.023910 
      32       60.140000       39.010897 
      32       60.190000       38.957565 
      32       60.210000       38.924894 
      32       60.190000       38.957534 
      33       60.190000       38.946377 
      33       60.180000       38.925310 
      33       60.220000       38.973248 
      33       60.180000       39.013112 
      33       60.220000       39.014967 
      33       60.180000       38.976806 
      33       60.230000       38.946876 
      33       60.140000       38.976833 
      34       60.200000       39.015867 
      34       60.250000       39.024340 
      34       60.180000       39.026638 
      34       60.180000       39.025226 
      34       60.250000       39.026665 
      34       60.200000       39.025226 
      34       60.170000       39.026638 
      34       60.140000       39.024340 
      34       60.180000       39.015867 
      34       60.230000       38.976819 
      35       60.190000       38.946420 
      35       60.180000       38.970977 
      35       60.230000       38.985827 
      35       60.170000       38.954836 
      35       60.160000       38.937893 
      35       60.080000       38.949880 
      35       60.160000       38.966586 
      35       60.190000       38.949881 
      35       60.130000       38.937920 
      36       60.240000       38.955723 
      36       60.170000       38.996599 
      36       60.180000       39.018498 
      36       60.150000       39.015827 
      36       60.210000       38.981331 
      36       60.180000       38.960249 
      36       60.190000       38.967446 
      36       60.170000       38.949451 
      36       60.130000       38.932065 
      37       60.200000       38.925670 
      37       60.130000       38.926692 
      37       60.240000       38.925657 
      37       60.160000       38.931635 
      37       60.150000       38.944481 
      37       60.140000       38.948191 
      37       60.220000       38.938709 
      37       60.120000       38.967419 
      37       60.190000       38.970090 
      37       60.150000       38.953990 
      37       60.110000       38.944095 
      38       60.130000       38.919924 
      38       60.150000       38.951292 
      38       60.190000       38.980832 
      38       60.120000       38.953990 
      38       60.230000       38.933354 
      38       60.110000       38.936065 
      38       60.230000       38.970560 
      38       60.200000       38.991616 
      38       60.150000       38.983519 
      38       60.250000       38.990300 
      38       60.120000       38.954806 
      39       60.180000       38.868873 
      39       60.190000       38.837908 
      39       60.160000       38.922596 
      39       60.210000       39.004169 
      39       60.150000       39.018041 
      39       60.130000       39.002414 
      39       60.280000       38.985332 
      39       60.170000       39.002441 
      39       60.230000       39.018941 
      40       60.240000       39.015424 
      40       60.110000       38.976819 
      40       60.190000       38.946849 
      40       60.210000       38.975919 
      40       60.120000       39.004129 
      40       60.190000       38.963388 
      40       60.170000       38.877276 
      40       60.190000       38.804782 
      40       60.140000       38.821725 
      40       60.170000       38.913223 
      40       60.170000       38.967792 
      40       60.240000       39.001071 
      41       60.080000       39.018901 
      41       60.180000       39.015423 
      41       60.150000       38.976819 
      41       60.210000       38.946876 
      41       60.120000       38.976819 
      41       60.170000       39.015410 
      41       60.160000       39.018485 
      41       60.170000       38.996599 
      41       60.190000       38.955736 
      42       60.090000       38.938350 
      42       60.210000       38.954850 
      42       60.130000       38.985801 
      42       60.170000       38.970104 
      42       60.200000       38.936051 
      42       60.110000       38.933367 
      42       60.170000       38.954420 
      42       60.140000       38.985788 
      42       60.150000       38.970104 
      42       60.090000       38.936052 
      42       60.160000       38.933394 
      42       60.190000       38.955306 
      42       60.140000       38.996612 
      43       60.220000       39.019358 
      43       60.210000       39.025765 
      43       60.230000       39.019814 
      43       60.190000       39.002428 
      43       60.190000       38.984016 
      43       60.160000       38.986660 
      43       60.140000       38.950862 
      43       60.120000       38.909113 
      43       60.220000       38.894855 
      43       60.160000       38.864719 
      44       60.170000       38.889056 
      44       60.180000       38.944025 
      44       60.140000       38.984914 
      44       60.200000       38.970064 
      44       60.140000       38.935621 
      44       60.150000       38.928411 
      44       60.130000       38.935622 
      44       60.160000       38.970117 
      44       60.130000       38.986673 
      44       60.160000       38.965178 
      44       60.180000       38.980445 
      45       60.150000       39.000099 
      45       60.190000       38.951762 
      45       60.160000       38.906956 
      45       60.150000       38.952622 
      45       60.130000       39.010011 
      45       60.160000       39.018068 
      45       60.140000       38.997432 
      45       60.180000       38.965191 
      45       60.130000       38.970090 
      45       60.170000       38.956218 
      46       60.120000       38.885346 
      46       60.120000       38.849175 
      46       60.130000       38.875447 
      46       60.090000       38.918165 
      46       60.160000       38.932841 
      46       60.130000       38.966559 
      46       60.200000       38.966007 
      46       60.110000       38.945990 
      46       60.180000       38.976806 
      46       60.150000       39.015866 
      46       60.140000       39.024300 
      46       60.100000       39.025295 
      46       60.180000       39.008572 
      47       60.130000       38.948218 
      47       60.160000       38.875491 
      47       60.190000       38.884127 
      47       60.150000       38.914912 
      47       60.110000       38.926679 
      47       60.180000       38.936025 
      47       60.110000       38.975946 
      47       60.130000       39.015840 
      47       60.140000       39.024327 
      48       60.160000       39.026182 
      48       60.180000       39.019397 
      48       60.130000       38.997499 
      48       60.210000       38.966104 
      48       60.150000       38.981788 
      48       60.190000       39.015840 
      48       60.150000       39.018485 
      48       60.150000       38.996156 
      48       60.160000       38.950310 
      48       60.130000       38.913280 
      49       60.160000       38.904614 
      49       60.180000       38.919065 
      49       60.180000       38.914955 
      49       60.090000       38.956691 
      49       60.230000       39.010428 
      49       60.160000       39.018511 
      49       60.160000       39.002428 
      49       60.140000       38.985332 
      49       60.120000       39.002468 
      49       60.190000       39.019828 
      49       60.190000       39.026222 
      49       60.180000       39.025200 
      50       60.110000       39.026222 
      50       60.150000       39.019828 
      50       60.240000       39.002468 
      50       60.180000       38.985333 
      50       60.180000       39.002468 
      50       60.160000       39.019814 
      50       60.160000       39.025779 
      50       60.130000       39.019814 
      50       60.140000       39.002468 
      50       60.150000       38.985319 
      51       60.130000       39.002025 
      51       60.170000       39.014415 
      51       60.140000       39.001582 
      51       60.150000       38.979920 
      51       60.180000       38.978244 
      51       60.160000       38.979060 
      51       60.130000       38.991643 
      51       60.180000       38.975933 
      51       60.160000       38.959832 
      51       60.080000       38.968306 
      51       60.170000       38.959832 
      51       60.170000       38.975946 
      52       60.170000       38.992086 
      52       60.170000       38.984459 
      52       60.150000       39.002441 
      52       60.150000       39.019814 
      52       60.140000       39.025766 
      52       60.160000       39.019384 
      52       60.210000       38.997485 
      52       60.190000       38.965648 
      53       60.180000       38.975972 
      53       60.150000       38.987104 
      53       60.120000       38.964345 
      53       60.130000       38.970977 
      53       60.120000       38.967902 
      53       60.170000       38.944565 
      53       60.150000       38.978244 
      53       60.120000       39.014428 
      53       60.110000       39.025752 
      53       60.190000       39.024327 
      53       60.100000       39.016283 
      54       60.210000       38.981358 
      54       60.130000       38.960692 
      54       60.200000       38.972858 
      54       60.050000       38.974078 
      54       60.130000       38.976928 
      54       60.150000       38.969121 
      54       60.090000       38.953604 
      54       60.120000       38.939139 
      54       60.110000       38.967003 
      54       60.110000       38.965134 
      55       60.120000       38.935165 
      55       60.140000       38.927539 
      55       60.160000       38.925710 
      55       60.150000       38.932521 
      55       60.160000       38.955279 
      55       60.140000       38.996572 
      56       60.140000       39.018041 
      56       60.140000       39.009984 
      56       60.210000       38.951735 
      56       60.080000       38.896157 
      56       60.140000       38.903368 
      56       60.110000       38.920311 
      56       60.130000       38.932078 
      56       60.140000       38.955266 
      57       60.160000       38.996612 
      57       60.140000       39.019371 
      57       60.140000       39.026208 
      57       60.150000       39.025200 
      57       60.190000       39.026222 
      57       60.170000       39.019827 
      57       60.200000       39.002441 
      57       60.110000       38.984459 
      58       60.180000       38.992086 
      58       60.110000       38.975946 
      58       60.190000       38.959832 
      58       60.180000       38.968319 
      58       60.220000       38.960275 
      58       60.120000       38.981332 
      58       60.180000       39.015827 
      58       60.110000       39.018524 
      58       60.170000       38.997459 
      58       60.180000       38.965661 
      59       60.130000       38.976402 
      59       60.130000       38.992060 
      59       60.150000       38.983143 
      59       60.160000       38.986674 
      59       60.110000       38.952179 
      59       60.210000       38.924894 
      59       60.220000       38.962893 
      59       60.160000       38.969660 
      59       60.180000       38.953533 
      59       60.100000       38.938696 
      60       60.140000       38.895741 
      60       60.160000       38.911855 
      60       60.180000       38.962490 
      60       60.200000       38.978616 
      60       60.150000       39.001945 
      60       60.140000       39.018484 
      60       60.150000       39.010024 
      60       60.140000       38.952622 
      61       60.130000       38.906982 
