

 time    ||    gripping force   ||   raspberry measurement 

      0       59.880000       -794.859574 
      0       59.860000       -794.859574 
      0       49.330000       -794.859574 
      0       41.730000       -794.859574 
      0       41.970000       -794.859574 
      0       29.960000       -794.859574 
      0       25.190000       -794.859574 
      0       22.730000       -794.859574 
      0       17.890000       -794.859574 
      0       16.970000       -794.859570 
      1       13.950000       -786.909804 
      1       13.190000       -778.935388 
      1       11.440000       -775.412500 
      1       11.120000       -732.494757 
      1       10.840000       -540.150805 
      1       10.600000       -223.055551 
      1       11.070000       -30.885959 
      1       10.820000       11.714950 
      2       18.970000       15.035320 
      2       23.890000       15.048690 
      2       43.670000       14.967976 
      2       46.480000       14.918042 
      2       49.530000       14.908681 
      2       51.540000       14.906356 
      2       51.560000       14.907767 
      2       51.450000       14.906329 
      3       51.330000       14.907767 
      3       51.230000       14.906329 
      3       50.980000       14.907767 
      3       50.990000       14.906329 
      3       50.920000       14.907767 
      3       51.110000       14.906356 
      3       51.130000       14.908694 
      3       51.110000       14.918497 
      3       51.060000       14.973769 
      3       51.110000       15.077605 
      3       51.190000       15.182200 
      4       51.250000       15.272177 
      4       51.380000       15.327853 
      4       51.650000       15.289758 
      4       51.870000       15.274145 
      4       52.500000       15.309500 
      4       52.450000       15.358819 
      4       52.640000       15.405884 
      4       54.910000       15.365020 
      4       55.400000       15.278644 
      4       56.510000       15.247650 
      4       56.820000       15.268273 
      4       56.990000       15.257088 
      4       56.850000       15.247193 
      5       56.890000       15.283987 
      5       56.860000       15.324737 
      5       56.820000       15.348575 
      5       56.770000       15.348080 
      5       56.780000       15.403325 
      5       56.820000       15.516614 
      5       57.030000       15.590240 
      5       57.120000       15.605832 
      5       57.630000       15.618081 
      5       59.560000       15.649323 
      5       60.360000       15.663359 
      5       60.380000       15.614869 
      5       60.340000       15.595685 
      6       60.330000       15.617584 
      6       60.250000       15.674999 
      6       60.260000       15.707644 
      6       60.320000       15.670087 
      6       60.430000       15.663307 
      6       60.480000       15.678601 
      6       60.500000       15.684413 
      6       60.530000       15.700584 
      6       60.500000       15.701886 
      6       60.490000       15.766986 
      6       60.510000       15.851551 
      6       60.560000       15.855705 
      7       60.600000       15.845837 
      7       60.630000       15.868218 
      7       60.600000       15.857021 
      7       60.510000       15.844950 
      7       60.610000       15.856091 
      7       60.510000       15.792443 
      7       60.530000       15.693028 
      7       60.480000       15.693870 
      7       60.500000       15.739093 
      7       60.480000       15.745461 
      8       60.520000       15.781675 
      8       60.460000       15.818911 
      8       60.420000       15.818938 
      8       60.550000       15.848521 
      8       60.450000       15.852052 
      8       60.450000       15.844990 
      8       60.410000       15.862350 
      8       60.480000       15.827035 
      8       60.400000       15.777260 
      8       60.410000       15.790299 
      8       60.380000       15.830995 
      8       60.460000       15.876788 
      8       60.340000       15.893731 
      9       60.400000       15.866916 
      9       60.350000       15.793829 
      9       60.390000       15.763861 
      9       60.340000       15.827465 
      9       60.360000       15.880758 
      9       60.370000       15.861561 
      9       60.410000       15.847166 
      9       60.370000       15.878600 
      9       60.270000       15.900499 
      9       60.320000       15.907284 
      9       60.360000       15.905428 
      10       60.370000       15.896929 
      10       60.360000       15.856605 
      10       60.320000       15.811781 
      10       60.320000       15.785330 
      10       60.220000       15.776830 
      10       60.310000       15.827022 
      10       60.290000       15.862350 
      10       60.300000       15.844977 
      10       60.260000       15.851608 
      10       60.230000       15.843108 
      10       60.270000       15.794285 
      11       60.290000       15.773215 
      11       60.250000       15.729251 
      11       60.320000       15.693471 
      11       60.240000       15.762461 
      11       60.270000       15.845722 
      11       60.360000       15.830622 
      11       60.200000       15.795587 
      11       60.240000       15.801000 
      11       60.250000       15.795184 
      11       60.270000       15.826579 
      12       60.290000       15.838595 
      12       60.210000       15.805486 
      12       60.230000       15.831065 
      12       60.270000       15.841236 
      12       60.180000       15.749075 
      12       60.260000       15.702414 
      12       60.220000       15.790242 
      12       60.220000       15.840407 
      12       60.240000       15.844481 
      12       60.200000       15.866419 
      12       60.220000       15.835907 
      12       60.190000       15.754891 
      13       60.200000       15.736895 
      13       60.200000       15.807737 
      13       60.190000       15.811241 
      13       60.220000       15.762075 
      13       60.150000       15.787974 
      13       60.200000       15.838206 
      13       60.200000       15.840438 
      13       60.220000       15.861091 
      13       60.210000       15.881188 
      13       60.160000       15.832864 
      14       60.200000       15.788031 
      14       60.190000       15.832824 
      14       60.200000       15.879885 
      14       60.220000       15.845780 
      14       60.150000       15.778631 
      14       60.210000       15.766461 
      14       60.170000       15.789356 
      14       60.220000       15.765575 
      14       60.190000       15.767873 
      14       60.130000       15.798715 
      14       60.220000       15.816267 
      14       60.140000       15.856108 
      14       60.170000       15.885244 
      15       60.150000       15.845793 
      15       60.210000       15.773675 
      15       60.180000       15.747220 
      15       60.170000       15.768260 
      15       60.140000       15.757088 
      15       60.130000       15.747193 
      15       60.200000       15.783986 
      15       60.170000       15.824696 
      15       60.140000       15.847178 
      15       60.120000       15.829639 
      15       60.150000       15.802798 
      15       60.170000       15.763360 
      15       60.170000       15.747636 
      15       60.160000       15.783114 
      16       60.160000       15.813885 
      16       60.120000       15.798368 
      16       60.200000       15.745325 
      16       60.160000       15.740575 
      16       60.110000       15.756066 
      16       60.120000       15.782254 
      16       60.160000       15.795531 
      16       60.160000       15.784000 
      16       60.130000       15.776789 
      16       60.160000       15.826981 
      16       60.180000       15.861047 
      16       60.110000       15.829639 
      17       60.110000       15.788942 
      17       60.130000       15.761492 
      17       60.130000       15.759400 
      17       60.140000       15.761492 
      17       60.180000       15.788943 
      17       60.110000       15.829653 
      17       60.120000       15.861503 
      17       60.130000       15.832811 
      17       60.100000       15.805982 
      17       60.100000       15.844022 
      17       60.130000       15.851649 
      17       60.170000       15.845420 
      17       60.110000       15.867749 
      17       60.130000       15.851192 
      18       60.130000       15.815837 
      18       60.120000       15.798702 
      18       60.140000       15.767886 
      18       60.130000       15.766005 
      18       60.120000       15.794298 
      18       60.210000       15.784789 
      18       60.120000       15.788069 
      18       60.130000       15.795947 
      18       60.170000       15.782697 
      18       60.120000       15.761022 
      18       60.160000       15.759386 
      19       60.160000       15.761479 
      19       60.080000       15.788526 
      19       60.120000       15.825140 
      19       60.180000       15.848104 
      19       60.090000       15.841310 
      19       60.120000       15.861534 
      19       60.030000       15.885687 
      19       60.110000       15.845806 
      19       60.190000       15.773662 
      19       60.160000       15.746750 
      19       60.110000       15.761987 
      20       60.100000       15.722510 
      20       60.100000       15.663431 
      20       60.050000       15.693830 
      20       60.090000       15.767386 
      20       60.160000       15.800043 
      20       60.120000       15.812696 
      20       60.090000       15.830969 
      20       60.100000       15.853517 
      20       60.180000       15.860552 
      20       60.050000       15.882213 
      20       59.980000       15.889661 
      21       60.090000       15.853087 
      21       60.130000       15.796917 
      21       60.060000       15.794838 
      21       60.090000       15.826040 
      21       60.120000       15.853061 
      21       60.110000       15.859679 
      21       60.030000       15.872288 
      21       60.130000       15.851609 
      21       60.160000       15.815837 
      21       60.030000       15.798272 
      21       60.130000       15.762904 
      21       60.140000       15.746347 
      22       60.020000       15.768689 
      22       60.110000       15.762930 
      22       60.060000       15.776789 
      22       60.110000       15.848078 
      22       60.090000       15.888774 
      22       60.110000       15.876358 
      22       60.120000       15.830982 
      22       60.100000       15.790298 
      22       60.110000       15.777233 
      22       60.070000       15.826136 
      22       60.140000       15.851149 
      22       60.140000       15.792500 
      22       60.050000       15.763390 
      22       60.130000       15.822482 
      23       60.120000       15.861047 
      23       60.060000       15.834126 
      23       60.070000       15.801912 
      23       60.120000       15.748049 
      23       60.100000       15.685400 
      23       60.190000       15.706440 
      23       60.100000       15.797355 
      23       60.090000       15.796929 
      23       60.100000       15.764732 
      23       60.100000       15.814398 
      23       60.070000       15.822052 
      23       60.100000       15.805096 
      23       60.120000       15.843968 
      24       60.090000       15.850775 
      24       60.150000       15.835052 
      24       60.030000       15.824324 
      24       60.070000       15.790658 
      24       60.170000       15.788943 
      24       60.070000       15.800486 
      24       60.150000       15.796539 
      24       60.120000       15.757921 
      24       60.050000       15.727992 
      24       60.120000       15.758391 
      24       59.980000       15.802798 
      24       60.080000       15.834582 
      24       60.120000       15.866003 
      24       60.130000       15.841280 
      25       60.120000       15.779128 
      25       60.100000       15.778132 
      25       60.170000       15.848534 
      25       60.030000       15.893301 
      25       60.080000       15.890173 
      25       60.170000       15.826968 
      25       60.080000       15.747233 
      25       60.120000       15.715383 
      25       60.130000       15.717194 
      25       60.100000       15.751689 
      25       60.150000       15.773632 
      25       60.110000       15.776346 
      25       60.090000       15.831951 
      26       60.060000       15.881147 
      26       60.100000       15.860660 
      26       60.070000       15.835441 
      26       60.120000       15.818038 
      26       60.130000       15.754777 
      26       60.100000       15.689883 
      26       60.140000       15.648980 
      26       60.100000       15.673326 
      26       60.080000       15.741724 
      26       60.050000       15.777271 
      27       60.110000       15.789745 
      27       60.100000       15.824324 
      27       60.120000       15.835951 
      27       60.100000       15.862003 
      27       60.110000       15.897332 
      27       60.080000       15.904112 
      27       60.030000       15.891100 
      27       60.070000       15.828325 
      27       60.030000       15.763444 
      27       60.120000       15.788430 
      28       60.080000       15.842692 
      28       60.070000       15.852990 
      28       60.100000       15.843122 
      28       60.120000       15.793373 
      28       60.150000       15.781786 
      28       60.070000       15.838193 
      28       60.090000       15.846262 
      28       60.050000       15.827012 
      28       60.110000       15.856135 
      28       60.080000       15.875372 
      28       60.070000       15.808654 
      28       60.070000       15.748137 
      29       60.170000       15.808653 
      29       60.070000       15.875332 
      29       60.100000       15.854819 
      29       60.030000       15.811285 
      29       60.120000       15.779944 
      29       60.090000       15.753089 
      29       60.090000       15.792943 
      29       60.080000       15.866889 
      29       60.110000       15.893744 
      29       60.100000       15.877231 
      29       60.140000       15.836368 
      29       60.090000       15.813623 
      30       60.070000       15.806812 
      30       60.150000       15.808667 
      30       60.070000       15.817127 
      30       60.080000       15.856175 
      30       60.110000       15.886560 
      30       60.040000       15.861533 
      30       60.090000       15.840411 
      30       60.070000       15.836850 
      30       60.110000       15.770931 
      30       60.100000       15.680041 
      30       60.010000       15.660248 
      30       60.110000       15.738747 
      31       60.090000       15.840394 
      31       60.090000       15.895599 
      31       60.060000       15.905401 
      31       60.140000       15.907713 
      31       59.990000       15.905455 
      31       60.080000       15.897372 
      31       60.120000       15.862004 
      31       60.060000       15.835952 
      31       60.090000       15.824351 
      31       60.120000       15.790658 
      32       60.050000       15.788969 
      32       60.080000       15.801373 
      32       60.130000       15.807351 
      32       60.100000       15.806759 
      32       60.060000       15.813166 
      32       60.140000       15.830525 
      32       60.120000       15.847635 
      32       60.090000       15.829652 
      32       60.070000       15.802785 
      32       60.120000       15.762904 
      33       60.090000       15.741847 
      33       60.110000       15.755277 
      33       60.030000       15.770974 
      33       60.110000       15.826565 
      33       60.080000       15.862336 
      33       60.020000       15.844976 
      33       60.090000       15.851582 
      33       60.050000       15.842235 
      33       60.060000       15.783943 
      33       60.060000       15.730637 
      33       60.080000       15.678172 
      33       59.980000       15.698369 
      33       60.240000       15.767347 
      33       60.070000       15.794241 
      34       60.140000       15.783960 
      34       60.040000       15.776762 
      34       60.050000       15.826135 
      34       60.030000       15.851578 
      34       60.110000       15.797456 
      34       60.060000       15.782188 
      34       60.120000       15.838179 
      34       60.060000       15.845377 
      34       60.090000       15.816241 
      34       60.060000       15.808640 
      34       60.080000       15.806798 
      34       60.120000       15.813180 
      34       60.060000       15.830982 
      35       60.120000       15.853517 
      35       60.060000       15.860578 
      35       60.140000       15.883087 
      35       60.060000       15.900042 
      35       60.140000       15.896915 
      35       60.020000       15.861534 
      35       60.050000       15.830150 
      35       60.140000       15.796098 
      35       60.030000       15.743220 
      35       60.110000       15.803271 
      36       60.070000       15.919726 
      36       60.020000       15.921954 
      36       60.090000       15.812697 
      36       60.090000       15.709072 
      36       60.060000       15.701607 
      36       60.040000       15.756120 
      36       60.120000       15.823035 
      36       60.040000       15.854710 
      36       60.060000       15.882656 
      36       60.050000       15.900889 
      36       60.090000       15.906867 
      37       60.090000       15.900459 
      37       60.050000       15.877714 
      37       59.990000       15.836355 
      37       60.100000       15.812750 
      37       60.050000       15.796444 
      37       60.080000       15.765216 
      37       60.100000       15.755707 
      37       60.010000       15.818522 
      37       60.090000       15.841253 
      37       60.010000       15.825722 
      37       60.080000       15.846209 
      37       60.040000       15.837749 
      37       60.040000       15.776373 
      37       60.090000       15.768733 
      38       60.030000       15.797868 
      38       60.070000       15.805886 
      38       60.030000       15.812254 
      38       60.050000       15.819753 
      38       60.080000       15.800100 
      38       60.030000       15.759763 
      38       60.050000       15.791570 
      38       60.050000       15.778960 
      38       60.030000       15.695255 
      38       60.000000       15.714496 
      39       60.050000       15.758347 
      39       60.050000       15.751263 
      39       60.030000       15.791130 
      39       60.050000       15.845722 
      39       60.000000       15.801925 
      39       60.110000       15.736882 
      39       60.030000       15.760246 
      39       60.050000       15.795557 
      39       60.040000       15.806895 
      39       60.090000       15.806758 
      39       59.980000       15.813596 
      39       60.130000       15.835508 
      40       60.020000       15.867332 
      40       60.070000       15.856564 
      40       60.020000       15.840008 
      40       60.040000       15.837737 
      40       60.020000       15.782185 
      40       60.090000       15.734251 
      40       60.000000       15.768746 
      40       60.020000       15.840407 
      40       60.050000       15.866016 
      40       60.030000       15.835898 
      41       60.070000       15.818565 
      41       60.040000       15.826040 
      41       60.060000       15.829334 
      41       60.040000       15.820685 
      41       60.040000       15.858916 
      41       60.090000       15.895517 
      41       60.000000       15.906854 
      41       60.030000       15.905428 
      41       60.030000       15.897358 
      41       60.020000       15.861561 
      41       60.090000       15.830579 
      41       59.990000       15.801014 
      42       59.990000       15.760689 
      42       60.070000       15.802825 
      42       60.040000       15.833224 
      42       60.050000       15.805553 
      42       60.070000       15.838653 
      42       59.990000       15.891972 
      42       60.080000       15.904099 
      42       60.060000       15.896029 
      42       60.060000       15.846679 
      42       60.080000       15.773688 
      43       60.000000       15.746750 
      43       60.090000       15.761947 
      43       60.050000       15.721180 
      43       60.010000       15.647193 
      43       60.050000       15.619909 
      43       60.010000       15.631466 
      43       60.060000       15.653545 
      43       60.050000       15.661062 
      43       60.050000       15.689842 
      43       60.030000       15.741337 
      43       60.090000       15.820696 
      43       60.050000       15.861020 
      43       60.060000       15.835025 
      44       60.100000       15.813139 
      44       60.070000       15.801386 
      44       60.090000       15.783597 
      44       60.020000       15.766878 
      44       60.100000       15.788969 
      44       60.030000       15.825127 
      44       60.080000       15.847231 
      44       60.020000       15.830942 
      44       60.030000       15.818109 
      44       60.100000       15.825140 
      44       59.960000       15.818494 
      44       60.040000       15.770907 
      44       60.120000       15.761104 
      45       60.050000       15.751175 
      45       60.070000       15.658418 
      45       60.080000       15.580528 
      45       60.060000       15.643151 
      45       60.030000       15.753031 
      45       60.070000       15.778074 
      45       60.080000       15.788902 
      45       60.020000       15.811714 
      45       60.000000       15.850788 
      45       59.970000       15.867736 
      46       60.090000       15.845420 
      46       59.980000       15.851609 
      46       60.050000       15.842706 
      46       59.970000       15.790242 
      46       60.000000       15.766089 
      46       60.090000       15.772317 
      46       60.090000       15.832421 
      46       60.030000       15.891490 
      46       60.020000       15.903682 
      46       60.070000       15.891960 
      46       60.020000       15.838706 
      46       60.000000       15.807312 
      47       60.070000       15.854404 
      47       59.980000       15.895087 
      47       59.990000       15.906424 
      47       60.010000       15.900903 
      47       60.040000       15.883570 
      47       60.060000       15.866421 
      47       60.020000       15.883127 
      47       60.000000       15.895530 
      47       60.040000       15.883100 
      47       60.030000       15.865535 
      48       60.040000       15.872772 
      48       60.010000       15.852535 
      48       59.960000       15.827535 
      48       60.030000       15.857907 
      48       60.080000       15.896472 
      48       60.030000       15.898243 
      48       60.040000       15.861034 
      48       60.040000       15.757974 
      48       60.030000       15.665217 
      49       60.040000       15.680444 
      49       60.080000       15.770031 
      49       60.010000       15.825165 
      49       60.000000       15.781218 
      49       60.040000       15.733364 
      49       59.960000       15.758807 
      49       60.060000       15.801951 
      49       60.040000       15.824657 
      49       59.990000       15.827950 
      49       60.070000       15.804017 
      49       60.010000       15.780026 
      49       60.020000       15.740382 
      49       60.040000       15.740159 
      49       60.000000       15.756510 
      49       60.080000       15.788109 
      50       60.050000       15.825543 
      50       60.030000       15.852590 
      50       59.970000       15.853823 
      50       60.080000       15.842262 
      50       60.040000       15.782575 
      50       59.990000       15.733391 
      50       60.090000       15.758378 
      50       60.000000       15.796996 
      50       60.050000       15.805886 
      50       59.970000       15.813139 
      50       60.020000       15.830526 
      50       60.080000       15.847675 
      50       60.060000       15.830969 
      51       60.060000       15.818579 
      51       60.040000       15.831425 
      51       60.020000       15.853504 
      51       60.030000       15.859692 
      51       60.070000       15.872288 
      51       60.010000       15.851608 
      51       60.040000       15.815824 
      51       60.070000       15.797842 
      51       59.950000       15.757934 
      51       60.120000       15.727079 
      51       60.100000       15.746680 
      51       59.990000       15.742719 
      51       59.930000       15.695628 
      52       60.030000       15.690286 
      52       60.110000       15.712211 
      52       60.060000       15.756618 
      52       60.070000       15.796902 
      52       60.070000       15.804556 
      52       60.060000       15.796942 
      52       60.020000       15.757961 
      52       60.060000       15.728851 
      52       60.070000       15.768276 
      52       60.050000       15.839521 
      52       59.990000       15.855661 
      53       60.020000       15.792903 
      53       60.040000       15.762947 
      53       59.950000       15.816613 
      53       60.050000       15.830578 
      53       60.040000       15.759719 
      53       60.070000       15.696128 
      53       60.000000       15.678172 
      53       60.030000       15.732864 
      53       59.980000       15.791100 
      53       60.060000       15.799600 
      54       60.020000       15.783543 
      54       60.060000       15.766877 
      54       60.050000       15.788929 
      54       60.030000       15.823810 
      54       59.960000       15.831451 
      54       60.010000       15.762891 
      54       59.970000       15.712738 
      54       60.050000       15.755707 
      54       60.030000       15.805039 
      54       59.990000       15.844853 
      54       60.030000       15.841336 
      55       59.980000       15.779403 
      55       60.070000       15.716821 
      55       60.040000       15.682133 
      55       60.050000       15.739702 
      55       60.080000       15.808916 
      55       60.020000       15.822108 
      55       60.060000       15.789705 
      55       60.010000       15.778170 
      55       60.040000       15.752979 
      55       60.050000       15.727549 
      56       60.080000       15.757908 
      56       59.990000       15.796512 
      56       60.030000       15.799587 
      56       59.990000       15.777714 
      56       60.050000       15.737281 
      56       60.060000       15.724851 
      56       60.040000       15.760162 
      56       60.020000       15.807240 
      56       60.020000       15.780788 
      56       60.040000       15.746293 
      56       60.050000       15.748991 
      57       60.040000       15.731023 
      57       60.040000       15.719036 
      57       59.980000       15.737254 
      57       59.980000       15.782643 
      57       60.040000       15.817955 
      57       60.110000       15.807240 
      57       59.980000       15.722956 
      57       59.990000       15.687198 
      57       59.960000       15.733681 
      57       60.030000       15.727049 
      57       60.030000       15.706400 
      57       60.040000       15.754390 
      57       60.090000       15.795543 
      58       60.020000       15.812266 
      58       60.050000       15.830472 
      58       60.030000       15.846774 
      58       60.020000       15.819714 
      58       60.070000       15.764342 
      58       60.010000       15.722000 
      58       60.030000       15.739675 
      58       59.990000       15.768148 
      58       60.020000       15.763346 
      58       60.050000       15.695614 
      58       60.030000       15.669216 
      59       60.090000       15.685343 
      59       60.100000       15.719838 
      59       60.000000       15.793398 
      59       60.090000       15.819701 
      59       60.020000       15.817236 
      59       60.070000       15.826000 
      59       60.000000       15.829333 
      59       60.050000       15.820684 
      59       59.940000       15.858889 
      59       59.950000       15.894631 
      59       60.030000       15.896082 
      59       60.060000       15.857894 
      59       60.030000       15.827535 
      60       60.020000       15.852522 
      60       60.030000       15.872288 
      60       60.000000       15.858806 
      60       60.060000       15.842706 
      60       60.050000       15.783045 
      60       60.040000       15.739247 
      60       60.030000       15.788404 
      60       60.010000       15.866016 
      60       60.060000       15.887902 
      60       60.040000       15.848091 
      60       60.020000       15.778132 
      61       60.020000       15.779584 
