

 time    ||    gripping force   ||   raspberry measurement 

      0       0.070000       -802.126667 
      0       0.140000       -802.126667 
      0       0.110000       -802.126667 
      0       0.200000       -802.126667 
      0       0.110000       -802.126667 
      0       0.100000       -802.126667 
      0       0.160000       -802.126667 
      0       0.350000       -802.126667 
      0       0.270000       -802.126667 
      0       0.290000       -802.126667 
      0       0.330000       -802.126667 
      0       0.470000       -802.126667 
      0       0.240000       -802.126667 
      0       0.410000       -802.126667 
      0       0.440000       -802.126667 
      0       0.040000       -802.126667 
      0       0.200000       -802.126667 
      1       0.030000       -802.126667 
      1       0.160000       -802.126667 
      1       0.180000       -802.126667 
      1       0.180000       -802.126667 
      1       0.480000       -802.126667 
      1       0.360000       -802.126667 
      1       0.370000       -802.126667 
      1       0.250000       -802.126667 
      1       0.770000       -802.126667 
      1       0.500000       -802.126667 
      1       0.600000       -794.105400 
      1       16.640000       -786.164346 
      1       45.630000       -778.302698 
      1       55.920000       -770.518490 
      1       76.630000       -762.707047 
      1       101.400000       -759.152718 
      1       115.660000       -759.152718 
      1       115.750000       -715.852393 
      2       114.190000       -521.796841 
      2       113.010000       -201.864360 
      2       112.430000       -7.824505 
      2       112.570000       35.472720 
      2       112.450000       35.472720 
      2       112.100000       35.472720 
      2       111.910000       39.025220 
      2       111.000000       39.134838 
      2       108.660000       39.144638 
      2       101.760000       39.188109 
      2       91.090000       39.272111 
      2       76.700000       39.485965 
      2       57.240000       39.869685 
      2       42.460000       40.226966 
      2       35.980000       40.226966 
      3       31.760000       40.226966 
      3       31.620000       40.226966 
      3       32.150000       40.226966 
      3       32.730000       40.226966 
      3       35.380000       40.559222 
      3       39.490000       40.861325 
      3       46.440000       41.002629 
      3       53.640000       41.033696 
      3       58.760000       41.044466 
      3       59.240000       41.084413 
      3       58.920000       41.084413 
      3       57.130000       41.123771 
      3       49.380000       41.123769 
      3       44.280000       41.064050 
      3       40.140000       40.852436 
      3       36.910000       40.852436 
      4       36.680000       40.538197 
      4       36.250000       40.538197 
      4       36.100000       40.538197 
      4       36.190000       40.538197 
      4       36.300000       40.294313 
      4       36.290000       40.068229 
      4       36.410000       39.737097 
      4       36.410000       39.426846 
      4       36.590000       39.426846 
      4       36.850000       39.351166 
      4       37.250000       39.508334 
      4       37.980000       39.769187 
      4       38.580000       39.769187 
      4       39.550000       39.977024 
      4       40.210000       40.061820 
      5       40.850000       39.971624 
      5       41.120000       39.764733 
      5       41.290000       39.628823 
      5       41.700000       39.628823 
      5       41.890000       39.552145 
      5       41.850000       39.393466 
      5       41.870000       39.267515 
      5       41.790000       39.243690 
      5       41.800000       39.263842 
      5       41.740000       39.305069 
      5       41.670000       39.326980 
      5       41.730000       39.324322 
      5       41.510000       39.324322 
      5       41.110000       39.290230 
      5       40.640000       39.273257 
      6       40.310000       39.289784 
      6       39.720000       39.255262 
      6       39.520000       39.214109 
      6       39.220000       39.214109 
      6       39.360000       39.249876 
      6       39.200000       39.249876 
      6       39.400000       39.265587 
      6       39.530000       39.233377 
      6       39.890000       39.266490 
      6       40.140000       39.266490 
      6       40.230000       39.266490 
      6       40.350000       39.266490 
      6       40.330000       39.324752 
      6       40.600000       39.355704 
      6       40.610000       39.364217 
      7       40.630000       39.309954 
      7       40.570000       39.266104 
      7       40.520000       39.308169 
      7       40.230000       39.342204 
      7       39.950000       39.342204 
      7       39.700000       39.254403 
      7       39.480000       39.151763 
      7       39.400000       39.177785 
      7       39.510000       39.177785 
      7       39.570000       39.262845 
      7       39.710000       39.292967 
      7       39.890000       39.292967 
      7       40.110000       39.263292 
      7       40.160000       39.246832 
      7       40.310000       39.246832 
      8       40.260000       39.264205 
      8       40.160000       39.304665 
      8       40.230000       39.322454 
      8       40.260000       39.322454 
      8       40.290000       39.310494 
      8       40.220000       39.310494 
      8       40.280000       39.293802 
      8       40.160000       39.310977 
      8       40.300000       39.329196 
      8       40.170000       39.329196 
      8       40.190000       39.329196 
      8       40.310000       39.345502 
      8       40.210000       39.382076 
      8       40.260000       39.414479 
      8       39.870000       39.414479 
      9       39.820000       39.414479 
      9       39.780000       39.376274 
      9       39.710000       39.376274 
      9       39.740000       39.376274 
      9       39.780000       39.316766 
      9       39.740000       39.316766 
      9       39.780000       39.275017 
      9       39.780000       39.284482 
      9       39.710000       39.295613 
      9       39.710000       39.273714 
      9       39.760000       39.290284 
      9       39.890000       39.290284 
      9       40.040000       39.325652 
      9       40.210000       39.343177 
      9       40.300000       39.377659 
      10       40.310000       39.383444 
      10       40.300000       39.313595 
      10       40.170000       39.250363 
      10       40.230000       39.236504 
      10       40.270000       39.234206 
      10       40.090000       39.234206 
      10       40.220000       39.241004 
      10       40.140000       39.263749 
      10       40.230000       39.263749 
      10       40.160000       39.263749 
      10       40.150000       39.304638 
      10       40.200000       39.304638 
      10       40.170000       39.321998 
      10       40.170000       39.304651 
      10       39.790000       39.304651 
      11       39.790000       39.304651 
      11       39.670000       39.264192 
      11       39.720000       39.246402 
      11       39.650000       39.246402 
      11       39.790000       39.258363 
      11       39.720000       39.258363 
      11       39.800000       39.258363 
      11       39.780000       39.275056 
      11       39.750000       39.257933 
      11       39.780000       39.241433 
      11       39.770000       39.244977 
      11       40.030000       39.284428 
      11       39.920000       39.323866 
      11       40.220000       39.326993 
      11       40.200000       39.326993 
      11       40.200000       39.326993 
      12       40.120000       39.326993 
      12       40.180000       39.305941 
      12       40.150000       39.274130 
      12       40.140000       39.284428 
      12       40.130000       39.284428 
      12       40.120000       39.294726 
      12       40.240000       39.262889 
      12       40.070000       39.240977 
      12       40.190000       39.234192 
      12       40.120000       39.236034 
      12       40.110000       39.244091 
      12       40.140000       39.244091 
      12       40.090000       39.279029 
      12       40.100000       39.279029 
      12       40.120000       39.300125 
      13       40.150000       39.292915 
      13       40.090000       39.310467 
      13       40.170000       39.322481 
      13       40.120000       39.305524 
      13       40.140000       39.274090 
      13       39.780000       39.283542 
      13       39.670000       39.283942 
      13       39.620000       39.283942 
      13       39.650000       39.214938 
      13       39.630000       39.166601 
      13       39.620000       39.210412 
      13       39.700000       39.210412 
      13       39.720000       39.210412 
      13       39.790000       39.269670 
      13       39.780000       39.281701 
      14       39.990000       39.287156 
      14       39.770000       39.299200 
      14       39.960000       39.299200 
      14       40.080000       39.358901 
      14       40.130000       39.408072 
      14       40.120000       39.382642 
      14       40.010000       39.338665 
      14       40.040000       39.338665 
      14       40.100000       39.306868 
      14       40.020000       39.274614 
      14       40.020000       39.290271 
      14       40.120000       39.290271 
      14       40.040000       39.324323 
      14       39.990000       39.327007 
      14       40.120000       39.327007 
      15       40.070000       39.327007 
      15       40.050000       39.327007 
      15       40.110000       39.305941 
      15       40.070000       39.274130 
      15       40.050000       39.284428 
      15       40.060000       39.284428 
      15       40.080000       39.284428 
      15       40.000000       39.294740 
      15       40.050000       39.294740 
      15       40.020000       39.263332 
      15       40.020000       39.246389 
      15       39.990000       39.246389 
      15       40.120000       39.246389 
      15       39.970000       39.246389 
      15       40.060000       39.258819 
      15       40.050000       39.280911 
      16       40.050000       39.287959 
      16       40.060000       39.287959 
      16       40.090000       39.287959 
      16       40.070000       39.310467 
      16       40.050000       39.310467 
      16       40.150000       39.310467 
      16       39.990000       39.327410 
      16       40.030000       39.323879 
      16       40.030000       39.284428 
      16       40.050000       39.244977 
      16       39.980000       39.244977 
      16       40.040000       39.241433 
      16       40.100000       39.241433 
      16       40.030000       39.257933 
      16       40.000000       39.275042 
      17       40.010000       39.257906 
      17       40.070000       39.240560 
      17       40.110000       39.240560 
      17       39.910000       39.234609 
      17       40.060000       39.234609 
      17       39.960000       39.240990 
      17       40.060000       39.262876 
      17       39.990000       39.294270 
      17       40.090000       39.278573 
      17       40.030000       39.244077 
      17       39.960000       39.236021 
      17       40.090000       39.233736 
      17       39.910000       39.235148 
      17       40.080000       39.235148 
      17       39.970000       39.235148 
      18       40.070000       39.235148 
      18       39.930000       39.235148 
      18       40.010000       39.233736 
      18       40.030000       39.236021 
      18       40.040000       39.244078 
      18       40.060000       39.278599 
      18       40.000000       39.295157 
      18       40.050000       39.295157 
      18       39.990000       39.295157 
      18       40.010000       39.273727 
      18       40.020000       39.291130 
      18       40.040000       39.291130 
      18       40.010000       39.335120 
      18       40.010000       39.335120 
      18       40.020000       39.375375 
      19       39.980000       39.384883 
      19       39.960000       39.313056 
      19       39.990000       39.263056 
      19       40.070000       39.263056 
      19       40.030000       39.289302 
      19       39.940000       39.345003 
      19       40.030000       39.351178 
      19       40.030000       39.351178 
      19       39.940000       39.329721 
      19       40.020000       39.290687 
      19       39.950000       39.290687 
      19       40.030000       39.273714 
      19       39.940000       39.295157 
      19       39.950000       39.278613 
      19       40.010000       39.278613 
      20       40.030000       39.278613 
      20       39.970000       39.244534 
      20       40.000000       39.241876 
      20       40.040000       39.263788 
      20       39.940000       39.305068 
      20       39.940000       39.305068 
      20       39.950000       39.326980 
      20       39.990000       39.326980 
      20       40.030000       39.324323 
      20       39.950000       39.324323 
      20       39.930000       39.290271 
      20       40.030000       39.274587 
      20       39.970000       39.305954 
      20       40.020000       39.305954 
      20       40.010000       39.326967 
      20       39.970000       39.326967 
      21       39.990000       39.322993 
      21       39.950000       39.274073 
      21       40.040000       39.201982 
      21       40.080000       39.185855 
      21       39.950000       39.249889 
      21       40.000000       39.294270 
      21       39.970000       39.291585 
      21       40.040000       39.300085 
      21       40.010000       39.300085 
      21       39.990000       39.300085 
      21       39.910000       39.279042 
      21       40.090000       39.244534 
      21       39.910000       39.241433 
      21       40.020000       39.241433 
      21       39.980000       39.241433 
      22       39.970000       39.258389 
      22       39.970000       39.280871 
      22       39.920000       39.287086 
      22       39.970000       39.300112 
      22       40.000000       39.284428 
      22       39.980000       39.268745 
      22       39.990000       39.268745 
      22       40.010000       39.281771 
      22       39.960000       39.287972 
      22       39.960000       39.287972 
      22       40.010000       39.310051 
      22       39.950000       39.322897 
      22       40.010000       39.310481 
      22       39.970000       39.310481 
      22       40.030000       39.310481 
      23       39.950000       39.310481 
      23       39.930000       39.292955 
      23       40.010000       39.292955 
      23       39.860000       39.301495 
      23       40.020000       39.296543 
      23       39.950000       39.332449 
      23       39.980000       39.332449 
      23       39.960000       39.332449 
      23       40.000000       39.423326 
      23       39.910000       39.406782 
      23       39.960000       39.303297 
      23       40.010000       39.303297 
      23       39.930000       39.303297 
      23       39.960000       39.248579 
      23       39.970000       39.245044 
      24       39.960000       39.279499 
      24       39.990000       39.305498 
      24       40.020000       39.305498 
      24       39.990000       39.316252 
      24       40.000000       39.316252 
      24       40.020000       39.340423 
      24       39.940000       39.308182 
      24       40.000000       39.308182 
      24       39.950000       39.268315 
      24       39.990000       39.253048 
      24       39.930000       39.253048 
      24       39.950000       39.253048 
      24       39.980000       39.228850 
      24       39.970000       39.228850 
      24       39.950000       39.228850 
      25       39.940000       39.228850 
      25       39.930000       39.264745 
      25       39.970000       39.308582 
      25       40.030000       39.284428 
      25       39.870000       39.260262 
      25       39.980000       39.303683 
      25       39.970000       39.335077 
      25       39.920000       39.335077 
      25       39.960000       39.297871 
      25       40.010000       39.294797 
      25       39.970000       39.315297 
      25       39.930000       39.294797 
      25       40.000000       39.297871 
      25       39.930000       39.335051 
      25       39.970000       39.302823 
      26       39.960000       39.250363 
      26       39.920000       39.247262 
      26       39.930000       39.247262 
      26       39.920000       39.282184 
      26       39.940000       39.316279 
      26       39.940000       39.316279 
      26       39.930000       39.316279 
      26       39.960000       39.298744 
      26       39.930000       39.298744 
      26       40.000000       39.298744 
      26       39.930000       39.323950 
      26       40.020000       39.378932 
      26       39.940000       39.353516 
      26       40.030000       39.304183 
      26       39.980000       39.304183 
      27       39.910000       39.312683 
      27       40.010000       39.338248 
      27       39.950000       39.372274 
      27       40.040000       39.364204 
      27       40.030000       39.364204 
      27       39.940000       39.364204 
      27       39.960000       39.364204 
      27       40.050000       39.292955 
      27       39.960000       39.292955 
      27       40.010000       39.292955 
      27       39.980000       39.292955 
      27       40.090000       39.247719 
      27       39.920000       39.247719 
      27       40.050000       39.247719 
      27       40.010000       39.247719 
      28       40.000000       39.245421 
      28       40.110000       39.283582 
      28       40.030000       39.313954 
      28       40.040000       39.313954 
      28       39.920000       39.289371 
      28       40.030000       39.273674 
      28       39.990000       39.273674 
      28       40.090000       39.295156 
      28       40.100000       39.278600 
      28       40.070000       39.244104 
      28       40.060000       39.236907 
      28       40.070000       39.244534 
      28       40.040000       39.283542 
      28       40.010000       39.313524 
      28       40.030000       39.284428 
      28       40.040000       39.255306 
      29       40.000000       39.284428 
      29       40.020000       39.313551 
      29       40.070000       39.284429 
      29       40.110000       39.255332 
      29       39.980000       39.285301 
      29       40.000000       39.285301 
      29       40.020000       39.323893 
      29       39.970000       39.323893 
      29       40.000000       39.323893 
      29       40.000000       39.326967 
      29       40.030000       39.326967 
      29       40.020000       39.305068 
      29       39.980000       39.305068 
      29       39.980000       39.305068 
      29       39.990000       39.263788 
      30       40.030000       39.241877 
      30       39.970000       39.241877 
      30       39.990000       39.244548 
      30       39.990000       39.279043 
      30       40.010000       39.300125 
      30       39.970000       39.300125 
      30       39.990000       39.292915 
      30       39.960000       39.310467 
      30       39.960000       39.322454 
      30       40.000000       39.304665 
      30       40.050000       39.264192 
      30       39.930000       39.264192 
      30       40.030000       39.264192 
      30       40.010000       39.246403 
      30       40.040000       39.246403 
      31       39.980000       39.258403 
      31       40.020000       39.276385 
      31       40.000000       39.274131 
      31       39.980000       39.314051 
      31       40.010000       39.365533 
      31       39.980000       39.367401 
      31       40.020000       39.383931 
      31       39.960000       39.394256 
      31       39.950000       39.394256 
      31       40.040000       39.394256 
      31       40.010000       39.357060 
      31       40.000000       39.311810 
      31       39.990000       39.275017 
      31       39.980000       39.289411 
      31       40.060000       39.313994 
      32       39.990000       39.284872 
      32       40.010000       39.284872 
      32       40.010000       39.260275 
      32       39.990000       39.260275 
      32       39.950000       39.260275 
      32       39.940000       39.260275 
      32       40.000000       39.260275 
      32       39.950000       39.260275 
      32       39.890000       39.303683 
      32       40.100000       39.335077 
      32       39.930000       39.297871 
      32       40.030000       39.297871 
      32       40.070000       39.294770 
      32       39.980000       39.314424 
      32       39.970000       39.314424 
      33       39.960000       39.314424 
      33       40.020000       39.314424 
      33       39.950000       39.314424 
      33       40.050000       39.284442 
      33       39.940000       39.284442 
      33       40.000000       39.254889 
      33       39.940000       39.279902 
      33       39.970000       39.299696 
      33       40.010000       39.287073 
      33       39.980000       39.280871 
      33       39.970000       39.258389 
      33       39.950000       39.258389 
      33       39.960000       39.258389 
      33       39.970000       39.241420 
      33       40.000000       39.241420 
      33       39.990000       39.244064 
      34       39.930000       39.244064 
      34       39.940000       39.244064 
      34       39.880000       39.272757 
      34       40.130000       39.265104 
      34       39.880000       39.265104 
      34       39.810000       39.203753 
      34       40.100000       39.196113 
      34       40.040000       39.225249 
      34       40.210000       39.233306 
      34       40.110000       39.240950 
      34       40.110000       39.262888 
      34       40.260000       39.262888 
      34       40.180000       39.294713 
      34       40.200000       39.283985 
      34       40.170000       39.283985 
      35       40.260000       39.268731 
      35       40.110000       39.281744 
      35       40.220000       39.281744 
      35       40.110000       39.287099 
      35       40.160000       39.299669 
      35       40.180000       39.299669 
      35       40.130000       39.279016 
      35       40.160000       39.244091 
      35       40.150000       39.236034 
      35       40.190000       39.234179 
      35       40.140000       39.234179 
      35       40.170000       39.240547 
      35       40.160000       39.240547 
      35       40.220000       39.257906 
      35       40.190000       39.275042 
      36       40.200000       39.257906 
      36       39.870000       39.240547 
      36       39.590000       39.240547 
      36       39.540000       39.240547 
      36       39.300000       39.234192 
      36       39.440000       39.234192 
      36       39.430000       39.236477 
      36       39.670000       39.236477 
      36       39.720000       39.249477 
      36       39.880000       39.302770 
      36       40.080000       39.302770 
      36       40.020000       39.302770 
      36       40.060000       39.334191 
      36       40.000000       39.287972 
      36       39.990000       39.287972 
      37       39.960000       39.287972 
      37       39.920000       39.287972 
      37       39.970000       39.287972 
      37       40.040000       39.257604 
      37       39.930000       39.257604 
      37       40.010000       39.257604 
      37       39.960000       39.287972 
      37       40.000000       39.334191 
      37       39.970000       39.302770 
      37       39.980000       39.249477 
      37       39.980000       39.249477 
      37       39.920000       39.249477 
      37       40.000000       39.249477 
      37       39.920000       39.236477 
      37       39.920000       39.234206 
      37       40.040000       39.234206 
      38       39.960000       39.234206 
      38       39.970000       39.240977 
      38       39.940000       39.262876 
      38       39.920000       39.262876 
      38       39.960000       39.294310 
      38       39.930000       39.279889 
      38       39.950000       39.279889 
      38       40.030000       39.259845 
      38       39.990000       39.303643 
      38       40.220000       39.334191 
      38       40.230000       39.287100 
      38       40.300000       39.247262 
      38       40.190000       39.245434 
      38       40.130000       39.284455 
      38       40.050000       39.324323 
      39       40.090000       39.332822 
      39       40.140000       39.335094 
      39       40.090000       39.332822 
      39       40.080000       39.332822 
      39       40.060000       39.332822 
      39       40.090000       39.324323 
      39       40.130000       39.284428 
      39       40.080000       39.244534 
      39       40.040000       39.236035 
      39       40.130000       39.233776 
      39       40.120000       39.236464 
      39       40.050000       39.249504 
      39       40.040000       39.303683 
      39       40.140000       39.303683 
      39       40.050000       39.345848 
      40       40.100000       39.346265 
      40       40.030000       39.374558 
      40       39.990000       39.362778 
      40       40.110000       39.293924 
      40       40.120000       39.240022 
      40       40.180000       39.240022 
      40       40.000000       39.240022 
      40       40.060000       39.212750 
      40       39.830000       39.212750 
      40       39.850000       39.204640 
      40       39.780000       39.259345 
      40       39.840000       39.259345 
      40       39.850000       39.259345 
      40       39.890000       39.308125 
      40       39.820000       39.308125 
      41       39.850000       39.308125 
      41       39.910000       39.283972 
      41       39.820000       39.283972 
      41       39.920000       39.283972 
      41       39.820000       39.254863 
      41       39.890000       39.254863 
      41       39.910000       39.279486 
      41       39.830000       39.295183 
      41       39.860000       39.273674 
      41       39.900000       39.273674 
      41       39.840000       39.289371 
      41       39.810000       39.289371 
      41       39.910000       39.313954 
      41       39.880000       39.283555 
      41       40.000000       39.244494 
      42       39.880000       39.235577 
      42       40.060000       39.235577 
      42       39.970000       39.227907 
      42       40.190000       39.227907 
      42       40.300000       39.205982 
      42       40.270000       39.205982 
      42       40.170000       39.174587 
      42       40.180000       39.190311 
      42       40.130000       39.190311 
      42       40.200000       39.225666 
      42       40.020000       39.225666 
      42       40.280000       39.225666 
      42       40.060000       39.243634 
      42       40.140000       39.243634 
      43       40.070000       39.243634 
      43       40.170000       39.283515 
      43       40.060000       39.283515 
      43       40.090000       39.283515 
      43       40.160000       39.313497 
      43       40.010000       39.313497 
      43       40.070000       39.313497 
      43       40.080000       39.313497 
      43       40.070000       39.283542 
      43       40.080000       39.244507 
      43       40.130000       39.236034 
      43       40.090000       39.233736 
      43       40.200000       39.235148 
      43       40.090000       39.235148 
      43       40.060000       39.235148 
      44       39.770000       39.235148 
      44       39.890000       39.233709 
      44       39.590000       39.235148 
      44       39.510000       39.235148 
      44       39.540000       39.235148 
      44       39.560000       39.233709 
      44       39.760000       39.235148 
      44       39.910000       39.233709 
      44       39.990000       39.235148 
      44       40.000000       39.233736 
      44       39.980000       39.236021 
      44       39.960000       39.244077 
      44       40.040000       39.278573 
      44       39.930000       39.294270 
      44       40.000000       39.262875 
      45       39.900000       39.262875 
      45       39.980000       39.262875 
      45       39.970000       39.240977 
      45       39.950000       39.240977 
      45       39.870000       39.240977 
      45       39.930000       39.234166 
      45       39.860000       39.235174 
      45       39.980000       39.235174 
      45       39.850000       39.235174 
      45       39.960000       39.235174 
      45       39.860000       39.235174 
      45       39.970000       39.235174 
      45       39.980000       39.234152 
      45       40.120000       39.240547 
      45       40.170000       39.257906 
      45       40.260000       39.275055 
      46       40.080000       39.258363 
      46       40.010000       39.246376 
      46       40.060000       39.263319 
      46       40.040000       39.294283 
      46       40.030000       39.278573 
      46       40.050000       39.278573 
      46       40.030000       39.244104 
      46       40.030000       39.236894 
      46       40.060000       39.236894 
      46       40.000000       39.236894 
      46       39.990000       39.236894 
      46       39.990000       39.244077 
      46       40.020000       39.277687 
      46       40.030000       39.277687 
      46       40.000000       39.283485 
      47       40.040000       39.214938 
      47       40.030000       39.214938 
      47       40.010000       39.214938 
      47       39.990000       39.167017 
      47       40.070000       39.214965 
      47       39.970000       39.284385 
      47       40.000000       39.284385 
      47       40.050000       39.284385 
      47       39.990000       39.284385 
      47       40.010000       39.288914 
      47       40.040000       39.297414 
      47       39.970000       39.335064 
      47       40.020000       39.303683 
      47       40.090000       39.260302 
      47       40.030000       39.285744 
      48       40.030000       39.285744 
      48       40.050000       39.285744 
      48       40.030000       39.285744 
      48       40.040000       39.285744 
      48       40.040000       39.324336 
      48       39.980000       39.331936 
      48       40.070000       39.324296 
      48       40.030000       39.324296 
      48       40.040000       39.324296 
      48       40.000000       39.284428 
      48       40.020000       39.284428 
      48       40.030000       39.284428 
      48       39.950000       39.244534 
      48       39.980000       39.244534 
      48       40.000000       39.236035 
      49       40.020000       39.236035 
      49       40.000000       39.233790 
      49       40.050000       39.236934 
      49       40.020000       39.236934 
      49       40.000000       39.236934 
      49       40.030000       39.255749 
      49       40.000000       39.255749 
      49       40.000000       39.255749 
      49       40.030000       39.337335 
      49       39.970000       39.417483 
      49       40.000000       39.417483 
      49       40.010000       39.371830 
      49       39.970000       39.279503 
      49       40.040000       39.279503 
      49       39.970000       39.279503 
      49       40.030000       39.279503 
      50       40.020000       39.242319 
      50       39.970000       39.242319 
      50       40.040000       39.234206 
      50       40.050000       39.234206 
      50       40.050000       39.235162 
      50       39.980000       39.233709 
      50       40.040000       39.235161 
      50       40.020000       39.234166 
      50       39.990000       39.234166 
      50       39.990000       39.240976 
      50       39.960000       39.262849 
      50       39.990000       39.262849 
      50       40.010000       39.293384 
      50       40.030000       39.267801 
      50       40.000000       39.267801 
      51       39.990000       39.196583 
      51       39.960000       39.167460 
      51       40.010000       39.238705 
      51       40.030000       39.323393 
      51       39.950000       39.323393 
      51       40.010000       39.323393 
      51       39.970000       39.302770 
      51       39.990000       39.260275 
      51       39.930000       39.285744 
      51       40.100000       39.324336 
      51       40.040000       39.324336 
      51       39.970000       39.331936 
      51       39.990000       39.331936 
      51       39.990000       39.324296 
      51       40.010000       39.324296 
      52       40.040000       39.284428 
      52       39.940000       39.244534 
      52       39.960000       39.236034 
      52       40.030000       39.233763 
      52       39.920000       39.233763 
      52       40.050000       39.236021 
      52       40.050000       39.236021 
      52       39.990000       39.244077 
      52       40.010000       39.278573 
      52       39.960000       39.278573 
      52       39.960000       39.278573 
      52       40.040000       39.294270 
      52       39.980000       39.262902 
      52       39.940000       39.241850 
      52       40.130000       39.241850 
      53       39.960000       39.244534 
      53       40.000000       39.244534 
      53       39.990000       39.244534 
      53       39.990000       39.278573 
      53       40.030000       39.293840 
      53       39.990000       39.257920 
      53       40.070000       39.222192 
      53       39.920000       39.218925 
      53       40.010000       39.218925 
      53       39.990000       39.256687 
      53       40.020000       39.256687 
      53       39.960000       39.281674 
      53       39.960000       39.281674 
      53       39.980000       39.281674 
      53       39.970000       39.299253 
      54       40.000000       39.279916 
      54       39.920000       39.255788 
      54       40.060000       39.295643 
      54       39.980000       39.366901 
      54       40.020000       39.366901 
      54       39.960000       39.383015 
      54       39.990000       39.383015 
      54       40.040000       39.383015 
      54       39.940000       39.319423 
      54       40.000000       39.319423 
      54       40.020000       39.319423 
      54       39.990000       39.319423 
      54       39.960000       39.280389 
      54       40.000000       39.280389 
      54       39.980000       39.280389 
      55       39.960000       39.305525 
      55       40.020000       39.305525 
      55       40.050000       39.316209 
      55       40.020000       39.275472 
      55       39.990000       39.204626 
      55       39.930000       39.196140 
      55       39.970000       39.225236 
      55       40.000000       39.232850 
      55       39.990000       39.235121 
      55       39.940000       39.235121 
      55       40.010000       39.235121 
      55       39.940000       39.233709 
      55       39.990000       39.235148 
      55       40.020000       39.235148 
      55       40.030000       39.233709 
      56       39.990000       39.235148 
      56       39.970000       39.233709 
      56       40.030000       39.235161 
      56       39.930000       39.234166 
      56       40.000000       39.241017 
      56       40.000000       39.264205 
      56       39.960000       39.264205 
      56       39.960000       39.264205 
      56       39.990000       39.310467 
      56       40.020000       39.351164 
      56       40.020000       39.351164 
      56       39.970000       39.363800 
      56       39.940000       39.363800 
      56       40.040000       39.309928 
      56       39.980000       39.309928 
      56       39.940000       39.265701 
      57       40.000000       39.304126 
      57       40.000000       39.335077 
      57       40.030000       39.335077 
      57       39.930000       39.335077 
      57       39.970000       39.335077 
      57       39.970000       39.297455 
      57       40.030000       39.290244 
      57       39.980000       39.290244 
      57       39.980000       39.290244 
      57       39.970000       39.300568 
      57       39.950000       39.287099 
      57       39.990000       39.280871 
      57       40.000000       39.280871 
      57       39.980000       39.258363 
      57       40.030000       39.240574 
      57       40.020000       39.234596 
      58       40.010000       39.234596 
      58       39.960000       39.240574 
      58       39.940000       39.240574 
      58       39.980000       39.240574 
      58       40.030000       39.258363 
      58       39.980000       39.280871 
      58       40.040000       39.280871 
      58       40.000000       39.287086 
      58       39.980000       39.300112 
      58       39.960000       39.284415 
      58       39.970000       39.284415 
      58       39.900000       39.268314 
      58       40.040000       39.276788 
      58       39.940000       39.268301 
      58       40.080000       39.283972 
      59       40.050000       39.294713 
      59       40.210000       39.262889 
      59       39.920000       39.240977 
      59       39.880000       39.240977 
      59       39.960000       39.240977 
      59       39.920000       39.234166 
      59       40.100000       39.235161 
      59       40.180000       39.235161 
      59       40.220000       39.235161 
      59       39.910000       39.233709 
      59       39.930000       39.233709 
      59       39.930000       39.235161 
      59       39.940000       39.234152 
      59       39.920000       39.234152 
      59       39.920000       39.240547 
      60       39.930000       39.257906 
      60       39.990000       39.257906 
      60       39.890000       39.257906 
      60       39.930000       39.275055 
      60       39.960000       39.275055 
      60       40.080000       39.258350 
      60       40.040000       39.258350 
      60       40.100000       39.258350 
      60       40.050000       39.245959 
      60       39.920000       39.258806 
      60       39.910000       39.258806 
      60       39.990000       39.280911 
      60       39.950000       39.280911 
      60       40.000000       39.287959 
      60       40.170000       39.310467 
      61       40.140000       39.310467 
