

 time    ||    gripping force   ||   raspberry measurement 

      0       0.050000       -802.600000 
      0       0.060000       -802.600000 
      0       0.070000       -802.600000 
      0       0.050000       -802.600000 
      0       0.050000       -802.600000 
      0       0.110000       -802.600000 
      0       0.060000       -802.600000 
      0       0.090000       -802.600000 
      0       0.040000       -802.600000 
      0       0.070000       -802.600000 
      0       0.140000       -802.600000 
      0       0.100000       -802.600000 
      0       0.700000       -802.600000 
      0       0.150000       -802.600000 
      0       0.290000       -802.599995 
      0       0.110000       -802.598803 
      0       0.200000       -802.491471 
      0       0.070000       -802.491471 
      0       0.200000       -798.937115 
      0       0.160000       -755.635930 
      0       0.030000       -561.570440 
      1       0.090000       -561.570440 
      1       0.040000       -561.570440 
      1       0.210000       -561.570440 
      1       0.170000       -241.599503 
      1       0.080000       -241.599503 
      1       0.080000       -241.599503 
      1       0.380000       -241.599503 
      1       0.280000       -47.518316 
      1       0.370000       -47.518316 
      1       0.560000       -4.214030 
      1       0.490000       -4.214030 
      1       0.540000       -0.657819 
      1       0.720000       -0.551912 
      1       0.780000       -0.549281 
      1       18.260000       -0.549281 
      2       31.170000       -0.550715 
      2       56.590000       -0.549277 
      2       75.210000       -0.550715 
      2       92.170000       -0.549277 
      2       98.070000       -0.550715 
      2       97.680000       -0.549277 
      2       95.470000       -0.550715 
      2       104.790000       -0.549277 
      2       111.040000       -0.549277 
      2       110.730000       -0.549277 
      2       110.370000       -0.549277 
      2       109.600000       -0.549277 
      2       107.600000       -0.549277 
      2       101.260000       -0.549277 
      2       88.610000       -0.550715 
      2       69.530000       -0.549276 
      2       48.610000       -0.550687 
      2       36.960000       -0.548268 
      3       30.180000       -0.535752 
      3       26.900000       -0.535752 
      3       27.190000       -0.446299 
      3       27.550000       -0.175160 
      3       27.930000       0.273606 
      3       28.180000       0.723619 
      3       28.580000       1.077799 
      3       29.630000       1.260303 
      3       30.530000       1.300711 
      3       31.530000       1.300711 
      3       32.670000       1.324094 
      3       33.860000       1.318151 
      3       35.430000       1.200292 
      3       35.760000       1.200292 
      3       35.790000       0.911966 
      4       35.790000       0.575905 
      4       35.760000       0.309514 
      4       35.650000       0.309514 
      4       35.450000       0.101568 
      4       35.240000       -0.001586 
      4       34.610000       -0.001586 
      4       33.750000       0.052968 
      4       33.150000       0.052968 
      4       32.710000       0.128228 
      4       32.300000       0.135828 
      4       31.940000       0.091478 
      4       31.430000       0.021129 
      4       30.950000       0.023427 
      4       30.620000       0.100878 
      4       30.510000       0.186990 
      5       30.570000       0.222788 
      5       30.440000       0.175780 
      5       30.330000       0.175780 
      5       30.190000       0.175780 
      5       29.740000       0.131014 
      5       29.530000       0.176694 
      5       29.130000       0.234526 
      5       28.680000       0.247929 
      5       28.340000       0.249783 
      5       28.120000       0.238029 
      5       28.010000       0.196447 
      5       28.060000       0.138557 
      5       28.060000       0.121558 
      5       28.070000       0.095089 
      5       28.160000       0.060593 
      6       28.200000       0.063269 
      6       28.190000       0.108114 
      6       28.240000       0.175253 
      6       28.150000       0.173980 
      6       28.330000       0.155971 
      6       28.290000       0.155971 
      6       28.240000       0.146612 
      6       28.280000       0.046584 
      6       28.310000       -0.056336 
      6       28.520000       -0.106708 
      6       29.020000       -0.077486 
      6       29.250000       0.017017 
      6       29.660000       0.076134 
      6       29.980000       -0.008106 
      6       30.200000       -0.114653 
      7       30.340000       -0.052043 
      7       30.620000       0.020171 
      7       30.690000       0.004017 
      7       30.690000       -0.011206 
      7       30.750000       -0.060087 
      7       30.860000       -0.053679 
      7       30.880000       0.012008 
      7       30.950000       0.051608 
      7       31.030000       0.076998 
      7       30.960000       0.030955 
      7       31.000000       -0.076227 
      7       31.000000       -0.104327 
      7       31.000000       -0.104327 
      7       30.920000       -0.070414 
      7       31.010000       -0.070414 
      7       30.940000       -0.003472 
      8       31.000000       0.049702 
      8       30.940000       0.049702 
      8       30.920000       0.109445 
      8       30.960000       0.109445 
      8       30.990000       0.182383 
      8       30.900000       0.197260 
      8       30.870000       0.118762 
      8       30.710000       0.118762 
      8       30.660000       0.022070 
      8       30.530000       -0.013906 
      8       30.500000       -0.003016 
      8       30.350000       -0.000950 
      8       30.180000       0.012698 
      8       30.160000       0.053285 
      8       29.920000       0.117529 
      9       29.790000       0.150586 
      9       29.570000       0.150586 
      9       29.410000       0.178879 
      9       29.230000       0.178879 
      9       29.230000       0.178879 
      9       29.210000       0.134473 
      9       29.240000       0.044009 
      9       29.270000       0.009918 
      9       29.370000       0.009918 
      9       29.460000       0.014803 
      9       29.600000       0.068219 
      9       29.600000       0.088204 
      9       29.660000       0.014267 
      9       29.780000       -0.027194 
      9       29.920000       -0.002958 
      10       30.020000       -0.044668 
      10       30.270000       -0.059185 
      10       30.250000       0.030441 
      10       30.350000       0.074139 
      10       30.380000       0.047214 
      10       30.460000       0.078261 
      10       30.480000       0.078261 
      10       30.460000       0.115133 
      10       30.480000       0.065690 
      10       30.490000       -0.002855 
      10       30.480000       0.002901 
      10       30.420000       0.035733 
      10       30.440000       0.038019 
      10       30.390000       0.017196 
      10       30.370000       0.017196 
      11       30.300000       -0.009961 
      11       30.180000       0.014914 
      11       29.850000       0.032555 
      11       29.730000       0.016702 
      11       29.590000       0.061335 
      11       29.570000       0.081963 
      11       29.570000       0.068835 
      11       29.550000       0.044097 
      11       29.580000       0.044097 
      11       29.560000       -0.034814 
      11       29.660000       -0.035286 
      11       29.580000       -0.035286 
      11       29.730000       -0.035286 
      11       29.790000       0.097612 
      11       29.720000       0.182326 
      11       29.710000       0.165431 
      12       29.890000       0.144224 
      12       30.060000       0.144224 
      12       30.170000       0.144628 
      12       30.210000       0.167054 
      12       30.270000       0.142813 
      12       30.380000       0.068508 
      12       30.420000       0.068508 
      12       30.360000       0.028475 
      12       30.320000       -0.029710 
      12       30.360000       -0.098798 
      12       30.310000       -0.120215 
      12       30.280000       -0.054946 
      12       30.310000       0.047098 
      12       30.340000       0.190452 
      12       30.320000       0.271459 
      13       30.270000       0.247915 
      13       30.220000       0.199788 
      13       30.110000       0.199788 
      13       29.850000       0.135583 
      13       29.700000       0.040271 
      13       29.470000       -0.074671 
      13       29.570000       -0.095644 
      13       29.580000       -0.095644 
      13       29.540000       -0.095644 
      13       29.550000       -0.095644 
      13       29.690000       -0.019275 
      13       29.690000       0.075791 
      13       29.860000       0.075791 
      13       30.030000       0.103073 
      13       30.150000       0.059794 
      14       30.200000       0.059794 
      14       30.180000       0.059794 
      14       30.130000       0.054920 
      14       30.170000       0.064362 
      14       30.090000       0.064851 
      14       30.190000       0.028425 
      14       30.200000       -0.040807 
      14       30.190000       -0.079660 
      14       30.150000       -0.079660 
      14       30.140000       -0.079660 
      14       30.180000       -0.034340 
      14       30.110000       -0.011522 
      14       30.190000       -0.007708 
      14       30.160000       -0.025963 
      14       30.160000       -0.025963 
      15       30.090000       -0.027322 
      15       30.170000       0.037209 
      15       30.090000       0.076744 
      15       30.190000       0.076744 
      15       30.140000       0.064084 
      15       30.140000       0.064084 
      15       29.820000       0.088233 
      15       29.910000       0.090499 
      15       29.830000       0.019488 
      15       29.600000       0.031380 
      15       29.720000       0.146222 
      15       29.680000       0.146222 
      15       29.730000       0.212334 
      15       29.710000       0.176816 
      15       29.690000       0.093053 
      16       29.700000       -0.050826 
      16       29.610000       -0.142013 
      16       29.690000       -0.102604 
      16       29.780000       -0.102604 
      16       30.030000       -0.024768 
      16       30.060000       0.006959 
      16       30.180000       0.005521 
      16       30.170000       -0.023752 
      16       30.120000       -0.025736 
      16       30.190000       -0.025736 
      16       30.130000       -0.001524 
      16       30.120000       -0.019746 
      16       30.130000       0.004502 
      16       30.130000       0.048265 
      16       30.130000       -0.023136 
      17       30.170000       -0.023136 
      17       30.100000       -0.125351 
      17       30.150000       -0.125351 
      17       30.150000       -0.125351 
      17       30.140000       -0.060639 
      17       30.110000       0.072500 
      17       30.170000       0.092785 
      17       30.080000       0.092785 
      17       30.140000       0.096590 
      17       30.120000       0.110392 
      17       30.100000       0.035053 
      17       30.140000       -0.036941 
      17       30.170000       -0.051456 
      17       30.100000       -0.017040 
      17       30.110000       -0.002393 
      18       30.100000       0.037685 
      18       30.100000       0.057565 
      18       30.120000       -0.007616 
      18       30.090000       -0.068410 
      18       30.110000       -0.065398 
      18       30.090000       0.004806 
      18       30.130000       0.128658 
      18       30.110000       0.205758 
      18       30.140000       0.189615 
      18       30.090000       0.102054 
      18       30.090000       0.063771 
      18       29.900000       0.063771 
      18       29.780000       0.063771 
      18       29.630000       0.043630 
      18       29.630000       -0.014078 
      18       29.610000       -0.051153 
      19       29.670000       -0.036526 
      19       29.660000       -0.036526 
      19       29.650000       -0.036526 
      19       29.680000       0.072208 
      19       29.690000       0.139638 
      19       29.680000       0.094446 
      19       29.640000       0.072617 
      19       29.660000       0.072617 
      19       29.770000       0.088275 
      19       29.960000       0.088275 
      19       30.090000       -0.004889 
      19       30.090000       -0.113909 
      19       30.250000       -0.067152 
      19       30.390000       -0.003512 
      19       30.330000       -0.026017 
      20       30.260000       -0.008528 
      20       30.280000       0.036393 
      20       30.270000       0.028014 
      20       30.260000       0.028014 
      20       30.300000       0.028014 
      20       30.270000       0.010495 
      20       30.280000       -0.006565 
      20       30.200000       -0.052121 
      20       30.110000       -0.116869 
      20       30.000000       -0.100985 
      20       29.690000       -0.040637 
      20       29.630000       -0.036185 
      20       29.630000       -0.023379 
      20       29.600000       0.022924 
      20       29.590000       -0.030051 
      21       29.580000       -0.119319 
      21       29.560000       -0.080467 
      21       29.620000       -0.009103 
      21       29.660000       0.009216 
      21       29.720000       0.018433 
      21       29.910000       0.050644 
      21       30.060000       0.128238 
      21       30.150000       0.179291 
      21       30.290000       0.138467 
      21       30.290000       0.043047 
      21       30.340000       -0.012432 
      21       30.340000       0.030323 
      21       30.250000       0.067183 
      21       30.340000       0.000021 
      21       30.290000       0.000021 
      22       30.330000       -0.083421 
      22       30.290000       -0.062144 
      22       30.320000       -0.019013 
      22       30.330000       -0.038667 
      22       30.310000       -0.051706 
      22       30.260000       -0.010296 
      22       30.200000       0.047444 
      22       30.050000       0.070512 
      22       30.020000       -0.012758 
      22       29.740000       -0.071556 
      22       29.630000       -0.002583 
      22       29.500000       0.039140 
      22       29.530000       -0.037524 
      22       29.540000       -0.099293 
      22       29.550000       -0.036156 
      23       29.550000       0.040478 
      23       29.670000       0.040478 
      23       29.710000       -0.001623 
      23       29.690000       -0.069852 
      23       29.880000       -0.009788 
      23       30.070000       0.078232 
      23       30.130000       0.078275 
      23       30.220000       0.063858 
      23       30.260000       0.060849 
      23       30.270000       0.086140 
      23       30.240000       0.115291 
      23       30.190000       0.115291 
      23       30.210000       0.115291 
      23       30.210000       0.102254 
      23       30.240000       0.007965 
      24       30.180000       -0.064736 
      24       30.180000       -0.049164 
      24       30.210000       -0.049164 
      24       30.270000       -0.024570 
      24       30.180000       -0.012081 
      24       30.200000       -0.012081 
      24       30.110000       -0.012081 
      24       30.090000       0.029931 
      24       30.120000       0.053805 
      24       29.860000       0.016211 
      24       29.930000       -0.068434 
      24       29.780000       -0.068014 
      24       29.700000       -0.070199 
      24       29.730000       -0.070199 
      24       29.710000       -0.070199 
      24       29.670000       -0.126999 
      25       29.630000       -0.139979 
      25       29.640000       -0.068950 
      25       29.740000       -0.068950 
      25       29.760000       0.009483 
      25       29.890000       0.084709 
      25       30.020000       0.161632 
      25       30.160000       0.165170 
      25       30.100000       0.128695 
      25       30.060000       0.069933 
      25       30.050000       0.000230 
      25       30.030000       -0.082023 
      25       30.010000       -0.106843 
      25       30.070000       -0.089878 
      25       30.010000       -0.055229 
      25       30.090000       -0.051178 
      26       30.070000       -0.064357 
      26       30.070000       -0.002950 
      26       30.010000       -0.002950 
      26       30.090000       0.026788 
      26       29.980000       -0.023565 
      26       29.990000       -0.020642 
      26       30.050000       0.041148 
      26       30.060000       0.065239 
      26       30.060000       0.065239 
      26       30.060000       0.034370 
      26       30.020000       0.034370 
      26       30.000000       0.013636 
      26       30.100000       0.021011 
      26       30.040000       0.071447 
      26       30.030000       0.083025 
      27       30.060000       -0.029026 
      27       30.130000       -0.093090 
      27       30.000000       0.000084 
      27       30.100000       0.000084 
      27       30.040000       0.090597 
      27       30.040000       0.133667 
      27       30.030000       0.103816 
      27       30.080000       0.017318 
      27       30.030000       0.041483 
      27       30.040000       0.112026 
      27       30.010000       0.081184 
      27       30.050000       0.081184 
      27       30.010000       0.081184 
      27       30.010000       0.081184 
      27       30.020000       0.063599 
      28       30.030000       0.073923 
      28       30.030000       0.073923 
      28       30.050000       0.035169 
      28       30.120000       0.037865 
      28       30.060000       0.155064 
      28       30.050000       0.155064 
      28       30.040000       0.219565 
      28       30.050000       0.140711 
      28       30.030000       0.049188 
      28       30.030000       0.058466 
      28       30.040000       0.121740 
      28       30.010000       0.124920 
      28       30.080000       0.124920 
      28       30.050000       0.008271 
      28       29.980000       0.008271 
      29       30.030000       -0.124387 
      29       30.050000       -0.156528 
      29       30.070000       -0.164667 
      29       30.030000       -0.186577 
      29       30.030000       -0.150558 
      29       29.940000       -0.104242 
      29       30.090000       -0.063704 
      29       30.000000       -0.059914 
      29       30.140000       -0.059914 
      29       30.020000       -0.059914 
      29       29.980000       -0.081117 
      29       30.060000       -0.081117 
      29       30.030000       -0.037562 
      29       30.040000       0.030949 
      29       29.980000       0.054307 
      30       30.050000       0.005307 
      30       30.020000       -0.029295 
      30       30.020000       -0.073377 
      30       29.950000       -0.104136 
      30       29.970000       -0.069392 
      30       30.060000       -0.021683 
      30       29.880000       0.025566 
      30       30.070000       -0.008001 
      30       29.770000       -0.008001 
      30       29.740000       -0.069044 
      30       29.840000       -0.053785 
      30       29.680000       -0.045657 
      30       29.910000       -0.045657 
      30       29.920000       -0.027000 
      30       29.870000       0.044605 
      31       29.900000       0.086868 
      31       29.890000       0.086868 
      31       29.880000       0.064581 
      31       29.900000       -0.057468 
      31       29.960000       -0.131086 
      31       29.830000       -0.000959 
      31       29.830000       0.112382 
      31       29.920000       0.112382 
      31       29.910000       0.112382 
      31       29.840000       0.126145 
      31       29.920000       0.112266 
      31       29.860000       0.128142 
      31       29.890000       0.077901 
      31       29.870000       -0.023401 
      31       29.880000       -0.060169 
      32       29.900000       -0.105189 
      32       29.830000       -0.149387 
      32       29.860000       -0.050770 
      32       29.860000       0.039318 
      32       30.020000       0.022564 
      32       29.950000       -0.016236 
      32       30.140000       -0.016236 
      32       30.210000       -0.037867 
      32       30.240000       -0.015669 
      32       30.170000       0.023887 
      32       30.180000       0.048971 
      32       30.290000       0.048971 
      32       30.170000       0.048971 
      32       30.170000       -0.013666 
      32       30.130000       -0.115967 
      33       30.200000       -0.122757 
      33       30.230000       -0.122757 
      33       30.120000       -0.054627 
      33       30.200000       0.004576 
      33       30.130000       0.055509 
      33       30.230000       0.103303 
      33       30.140000       0.103303 
      33       30.150000       0.081042 
      33       30.120000       0.065104 
      33       30.030000       0.087118 
      33       30.090000       0.065771 
      33       30.000000       0.021740 
      33       29.990000       -0.034073 
      33       30.010000       -0.028279 
      33       30.050000       0.033110 
      34       29.900000       0.047933 
      34       30.020000       -0.014239 
      34       30.020000       -0.037570 
      34       30.010000       0.049278 
      34       30.030000       0.134432 
      34       29.970000       0.099722 
      34       30.070000       -0.002753 
      34       30.000000       -0.048529 
      34       30.000000       -0.072849 
      34       30.000000       -0.146218 
      34       30.040000       -0.131887 
      34       30.020000       -0.066775 
      34       29.920000       -0.046924 
      34       30.080000       -0.037188 
      34       29.880000       -0.069652 
      35       29.940000       -0.069652 
      35       29.770000       -0.085754 
      35       29.730000       -0.085754 
      35       29.620000       -0.006401 
      35       29.700000       0.036211 
      35       29.760000       -0.040849 
      35       29.630000       -0.040849 
      35       29.740000       -0.108303 
      35       29.530000       -0.072249 
      35       29.880000       -0.034197 
      35       29.870000       -0.046739 
      35       29.850000       -0.073826 
      35       29.930000       -0.110707 
      35       30.100000       -0.061746 
      35       30.080000       0.001484 
      35       30.160000       -0.028348 
      36       30.200000       -0.017209 
      36       30.240000       -0.017209 
      36       30.170000       0.042163 
      36       30.160000       0.069916 
      36       30.160000       0.044663 
      36       30.150000       0.048324 
      36       30.230000       0.048324 
      36       30.110000       0.017981 
      36       30.210000       -0.042376 
      36       30.150000       -0.040319 
      36       30.210000       -0.025240 
      36       30.110000       -0.033828 
      36       30.120000       -0.029556 
      36       30.190000       -0.058065 
      36       30.180000       -0.060529 
      37       30.130000       0.017590 
      37       30.060000       0.052098 
      37       30.170000       0.048890 
      37       29.960000       0.002232 
      37       29.980000       0.002232 
      37       29.710000       -0.129102 
      37       29.720000       -0.129102 
      37       29.630000       -0.150767 
      37       29.680000       -0.070530 
      37       29.690000       -0.070530 
      37       29.790000       -0.062974 
      37       29.810000       -0.062974 
      37       29.920000       -0.074002 
      37       29.810000       -0.057218 
      37       29.840000       -0.099771 
      38       29.790000       -0.101678 
      38       29.810000       -0.101678 
      38       29.810000       -0.029044 
      38       29.880000       -0.002814 
      38       29.780000       -0.045525 
      38       30.030000       -0.054240 
      38       30.010000       -0.061812 
      38       29.940000       -0.068180 
      38       30.030000       -0.040926 
      38       29.890000       0.022877 
      38       29.950000       0.022877 
      38       30.020000       0.024047 
      38       30.100000       -0.043221 
      38       30.160000       -0.074238 
      38       30.210000       -0.083282 
      38       30.170000       -0.022959 
      39       30.090000       0.051315 
      39       30.100000       0.066806 
      39       30.160000       0.066594 
      39       30.120000       0.066594 
      39       30.140000       0.053497 
      39       30.110000       0.068077 
      39       30.120000       0.078030 
      39       30.090000       0.046156 
      39       30.160000       0.028470 
      39       30.170000       0.034746 
      39       30.180000       0.034746 
      39       30.180000       0.028233 
      39       30.160000       -0.014202 
      39       30.160000       -0.003387 
      40       30.180000       0.024071 
      40       30.170000       0.024071 
      40       30.110000       0.014142 
      40       30.120000       0.014142 
      40       30.160000       0.058347 
      40       30.160000       0.069696 
      40       30.200000       -0.038726 
      40       29.990000       -0.038726 
      40       29.950000       -0.079984 
      40       29.600000       -0.079984 
      40       29.680000       0.038273 
      40       29.680000       0.038273 
      40       29.580000       0.167079 
      40       29.630000       0.220855 
      40       29.640000       0.210166 
      41       29.620000       0.210166 
      41       29.730000       0.128718 
      41       29.760000       0.100363 
      41       29.990000       0.117515 
      41       30.180000       0.029825 
      41       30.170000       -0.049830 
      41       30.170000       -0.001079 
      41       30.180000       0.107270 
      41       30.100000       0.141546 
      41       30.190000       0.067513 
      41       30.170000       0.016158 
      41       30.070000       0.007183 
      41       30.140000       -0.053269 
      41       30.150000       -0.053970 
      41       30.240000       -0.008780 
      41       30.130000       0.018110 
      42       30.180000       0.077684 
      42       30.130000       0.136449 
      42       30.160000       0.141212 
      42       30.210000       0.114638 
      42       30.150000       0.047710 
      42       30.170000       -0.006773 
      42       30.040000       -0.001044 
      42       30.010000       0.081118 
      42       29.950000       0.105456 
      42       29.960000       0.016283 
      42       29.990000       -0.026166 
      42       29.970000       0.019479 
      42       29.990000       0.019479 
      42       29.950000       0.019479 
      42       29.910000       0.057299 
      43       29.980000       0.057299 
      43       29.970000       0.062661 
      43       30.050000       0.033862 
      43       29.920000       0.055968 
      43       30.000000       0.090176 
      43       29.920000       0.054463 
      43       29.980000       -0.032824 
      43       29.950000       -0.043872 
      43       29.950000       -0.034723 
      43       30.000000       -0.034723 
      43       29.990000       -0.034723 
      43       29.960000       -0.034723 
      43       30.030000       -0.104005 
      43       29.960000       -0.240456 
      43       29.920000       -0.240456 
      44       30.030000       -0.240456 
      44       30.020000       -0.240456 
      44       30.030000       -0.240456 
      44       29.920000       -0.273590 
      44       30.020000       -0.215845 
      44       30.060000       -0.193253 
      44       29.860000       -0.094155 
      44       29.960000       -0.004948 
      44       30.030000       -0.004948 
      44       29.940000       -0.017273 
      44       29.980000       -0.024989 
      44       30.000000       0.014631 
      44       29.940000       0.090965 
      44       29.950000       0.090965 
      44       30.050000       0.116056 
      45       29.990000       0.116056 
      45       29.990000       0.116056 
      45       29.980000       0.107535 
      45       30.010000       0.095648 
      45       30.000000       0.071736 
      45       29.960000       0.029261 
      45       29.990000       -0.002550 
      45       29.930000       -0.002550 
      45       29.940000       -0.037526 
      45       29.970000       -0.037526 
      45       29.980000       -0.037526 
      45       29.960000       -0.038961 
      45       29.980000       -0.004391 
      45       29.980000       0.019581 
      45       29.950000       0.094428 
      46       29.980000       0.137269 
      46       29.960000       0.076159 
      46       30.010000       0.008769 
      46       29.950000       -0.022798 
      46       30.010000       -0.031423 
      46       29.920000       -0.031423 
      46       29.960000       -0.031423 
      46       30.000000       -0.031423 
      46       29.980000       0.018542 
      46       29.950000       0.018542 
      46       29.950000       0.052506 
      46       29.970000       0.025807 
      46       29.980000       0.004308 
      46       30.010000       -0.002066 
      46       29.920000       0.003009 
      47       29.960000       0.003009 
      47       29.930000       0.010724 
      47       29.990000       -0.006048 
      47       29.980000       -0.051418 
      47       29.950000       -0.092045 
      47       29.980000       -0.179076 
      47       30.000000       -0.194898 
      47       29.960000       -0.194898 
      47       29.950000       -0.133237 
      47       30.000000       -0.092262 
      47       29.960000       -0.055513 
      47       29.920000       -0.055513 
      47       30.010000       -0.052191 
      47       29.960000       -0.073444 
      47       30.030000       -0.028663 
      47       29.990000       0.055382 
      48       29.970000       0.145893 
      48       29.930000       0.201132 
      48       29.980000       0.242658 
      48       29.990000       0.240215 
      48       30.010000       0.130865 
      48       30.030000       0.130865 
      48       29.940000       -0.018569 
      48       30.040000       -0.065911 
      48       29.980000       -0.000929 
      48       29.960000       0.001672 
      48       29.980000       -0.051940 
      48       29.940000       -0.044416 
      48       29.980000       -0.010607 
      48       29.960000       -0.010607 
      48       29.980000       -0.001713 
      49       29.950000       -0.001713 
      49       29.990000       0.009966 
      49       29.960000       0.041207 
      49       29.950000       0.059557 
      49       29.990000       0.028237 
      49       29.940000       0.008095 
      49       30.000000       0.008095 
      49       29.990000       -0.060850 
      49       29.980000       -0.137353 
      49       29.980000       -0.137353 
      49       29.970000       -0.096988 
      49       29.930000       0.021503 
      49       30.000000       0.051930 
      49       29.970000       -0.065304 
      49       29.950000       -0.154192 
      49       29.960000       -0.154192 
      50       29.990000       -0.115433 
      50       29.970000       -0.115433 
      50       29.970000       -0.046816 
      50       29.890000       -0.045919 
      50       29.980000       -0.044992 
      50       29.930000       0.024224 
      50       29.940000       0.076755 
      50       29.950000       0.051664 
      50       29.970000       0.013380 
      50       29.950000       0.010216 
      50       29.950000       0.031821 
      50       29.970000       0.073246 
      50       29.970000       0.104857 
      50       29.930000       0.147798 
      50       29.960000       0.176415 
      51       30.010000       0.144968 
      51       30.000000       0.103611 
      51       29.930000       0.079866 
      51       29.960000       0.024965 
      51       30.000000       -0.013426 
      51       29.960000       -0.013426 
      51       30.000000       -0.009853 
      51       29.950000       -0.079384 
      51       29.980000       -0.145549 
      51       29.900000       -0.124636 
      51       30.060000       -0.154470 
      51       30.170000       -0.178562 
      51       30.100000       -0.083700 
      51       30.120000       -0.019443 
      51       30.110000       -0.083516 
      51       30.160000       -0.121698 
      52       30.120000       -0.097515 
      52       30.130000       -0.132787 
      52       30.110000       -0.132787 
      52       30.120000       -0.138584 
      52       30.150000       -0.062263 
      52       30.110000       -0.033166 
      52       30.090000       0.017711 
      52       30.140000       0.088509 
      52       30.120000       0.095170 
      52       30.080000       0.095170 
      52       30.120000       0.057000 
      52       30.040000       -0.057192 
      52       30.150000       -0.123058 
      52       30.060000       -0.052741 
      52       30.050000       -0.052741 
      53       30.130000       -0.052741 
      53       30.170000       -0.052741 
      53       30.080000       0.068981 
      53       30.070000       0.137403 
      53       30.130000       0.070455 
      53       30.110000       -0.033712 
      53       30.070000       -0.030995 
      53       30.100000       -0.002087 
      53       30.140000       -0.002087 
      53       30.110000       -0.002087 
      53       30.050000       -0.050181 
      53       30.090000       -0.127568 
      53       30.120000       -0.077236 
      53       30.160000       0.000430 
      53       30.050000       -0.001069 
      54       30.160000       -0.052758 
      54       30.090000       -0.052758 
      54       29.970000       -0.062200 
      54       29.870000       -0.062200 
      54       29.710000       -0.068933 
      54       29.560000       -0.067532 
      54       29.610000       -0.027184 
      54       29.550000       -0.020993 
      54       29.600000       -0.113998 
      54       29.670000       -0.136305 
      54       29.720000       -0.081357 
      54       29.800000       -0.004133 
      54       29.960000       -0.004133 
      54       30.140000       0.072997 
      54       30.120000       0.022616 
      55       30.100000       -0.080061 
      55       30.130000       -0.100145 
      55       30.070000       -0.089364 
      55       30.100000       -0.089364 
      55       30.100000       -0.091141 
      55       30.130000       -0.113317 
      55       30.140000       -0.081091 
      55       30.080000       -0.081091 
      55       30.100000       -0.081091 
      55       30.080000       0.014633 
      55       30.140000       0.022889 
      55       30.110000       0.022889 
      55       30.100000       -0.030908 
      55       30.100000       -0.028489 
      55       30.110000       -0.028489 
      56       30.040000       -0.013501 
      56       30.140000       -0.021781 
      56       30.080000       -0.012736 
      56       30.060000       -0.023243 
      56       30.090000       -0.015911 
      56       30.090000       0.020630 
      56       30.120000       -0.020470 
      56       30.110000       -0.020470 
      56       30.090000       -0.100897 
      56       30.150000       -0.111950 
      56       30.100000       -0.074408 
      56       30.090000       -0.094094 
      56       30.030000       -0.088230 
      56       29.940000       -0.088230 
      56       29.860000       -0.088230 
      57       29.720000       0.015541 
      57       29.780000       0.086344 
      57       29.780000       0.042547 
      57       29.730000       -0.034224 
      57       29.760000       -0.054272 
      57       29.830000       -0.054272 
      57       29.800000       -0.000010 
      57       29.760000       0.120612 
      57       29.810000       0.151350 
      57       29.810000       0.045553 
      57       29.840000       0.003957 
      57       29.800000       0.040079 
      57       29.830000       0.040079 
      57       29.780000       0.001715 
      57       29.830000       -0.104079 
      58       29.770000       -0.136589 
      58       29.870000       -0.136589 
      58       29.900000       -0.130100 
      58       29.970000       -0.130100 
      58       30.060000       -0.116216 
      58       30.130000       -0.090318 
      58       30.150000       -0.047236 
      58       30.080000       -0.075142 
      58       30.120000       -0.110707 
      58       30.150000       -0.110707 
      58       30.090000       -0.045299 
      58       30.070000       -0.045299 
      58       30.090000       0.028786 
      58       30.050000       0.100419 
      58       30.080000       0.100419 
      59       30.040000       0.139718 
      59       30.050000       0.059795 
      59       30.040000       -0.070703 
      59       30.030000       -0.129117 
      59       30.090000       -0.121977 
      59       30.120000       -0.121977 
      59       29.980000       -0.115110 
      59       30.060000       -0.092154 
      59       30.070000       -0.079778 
      59       30.080000       -0.105566 
      59       30.070000       -0.105566 
      59       30.020000       -0.172797 
      59       30.120000       -0.191077 
      59       30.030000       -0.137626 
      59       30.050000       -0.087505 
      60       30.100000       -0.036840 
      60       30.090000       0.005151 
      60       29.960000       0.093090 
      60       30.080000       0.175839 
      60       30.050000       0.153360 
      60       30.050000       0.086554 
      60       30.090000       0.012517 
      60       30.070000       -0.115424 
      60       30.010000       -0.115424 
      60       30.040000       -0.115424 
      60       30.050000       -0.153175 
      60       30.000000       -0.020961 
      60       30.070000       0.100513 
      60       30.060000       0.100513 
      60       30.010000       0.106954 
      60       30.030000       0.098007 
      61       30.080000       0.116896 
