

 time    ||    gripping force   ||   raspberry measurement 

      0       0.140000       -795.972222 
      0       0.120000       -795.972222 
      0       4.980000       -795.972222 
      0       0.080000       -795.972222 
      0       0.090000       -795.972222 
      0       0.010000       -795.972222 
      0       0.080000       -795.972222 
      0       0.010000       -795.972222 
      0       0.010000       -795.972222 
      0       0.180000       -795.972217 
      0       0.320000       -795.971037 
      0       0.220000       -795.864762 
      0       0.320000       -792.345418 
      0       0.120000       -749.470762 
      0       0.350000       -557.316867 
      1       0.450000       -240.498434 
      1       0.430000       -48.338754 
      1       0.310000       -5.499452 
      1       0.430000       -2.019586 
      1       0.770000       -1.921797 
      1       8.470000       -1.922875 
      1       34.350000       -1.920182 
      1       64.720000       -1.907156 
      1       65.040000       -1.853434 
      1       60.930000       -1.817083 
      2       72.920000       -1.845377 
      2       72.830000       -1.870376 
      2       72.430000       -1.897840 
      2       72.390000       -1.916072 
      3       71.950000       -1.922440 
      3       71.860000       -1.919698 
      3       71.720000       -1.900789 
      3       71.570000       -1.815602 
      4       71.270000       -1.690382 
      4       71.130000       -1.517356 
      5       71.190000       -1.151839 
      5       71.120000       -0.657186 
      6       70.800000       -0.263418 
      6       70.820000       -0.100774 
      6       70.710000       -0.048518 
      7       70.790000       -0.028418 
      7       70.720000       -0.021943 
      7       70.800000       -0.022951 
      7       70.620000       -0.021499 
      8       70.670000       -0.022937 
      9       70.450000       -0.021499 
      9       70.520000       -0.022937 
      9       70.440000       -0.021499 
      9       70.490000       -0.022937 
      9       70.470000       -0.021499 
      9       70.490000       -0.022937 
      10       70.420000       -0.021499 
      10       70.410000       -0.022937 
      11       70.310000       -0.021499 
      11       70.400000       -0.022937 
      11       70.340000       -0.021498 
      11       70.290000       -0.022910 
      11       70.260000       -0.020612 
      11       70.300000       -0.012139 
      11       70.320000       0.026895 
      11       70.350000       0.056851 
      12       70.290000       0.026895 
      12       70.250000       -0.012139 
      13       70.230000       -0.020612 
      13       70.240000       -0.022910 
      13       70.250000       -0.021499 
      13       70.210000       -0.022951 
      14       70.250000       -0.021942 
      14       70.180000       -0.028336 
      14       70.200000       -0.045696 
      14       70.090000       -0.062831 
      14       70.190000       -0.045696 
      14       70.230000       -0.028336 
      15       70.200000       -0.021942 
      15       70.140000       -0.022951 
      15       70.190000       -0.021499 
      15       70.080000       -0.022937 
      15       70.110000       -0.021499 
      16       70.150000       -0.022937 
      16       70.060000       -0.021499 
      16       70.120000       -0.022937 
      17       70.040000       -0.021499 
      17       70.050000       -0.022937 
      17       70.110000       -0.021499 
      17       70.040000       -0.022937 
      18       70.030000       -0.021499 
      18       70.050000       -0.022937 
      18       70.030000       -0.021499 
      18       70.040000       -0.022937 
      18       70.090000       -0.021499 
      18       70.060000       -0.022937 
      19       69.980000       -0.021499 
      19       70.030000       -0.022937 
      19       69.980000       -0.021499 
      19       69.960000       -0.022937 
      19       69.930000       -0.021499 
      19       69.950000       -0.022937 
      19       70.020000       -0.021499 
      20       70.040000       -0.022937 
      20       69.960000       -0.021499 
      20       70.020000       -0.022937 
      21       70.040000       -0.021499 
      21       69.990000       -0.022937 
      21       69.980000       -0.021498 
      21       69.900000       -0.022911 
      21       70.020000       -0.020626 
      22       69.880000       -0.012569 
      22       70.020000       0.021926 
      22       69.920000       0.037623 
      22       69.960000       0.006229 
      23       70.000000       -0.015670 
      23       69.910000       -0.022481 
      23       69.970000       -0.021485 
      23       69.910000       -0.022937 
      23       69.940000       -0.021499 
      24       69.920000       -0.022937 
      24       69.870000       -0.021499 
      24       69.870000       -0.022734 
      24       69.870000       -0.021947 
      25       69.950000       -0.033377 
      25       69.880000       -0.073333 
      25       69.970000       -0.119220 
      25       69.810000       -0.086948 
      26       69.920000       -0.033318 
      26       69.850000       -0.020102 
      26       69.880000       -0.017214 
      26       69.880000       -0.018426 
      26       69.930000       -0.016818 
      26       69.850000       -0.018073 
      26       69.830000       -0.016469 
      26       69.890000       -0.017728 
      27       69.850000       -0.016127 
      27       69.850000       -0.017389 
      28       69.800000       -0.015792 
      28       69.860000       -0.017058 
      29       69.860000       -0.015463 
      29       69.790000       -0.016732 
      29       69.870000       -0.015141 
      29       69.890000       -0.016414 
      30       69.780000       -0.014826 
      30       69.800000       -0.016101 
      31       69.790000       -0.014516 
      31       69.800000       -0.015795 
      32       69.750000       -0.014213 
      32       69.720000       -0.015495 
      32       69.850000       -0.013916 
      32       69.730000       -0.015201 
      32       69.790000       -0.013625 
      32       69.810000       -0.014913 
      32       69.810000       -0.013340 
      32       69.720000       -0.014630 
      32       69.730000       -0.013060 
      32       69.730000       -0.014353 
      32       69.870000       -0.012785 
      33       69.740000       -0.014055 
      33       69.730000       -0.011640 
      33       69.800000       -0.003135 
      33       69.800000       0.035541 
      33       69.710000       0.064841 
      33       69.840000       0.034510 
      33       69.810000       -0.005330 
      34       69.680000       -0.023478 
      34       69.840000       -0.062738 
      34       69.790000       -0.091793 
      34       69.860000       -0.061219 
      35       69.750000       -0.021963 
      35       69.780000       -0.013355 
      35       69.770000       -0.010946 
      35       69.750000       -0.012235 
      35       69.740000       -0.010688 
      35       69.750000       -0.012005 
      35       69.730000       -0.010461 
      35       69.770000       -0.011780 
      35       69.750000       -0.010239 
      35       69.720000       -0.011573 
      36       69.760000       -0.010459 
      36       69.730000       -0.016685 
      36       69.720000       -0.033704 
      36       69.760000       -0.050331 
      37       69.710000       -0.032864 
      37       69.800000       -0.015349 
      37       69.750000       -0.008865 
      37       69.760000       -0.009775 
      38       69.750000       -0.008240 
      38       69.760000       -0.009582 
      38       69.740000       -0.008062 
      38       69.670000       -0.009405 
      38       69.770000       -0.007887 
      38       69.710000       -0.009232 
      38       69.770000       -0.007716 
      39       69.750000       -0.009063 
      39       69.720000       -0.007548 
      39       69.720000       -0.008897 
      39       69.710000       -0.007384 
      39       69.770000       -0.008734 
      39       69.660000       -0.007223 
      40       69.760000       -0.008574 
      40       69.660000       -0.007065 
      40       69.740000       -0.008418 
      40       69.720000       -0.006910 
      40       69.740000       -0.008265 
      40       69.680000       -0.006758 
      40       69.680000       -0.008114 
      41       69.670000       -0.006609 
      41       69.700000       -0.007967 
      41       69.700000       -0.006464 
      41       69.720000       -0.007823 
      41       69.660000       -0.006321 
      41       69.800000       -0.007682 
      41       69.730000       -0.006207 
      41       69.680000       -0.008407 
      41       69.690000       -0.016299 
      41       69.750000       -0.050286 
      42       69.710000       -0.065324 
      42       69.720000       -0.033590 
      42       69.690000       -0.011574 
      42       69.700000       -0.004716 
      43       69.720000       -0.005654 
      43       69.660000       -0.004160 
      43       69.700000       -0.005543 
      43       69.700000       -0.004089 
      43       69.720000       -0.006311 
      43       69.690000       -0.014224 
      44       69.700000       -0.048232 
      44       69.780000       -0.063289 
      44       69.730000       -0.031576 
      44       69.670000       -0.009581 
      44       69.660000       -0.002742 
      45       69.790000       -0.003700 
      45       69.700000       -0.002226 
      45       69.700000       -0.003627 
      45       69.630000       -0.002167 
      45       69.730000       -0.003569 
      45       69.690000       -0.002110 
      45       69.710000       -0.003513 
      46       69.590000       -0.002054 
      46       69.740000       -0.003457 
      46       69.670000       -0.001998 
      46       69.610000       -0.003402 
      46       69.790000       -0.001944 
      46       69.670000       -0.003349 
      46       69.780000       -0.001918 
      46       69.680000       -0.004174 
      46       69.720000       -0.012521 
      47       69.720000       -0.051040 
      47       69.660000       -0.080186 
      47       69.700000       -0.049727 
      47       69.700000       -0.010586 
      48       69.670000       -0.002092 
      48       69.680000       0.000178 
      48       69.680000       -0.002060 
      48       69.750000       -0.010015 
      49       69.680000       -0.044065 
      49       69.710000       -0.059164 
      49       69.640000       -0.027492 
      49       69.710000       -0.005538 
      50       69.690000       0.001261 
      50       69.690000       0.000262 
      50       69.610000       0.001697 
      50       69.670000       0.000256 
      50       69.690000       0.001678 
      50       69.690000       0.000237 
      51       69.750000       0.001659 
      51       69.670000       0.000218 
      51       69.690000       0.001640 
      51       69.670000       0.000199 
      51       69.670000       0.001621 
      51       69.640000       0.000181 
      51       69.750000       0.001603 
      52       69.650000       0.000163 
      52       69.660000       0.001586 
      52       69.670000       0.000146 
      52       69.680000       0.001568 
      52       69.720000       0.000115 
      52       69.610000       0.001113 
      52       69.760000       -0.005229 
      53       69.570000       -0.022362 
      53       69.690000       -0.039103 
      53       69.670000       -0.021748 
      53       69.610000       -0.004344 
      53       69.730000       0.002030 
      53       69.700000       0.001011 
      54       69.600000       0.002438 
      54       69.670000       0.000990 
      54       69.640000       0.002404 
      54       69.610000       0.000956 
      54       69.570000       0.002370 
      54       69.730000       0.000922 
      54       69.660000       0.002337 
      55       69.650000       0.000890 
      55       69.660000       0.002305 
      55       69.720000       0.000858 
      55       69.630000       0.002273 
      56       69.460000       0.000826 
      56       69.620000       0.002242 
      56       69.880000       0.000796 
      56       69.760000       0.002212 
      56       69.890000       0.000766 
      57       69.730000       0.002182 
      57       69.830000       0.000723 
      57       69.770000       0.001714 
      57       69.800000       -0.004633 
      57       69.750000       -0.021773 
      57       69.800000       -0.038519 
      58       69.730000       -0.021170 
      58       69.760000       -0.003772 
      58       69.800000       0.002596 
      58       69.810000       0.001571 
      58       69.750000       0.002993 
      58       69.710000       0.001526 
      58       69.710000       0.002509 
      58       69.750000       -0.003846 
      59       69.690000       -0.020994 
      59       69.800000       -0.037748 
      59       69.800000       -0.020407 
      60       69.670000       -0.003017 
      60       69.790000       0.003344 
      60       69.780000       0.002312 
      60       69.740000       0.003726 
