

 time    ||    gripping force   ||   raspberry measurement 

      0       75.000000       3.017776 
      0       40.360000       3.009302 
      0       24.630000       3.007031 
      0       18.470000       3.009302 
      0       16.340000       3.017776 
      0       16.060000       3.056823 
      0       15.940000       3.087222 
      0       15.600000       3.062639 
      0       15.020000       3.046942 
      0       13.940000       3.068424 
      0       13.220000       3.051866 
      0       12.120000       3.017251 
      1       12.060000       3.006038 
      1       11.700000       2.964213 
      1       11.560000       2.775496 
      1       11.480000       2.407518 
      1       11.310000       2.113500 
      1       11.320000       2.000014 
      1       11.090000       1.968118 
      1       11.060000       1.984247 
      1       10.640000       2.001565 
      1       10.490000       2.007529 
      1       10.520000       2.001565 
      2       10.360000       1.984219 
      2       10.270000       1.967083 
      2       10.320000       1.984192 
      2       10.320000       2.000705 
      2       10.410000       1.997604 
      2       10.420000       1.963539 
      2       10.440000       1.947855 
      2       10.450000       1.979209 
      2       10.430000       1.999819 
      2       10.450000       1.991762 
      2       10.480000       1.934373 
      2       10.560000       1.888733 
      2       10.540000       1.934386 
      2       10.590000       1.992218 
      2       10.630000       2.005648 
      2       10.590000       2.008376 
      2       10.670000       2.006977 
      2       10.650000       2.008416 
      2       10.690000       2.006964 
      2       10.700000       2.007973 
      3       10.660000       2.001578 
      3       10.710000       1.984219 
      3       10.670000       1.967083 
      3       10.710000       1.984219 
      3       10.760000       2.001578 
      3       10.760000       2.007973 
      3       10.700000       2.006964 
      3       10.740000       2.008416 
      3       10.820000       2.006977 
      3       10.830000       2.008416 
      3       10.790000       2.006977 
      3       10.860000       2.008376 
      3       10.780000       2.005661 
      3       10.750000       1.992635 
      3       10.760000       1.938912 
      3       10.830000       1.902562 
      3       10.850000       1.930855 
      3       10.820000       1.955855 
      3       10.830000       1.983319 
      3       10.850000       2.001538 
      4       10.890000       2.007529 
      4       10.880000       2.001551 
      4       10.880000       1.983762 
      4       10.900000       1.961227 
      4       10.910000       1.954179 
      4       10.920000       1.932075 
      4       10.950000       1.919241 
      4       10.990000       1.932074 
      4       10.970000       1.954153 
      4       10.910000       1.960354 
      4       10.940000       1.973394 
      4       10.560000       1.958140 
      4       10.480000       1.947412 
      4       10.560000       1.979236 
      4       10.570000       2.001148 
      5       10.580000       2.007959 
      5       10.550000       2.006964 
      5       10.580000       2.008416 
      5       10.530000       2.006977 
      5       10.600000       2.008416 
      5       10.560000       2.006977 
      5       10.720000       2.008416 
      5       17.360000       2.006964 
      5       42.380000       2.007973 
      5       96.640000       2.001578 
      5       141.370000       1.984192 
      5       118.760000       1.966196 
      5       109.670000       1.973394 
      6       115.270000       1.952297 
      6       114.980000       1.917346 
      6       114.790000       1.908846 
      6       114.460000       1.901632 
      6       114.270000       1.885106 
      6       113.930000       1.877908 
      6       113.810000       1.933528 
      6       114.200000       1.993228 
      7       114.140000       2.021603 
      7       114.160000       2.125602 
      7       114.100000       2.470908 
      7       113.960000       3.063230 
      7       113.960000       3.433076 
      7       113.890000       3.325609 
      7       113.860000       3.158189 
      7       113.690000       3.121346 
      7       114.010000       3.151988 
      7       114.230000       3.168426 
      7       114.380000       3.146942 
      7       114.340000       3.162639 
      8       114.270000       3.187222 
      8       114.200000       3.156824 
      8       114.160000       3.117802 
      8       114.160000       3.110189 
      8       114.130000       3.117829 
      8       114.140000       3.157683 
      8       114.080000       3.197147 
      8       113.970000       3.200678 
      8       113.910000       3.183762 
      8       113.830000       3.162127 
      9       114.150000       3.165394 
      9       117.060000       3.184994 
      9       116.970000       3.212845 
      9       116.900000       3.176481 
      9       116.920000       3.122758 
      9       116.830000       3.109733 
      9       116.790000       3.107044 
      9       116.750000       3.109303 
      9       116.710000       3.117776 
      10       116.730000       3.156837 
      10       116.690000       3.187679 
      10       116.630000       3.168481 
      10       116.600000       3.176552 
      10       116.660000       3.233000 
      10       116.560000       3.222741 
      10       116.600000       3.189136 
      10       116.560000       3.250126 
      10       116.650000       3.359814 
      10       116.530000       3.405230 
      10       116.520000       3.349959 
      11       116.460000       3.277065 
      11       116.510000       3.256798 
      11       116.490000       3.313315 
      11       116.470000       3.310963 
      11       116.430000       3.245639 
      11       116.390000       3.204736 
      11       116.410000       3.163579 
      11       116.250000       3.142013 
      11       116.380000       3.149210 
      11       116.270000       3.131645 
      11       116.360000       3.119241 
      11       116.490000       3.132517 
      11       116.460000       3.159552 
      12       116.460000       3.184578 
      12       116.900000       3.214188 
      12       117.320000       3.193592 
      12       117.430000       3.207047 
      12       117.400000       3.289037 
      12       117.420000       3.312761 
      12       117.390000       3.272065 
      12       117.400000       3.189536 
      12       117.410000       3.141225 
      13       117.340000       3.199421 
      13       117.320000       3.309673 
      13       117.340000       3.344572 
      13       117.270000       3.262183 
      13       117.310000       3.183750 
      13       117.250000       3.186421 
      13       117.280000       3.211544 
      13       117.290000       3.246026 
      13       117.270000       3.244214 
      13       117.250000       3.207047 
      13       117.260000       3.238442 
      13       117.210000       3.281823 
      13       117.250000       3.256393 
      14       117.210000       3.218192 
      14       117.290000       3.214271 
      14       117.200000       3.226258 
      14       117.190000       3.229929 
      14       117.200000       3.220003 
      14       117.350000       3.243341 
      14       117.400000       3.222701 
      14       117.410000       3.177478 
      14       117.370000       3.190948 
      14       117.400000       3.232087 
      14       117.380000       3.282862 
      14       117.410000       3.319450 
      15       117.380000       3.317814 
      15       117.410000       3.261657 
      15       117.450000       3.225070 
      15       117.400000       3.232074 
      15       117.350000       3.248310 
      15       117.370000       3.230288 
      15       117.370000       3.202990 
      15       117.360000       3.158140 
      15       117.390000       3.117856 
      15       117.360000       3.110632 
      15       117.360000       3.123228 
      15       117.330000       3.181894 
      15       117.320000       3.237485 
      16       117.330000       3.230288 
      16       117.320000       3.213801 
      16       117.320000       3.207850 
      16       117.330000       3.213385 
      16       117.260000       3.225762 
      16       117.300000       3.223683 
      16       117.330000       3.186311 
      16       117.260000       3.170363 
      16       117.260000       3.180469 
      16       117.310000       3.193631 
      16       117.270000       3.155842 
      16       117.290000       3.120101 
      16       117.200000       3.118259 
      16       117.220000       3.152754 
      17       117.260000       3.178337 
      17       117.320000       3.184565 
      17       117.280000       3.194947 
      17       117.240000       3.167539 
      17       117.290000       3.179306 
      17       117.330000       3.246871 
      17       117.360000       3.285906 
      17       117.310000       3.256783 
      17       117.310000       3.217775 
      17       117.310000       3.209275 
      17       117.320000       3.206117 
      17       117.300000       3.197591 
      18       117.340000       3.157711 
      18       117.260000       3.118326 
      18       117.270000       3.117348 
      18       117.230000       3.163179 
      18       117.240000       3.288980 
      18       117.240000       3.357168 
      18       117.260000       3.268384 
      18       117.280000       3.206258 
      18       117.240000       3.204250 
      18       117.290000       3.218824 
      18       120.590000       3.255345 
      18       120.510000       3.287721 
      18       120.480000       3.248643 
      18       120.490000       3.178820 
      19       120.500000       3.095378 
      19       120.400000       3.064536 
      19       120.370000       3.128101 
      19       120.400000       3.180977 
      19       120.330000       3.157240 
      19       120.320000       3.128560 
      19       120.300000       3.157697 
      19       120.280000       3.186833 
      19       120.260000       3.158153 
      19       120.210000       3.134430 
      20       120.260000       3.187789 
      20       120.290000       3.258069 
      20       120.240000       3.267166 
      20       120.240000       3.290393 
      20       120.240000       3.335687 
      20       120.200000       3.319573 
      20       120.180000       3.332587 
      20       120.180000       3.338828 
      20       120.140000       3.296290 
      20       120.150000       3.295890 
      20       120.130000       3.332074 
      21       120.140000       3.377477 
      21       120.100000       3.395253 
      21       120.160000       3.377906 
      21       120.140000       3.337017 
      21       120.130000       3.314271 
      21       120.130000       3.307434 
      21       120.110000       3.308429 
      21       120.100000       3.306978 
      21       120.080000       3.308456 
      21       120.130000       3.308321 
      21       120.090000       3.325083 
      21       120.110000       3.385867 
      21       120.110000       3.463524 
      21       120.050000       3.472840 
      21       120.030000       3.448283 
      22       120.090000       3.388596 
      22       120.100000       3.352394 
      22       120.040000       3.368868 
      22       120.090000       3.351894 
      22       120.030000       3.317790 
      22       120.070000       3.314715 
      22       120.050000       3.332101 
      22       119.980000       3.359592 
      22       120.040000       3.386297 
      22       120.040000       3.434011 
      22       120.040000       3.468743 
      22       120.010000       3.468506 
      23       119.990000       3.410052 
      23       120.030000       3.365004 
      23       120.010000       3.333417 
      23       119.970000       3.325070 
      23       119.990000       3.360328 
      23       119.980000       3.401617 
      23       119.950000       3.346898 
      23       119.980000       3.264495 
      23       119.960000       3.275211 
      23       119.970000       3.340666 
      23       119.940000       3.357183 
      23       119.920000       3.303490 
      23       119.970000       3.302078 
      23       119.970000       3.359494 
      24       119.880000       3.349556 
      24       119.910000       3.318771 
      24       119.960000       3.308293 
      24       119.960000       3.313841 
      24       119.900000       3.331148 
      24       119.890000       3.347450 
      24       119.910000       3.321249 
      24       119.950000       3.275789 
      24       119.900000       3.271084 
      24       119.920000       3.321509 
      24       119.860000       3.335619 
      24       119.920000       3.374889 
      25       119.840000       3.445392 
      25       119.870000       3.491817 
      25       119.880000       3.467884 
      25       119.860000       3.400762 
      25       119.890000       3.313346 
      25       119.860000       3.317802 
      25       119.890000       3.353653 
      25       119.800000       3.303832 
      25       119.850000       3.246556 
      25       119.840000       3.221360 
      25       119.850000       3.243838 
      25       119.820000       3.228517 
      25       119.870000       3.206188 
      25       119.910000       3.244187 
      26       119.830000       3.246012 
      26       119.850000       3.211074 
      26       119.820000       3.180136 
      26       119.800000       3.148795 
      26       119.840000       3.175264 
      26       119.810000       3.258153 
      26       119.820000       3.345998 
      26       119.780000       3.396637 
      26       119.760000       3.404734 
      26       119.880000       3.392165 
      26       119.820000       3.333513 
      26       119.770000       3.278351 
      26       119.800000       3.290518 
      27       119.750000       3.326245 
      27       119.800000       3.353240 
      27       119.820000       3.354498 
      27       119.720000       3.343757 
      27       119.740000       3.292679 
      27       119.850000       3.265794 
      27       119.770000       3.260865 
      27       119.720000       3.203461 
      27       119.780000       3.220144 
      28       119.800000       3.335617 
      28       119.720000       3.389931 
      28       119.770000       3.311436 
      28       119.730000       3.238929 
      28       119.720000       3.247811 
      28       119.730000       3.238882 
      28       119.790000       3.182851 
      28       119.680000       3.198561 
      28       119.770000       3.258056 
      28       119.770000       3.255964 
      28       119.680000       3.237004 
      28       119.720000       3.235797 
      28       119.730000       3.240144 
      28       119.700000       3.274806 
      29       119.710000       3.274653 
      29       119.710000       3.260021 
      29       119.660000       3.248701 
      29       119.790000       3.292262 
      29       119.720000       3.356284 
      29       119.670000       3.340626 
      29       119.710000       3.274780 
      29       119.710000       3.259513 
      29       119.660000       3.327241 
      29       119.730000       3.376021 
      29       119.710000       3.338885 
      29       119.650000       3.318262 
      30       119.610000       3.397564 
      30       119.660000       3.444598 
      30       119.690000       3.375138 
      30       119.640000       3.274338 
      30       119.600000       3.219642 
      30       119.660000       3.216528 
      30       119.690000       3.253254 
      30       119.660000       3.350928 
      30       119.650000       3.419931 
      30       119.660000       3.370169 
      30       119.590000       3.279293 
      30       119.690000       3.243772 
      30       119.650000       3.254649 
      30       119.630000       3.255855 
      31       119.620000       3.259565 
      31       119.650000       3.261671 
      31       119.630000       3.283789 
      31       119.660000       3.302021 
      31       119.580000       3.313774 
      31       119.630000       3.335217 
      31       119.680000       3.355853 
      31       119.610000       3.292622 
      31       119.650000       3.188290 
      31       119.640000       3.170738 
      32       119.590000       3.204387 
      32       119.600000       3.236171 
      32       119.640000       3.278296 
      32       119.600000       3.299792 
      32       119.600000       3.291761 
      32       119.600000       3.234346 
      32       119.590000       3.187833 
      32       119.620000       3.223131 
      32       119.580000       3.237982 
      32       119.640000       3.196263 
      32       119.650000       3.195891 
      33       119.650000       3.232127 
      33       119.690000       3.279249 
      33       119.680000       3.316849 
      33       119.680000       3.374695 
      33       119.660000       3.396620 
      33       119.680000       3.311947 
      33       119.690000       3.239869 
      33       119.680000       3.259912 
      33       119.700000       3.302587 
      33       119.690000       3.324459 
      34       119.640000       3.319117 
      34       119.690000       3.272052 
      34       119.690000       3.268938 
      34       119.670000       3.298034 
      34       119.660000       3.300289 
      34       119.650000       3.279223 
      34       119.680000       3.247855 
      34       119.650000       3.263539 
      34       119.660000       3.297591 
      34       119.640000       3.300302 
      34       119.710000       3.280109 
      34       119.730000       3.258626 
      34       119.710000       3.311033 
      34       119.670000       3.366151 
      34       119.720000       3.295279 
      34       119.670000       3.190105 
      35       119.700000       3.168426 
      35       119.670000       3.194974 
      35       119.720000       3.184605 
      35       119.690000       3.179680 
      35       119.730000       3.169395 
      35       119.720000       3.196276 
      35       119.750000       3.264881 
      35       119.720000       3.279622 
      35       119.660000       3.289564 
      35       119.730000       3.311906 
      35       119.700000       3.345555 
      35       119.720000       3.337472 
      35       119.690000       3.266224 
      35       119.730000       3.221027 
      36       119.680000       3.220032 
      36       119.680000       3.273464 
      36       119.700000       3.364326 
      36       119.670000       3.395707 
      36       119.710000       3.310617 
      36       119.700000       3.224518 
      36       119.730000       3.196816 
      36       119.680000       3.215961 
      36       119.670000       3.268950 
      36       119.650000       3.268341 
      37       119.750000       3.229526 
      37       119.690000       3.173812 
      37       119.660000       3.179803 
      37       119.700000       3.247798 
      37       119.670000       3.297604 
      37       119.630000       3.316406 
      37       119.680000       3.350954 
      37       119.620000       3.357626 
      37       119.640000       3.298534 
      37       119.710000       3.282407 
      37       119.620000       3.333429 
      37       119.680000       3.321801 
      37       119.670000       3.276108 
      37       119.680000       3.274240 
      38       119.690000       3.251868 
      38       119.720000       3.211571 
      38       119.630000       3.181466 
      38       119.690000       3.164536 
      38       119.670000       3.242000 
      38       119.670000       3.347783 
      38       119.690000       3.348643 
      38       119.690000       3.318731 
      38       119.640000       3.307850 
      38       119.610000       3.308456 
      38       119.630000       3.307434 
      39       119.670000       3.314218 
      39       119.660000       3.335244 
      39       119.620000       3.356283 
      39       119.620000       3.297591 
      39       119.650000       3.207544 
      39       119.620000       3.192277 
      39       119.640000       3.218259 
      39       119.650000       3.280618 
      39       119.680000       3.327990 
      39       119.640000       3.297661 
      39       119.610000       3.301648 
      39       119.640000       3.360368 
      39       119.670000       3.360381 
      40       119.610000       3.368038 
      40       119.680000       3.398437 
      40       119.610000       3.405244 
      40       119.660000       3.397980 
      40       119.590000       3.362182 
      40       119.630000       3.330315 
      40       119.620000       3.290005 
      40       119.660000       3.203046 
      40       119.620000       3.186546 
      40       119.640000       3.259926 
      40       119.600000       3.356367 
      41       119.610000       3.439216 
      41       119.640000       3.455799 
      41       119.590000       3.386849 
      41       119.610000       3.324047 
      41       119.630000       3.314245 
      41       119.640000       3.319557 
      41       119.660000       3.290004 
      41       119.620000       3.213790 
      41       119.630000       3.234027 
      41       119.600000       3.328043 
      42       119.610000       3.346011 
      42       119.620000       3.327191 
      42       119.620000       3.351370 
      42       119.570000       3.351340 
      42       119.620000       3.262666 
      42       119.610000       3.183737 
      42       119.580000       3.185535 
      42       119.590000       3.200732 
      42       119.560000       3.197189 
      42       119.610000       3.159053 
      42       119.580000       3.135369 
      42       119.560000       3.199421 
      43       119.580000       3.315503 
      43       119.570000       3.374208 
      43       119.580000       3.327576 
      43       119.610000       3.263126 
      43       119.550000       3.276951 
      43       119.600000       3.278776 
      43       119.510000       3.202105 
      43       119.600000       3.185149 
      43       119.590000       3.242372 
      43       119.580000       3.266705 
      43       119.560000       3.236574 
      43       119.540000       3.220074 
      43       119.620000       3.236600 
      44       119.610000       3.267592 
      44       119.620000       3.253184 
      44       119.560000       3.234000 
      44       119.560000       3.287749 
      44       119.550000       3.357196 
      44       119.610000       3.356784 
      44       119.600000       3.346512 
      44       119.570000       3.369310 
      44       119.590000       3.363082 
      44       119.580000       3.370279 
      44       119.500000       3.403349 
      44       119.620000       3.357266 
      44       119.540000       3.307048 
      45       119.540000       3.325403 
      45       119.520000       3.324956 
      45       119.540000       3.303461 
      45       119.580000       3.269838 
      45       119.600000       3.277921 
      45       119.550000       3.349170 
      45       119.550000       3.394379 
      45       119.550000       3.395818 
      45       119.550000       3.347758 
      45       119.550000       3.280206 
      45       119.550000       3.277868 
      45       119.540000       3.337096 
      45       119.570000       3.330688 
      45       119.550000       3.254666 
      46       119.540000       3.233017 
      46       119.600000       3.294946 
      46       119.580000       3.319060 
      46       119.550000       3.302117 
      46       119.550000       3.259026 
      46       119.550000       3.229514 
      46       119.510000       3.268965 
      46       119.580000       3.341486 
      46       119.520000       3.372051 
      46       119.560000       3.360354 
      46       119.560000       3.355428 
      46       119.590000       3.346498 
      46       119.550000       3.370182 
      47       119.570000       3.353169 
      47       119.620000       3.244657 
      47       119.530000       3.171250 
      47       119.520000       3.133028 
      47       119.540000       3.115212 
      47       119.550000       3.124115 
      47       119.510000       3.188179 
      47       119.540000       3.272064 
      47       119.530000       3.314064 
      47       119.460000       3.304388 
      47       119.490000       3.270157 
      47       119.510000       3.280688 
      48       119.550000       3.275969 
      48       119.550000       3.269920 
      48       119.510000       3.285411 
      48       119.540000       3.312885 
      48       119.510000       3.277368 
      48       119.510000       3.233597 
      48       119.490000       3.259469 
      48       119.540000       3.303460 
      48       119.490000       3.335258 
      48       119.480000       3.367538 
      48       119.520000       3.352727 
      48       119.490000       3.328130 
      48       119.450000       3.357226 
      48       119.500000       3.380937 
      49       119.520000       3.326771 
      49       119.510000       3.248272 
      49       119.500000       3.220584 
      49       119.490000       3.232544 
      49       119.540000       3.259136 
      49       119.490000       3.280025 
      49       119.510000       3.299459 
      49       119.500000       3.285894 
      49       119.500000       3.290047 
      49       119.460000       3.312350 
      49       119.490000       3.350538 
      49       119.500000       3.357156 
      49       119.470000       3.292718 
      49       119.540000       3.253671 
      50       119.460000       3.279263 
      50       119.540000       3.295816 
      50       119.520000       3.285535 
      50       119.480000       3.288666 
      50       119.530000       3.380967 
      50       119.530000       3.459826 
      50       119.490000       3.388590 
      50       119.490000       3.256855 
      50       119.510000       3.201277 
      50       119.470000       3.281921 
      50       119.480000       3.360323 
      51       119.460000       3.294876 
      51       119.480000       3.191878 
      51       119.460000       3.190479 
      51       119.490000       3.297618 
      51       119.460000       3.374195 
      51       119.440000       3.345099 
      51       119.470000       3.269354 
      51       119.480000       3.229513 
      51       119.470000       3.258610 
      51       119.490000       3.297618 
      51       119.450000       3.306078 
      52       119.490000       3.307946 
      52       119.440000       3.301605 
      52       119.430000       3.285105 
      52       119.420000       3.277854 
      52       119.480000       3.331713 
      52       119.460000       3.370112 
      52       119.490000       3.302117 
      52       119.440000       3.207961 
      52       119.470000       3.192304 
      52       119.400000       3.218715 
      52       119.440000       3.286407 
      52       119.470000       3.355854 
      52       119.480000       3.341485 
      53       119.440000       3.285109 
      53       119.450000       3.301648 
      53       119.400000       3.372920 
      53       119.430000       3.346898 
      53       119.390000       3.293193 
      53       119.440000       3.333942 
      53       119.450000       3.382293 
      53       119.470000       3.367139 
      53       119.480000       3.365270 
      54       119.420000       3.378252 
      54       119.410000       3.305661 
      54       119.380000       3.222772 
      54       119.380000       3.181049 
      54       119.400000       3.148795 
      54       119.430000       3.174351 
      54       119.440000       3.246442 
      54       119.400000       3.285893 
      54       119.440000       3.256783 
      54       119.380000       3.217775 
      54       119.420000       3.209316 
      54       119.430000       3.207461 
      54       119.430000       3.214245 
      55       119.440000       3.236171 
      55       119.390000       3.268438 
      55       119.440000       3.263109 
      55       119.390000       3.272026 
      55       119.420000       3.324100 
      55       119.470000       3.344600 
      55       119.440000       3.334884 
      55       119.470000       3.320849 
      55       119.400000       3.347840 
      55       119.420000       3.335187 
      55       119.450000       3.257307 
      55       119.350000       3.176580 
      55       119.410000       3.165409 
      56       119.400000       3.257267 
      56       119.420000       3.345028 
      56       119.370000       3.320418 
      56       119.390000       3.246472 
      56       119.430000       3.204319 
      56       119.370000       3.158193 
      56       119.400000       3.118273 
      56       119.420000       3.115132 
      56       119.370000       3.136184 
      56       119.410000       3.168035 
      56       119.380000       3.159040 
      56       119.410000       3.164079 
      56       119.360000       3.258556 
      57       119.340000       3.361226 
      57       119.380000       3.393063 
      57       119.340000       3.367941 
      57       119.370000       3.298963 
      57       119.400000       3.276995 
      57       119.360000       3.307903 
      57       119.410000       3.265737 
      57       119.380000       3.180247 
      57       119.370000       3.161313 
      57       119.380000       3.244351 
      57       119.430000       3.359828 
      57       119.350000       3.411502 
      58       119.360000       3.384954 
      58       119.410000       3.365353 
      58       119.330000       3.360784 
      58       119.390000       3.367148 
      58       119.320000       3.323574 
      58       119.340000       3.264053 
      58       119.340000       3.293175 
      58       119.380000       3.352684 
      58       119.390000       3.337582 
      58       119.360000       3.326249 
      58       119.340000       3.369823 
      59       119.430000       3.368380 
      59       119.490000       3.329942 
      59       119.510000       3.278324 
      59       119.500000       3.293162 
      59       119.570000       3.337928 
      59       119.590000       3.324445 
      59       119.600000       3.283279 
      59       119.570000       3.231671 
      59       119.540000       3.186005 
      60       119.560000       3.159084 
      60       119.620000       3.211087 
      60       119.620000       3.267454 
      60       119.600000       3.210617 
      60       119.640000       3.152798 
      60       119.610000       3.150969 
      60       119.620000       3.142026 
      60       119.620000       3.162210 
      60       119.630000       3.187249 
      60       119.630000       3.158140 
      60       119.590000       3.133570 
      60       119.610000       3.177824 
      60       119.620000       3.218687 
      61       119.600000       3.213705 
