

 time    ||    gripping force   ||   raspberry measurement 

      0       0.150000       -802.950000 
      0       0.100000       -802.950000 
      0       0.130000       -802.950000 
      0       1.070000       -802.950000 
      0       0.110000       -802.950000 
      0       0.350000       -802.950000 
      0       0.090000       -802.950000 
      0       0.850000       -802.950000 
      0       0.340000       -802.950000 
      0       0.340000       -802.950000 
      0       0.190000       -802.950000 
      0       0.140000       -802.950000 
      0       0.240000       -802.950000 
      0       0.150000       -802.950000 
      0       0.160000       -802.950000 
      0       0.100000       -802.949995 
      1       0.110000       -802.949995 
      1       1.110000       -794.919315 
      1       1.150000       -786.863876 
      1       17.970000       -783.309964 
      1       32.280000       -740.014178 
      1       59.610000       -545.972885 
      1       67.230000       -545.972885 
      1       93.080000       -545.972885 
      1       99.090000       -226.041842 
      1       98.110000       -31.984852 
      1       97.210000       -31.984852 
      1       96.940000       -31.984852 
      1       96.490000       -31.984852 
      1       95.840000       11.314035 
      1       95.760000       14.869776 
      1       95.650000       14.974823 
      1       95.050000       14.967958 
      1       95.110000       14.933468 
      1       94.740000       14.933468 
      1       94.460000       14.917771 
      1       94.600000       14.949166 
      1       94.410000       14.971146 
      1       94.170000       14.971146 
      1       94.150000       14.971146 
      1       94.150000       14.971146 
      1       93.910000       14.980670 
      1       93.830000       14.980670 
      2       93.770000       14.980670 
      2       93.650000       15.013881 
      2       93.590000       15.013881 
      2       93.570000       15.013881 
      2       93.370000       15.013881 
      2       93.360000       15.183402 
      2       93.250000       15.183402 
      2       93.210000       15.183402 
      2       93.130000       15.533025 
      2       93.150000       15.533025 
      2       93.100000       15.533025 
      2       93.100000       15.533025 
      2       92.970000       15.896906 
      2       92.920000       16.086610 
      2       92.900000       16.086610 
      2       92.820000       16.086610 
      2       92.880000       16.086610 
      2       92.680000       16.086610 
      2       92.770000       16.086610 
      2       92.660000       16.086610 
      2       92.600000       16.086610 
      2       92.600000       16.086610 
      2       92.620000       16.086610 
      2       92.540000       16.086610 
      2       92.490000       16.086610 
      2       92.540000       16.086610 
      2       92.480000       16.086610 
      2       92.430000       16.086610 
      2       92.440000       16.086610 
      3       92.320000       16.086610 
      3       92.330000       16.086610 
      3       92.290000       16.121606 
      3       92.310000       16.121606 
      3       92.250000       16.112745 
      3       92.240000       16.053138 
      3       92.190000       16.053138 
      3       92.210000       16.003955 
      3       92.260000       16.028942 
      3       92.080000       16.028942 
      3       92.080000       16.028942 
      3       92.160000       16.067547 
      3       92.070000       16.067547 
      3       92.050000       16.076007 
      3       92.100000       16.078305 
      3       91.950000       16.078305 
      3       92.020000       16.078305 
      3       91.990000       16.078305 
      3       91.930000       16.076893 
      3       91.930000       16.078305 
      3       91.970000       16.078305 
      3       91.830000       16.078305 
      3       91.910000       16.076007 
      3       91.920000       16.067534 
      3       91.830000       16.067534 
      3       91.840000       16.028526 
      3       91.840000       16.028526 
      3       91.740000       15.999416 
      3       91.810000       15.999416 
      3       91.810000       15.999416 
      3       91.780000       15.999416 
      4       91.770000       15.999416 
      4       91.750000       15.999416 
      4       91.710000       15.999416 
      4       91.720000       15.999416 
      4       91.630000       15.999416 
      4       91.640000       15.999416 
      4       91.730000       15.999416 
      4       91.580000       16.038881 
      4       91.630000       16.111415 
      4       92.870000       16.111415 
      4       98.820000       16.142396 
      4       103.340000       16.135199 
      4       105.510000       16.143282 
      4       105.420000       16.143282 
      4       105.260000       16.122186 
      4       105.310000       16.086389 
      4       105.210000       16.068407 
      4       105.100000       16.028526 
      4       105.080000       15.998543 
      4       104.910000       16.028499 
      5       104.930000       16.067533 
      5       104.790000       16.076007 
      5       104.730000       16.078333 
      5       104.420000       16.077886 
      5       103.710000       16.092676 
      5       101.660000       16.092676 
      5       99.070000       16.092676 
      5       92.860000       16.168561 
      5       87.220000       16.168561 
      5       81.740000       16.168561 
      5       77.450000       16.354409 
      5       76.350000       16.478635 
      5       76.480000       16.450399 
      5       76.700000       16.468838 
      5       77.020000       16.446796 
      6       77.140000       16.446796 
      6       77.170000       16.446796 
      6       77.210000       16.346991 
      6       77.300000       16.302561 
      6       77.320000       16.337025 
      6       77.320000       16.337025 
      6       77.520000       16.337025 
      6       77.510000       16.337025 
      6       77.640000       16.406555 
      6       77.630000       16.406555 
      6       77.570000       16.406555 
      6       77.650000       16.405505 
      6       77.660000       16.405505 
      6       77.990000       16.405505 
      6       78.040000       16.405505 
      7       78.110000       16.405505 
      7       78.140000       16.342439 
      7       78.170000       16.342439 
      7       78.220000       16.306005 
      7       78.290000       16.306005 
      7       78.300000       16.306005 
      7       78.340000       16.306005 
      7       78.300000       16.306005 
      7       78.350000       16.277374 
      7       78.250000       16.171064 
      7       78.270000       16.171064 
      7       78.310000       16.171064 
      7       78.350000       16.171064 
      7       78.350000       16.171064 
      7       78.350000       16.171064 
      7       78.370000       16.171064 
      8       78.630000       16.171064 
      8       79.350000       16.049692 
      8       80.240000       15.989505 
      8       80.570000       15.989505 
      8       80.820000       15.989505 
      8       80.870000       15.979272 
      8       80.820000       15.976920 
      8       80.780000       15.976920 
      8       80.800000       15.976920 
      8       80.770000       15.976920 
      8       80.780000       15.978332 
      8       80.840000       15.976893 
      8       80.790000       15.976893 
      8       80.790000       15.976893 
      8       80.740000       15.976893 
      9       80.770000       15.978331 
      9       80.730000       15.976893 
      9       80.740000       15.976893 
      9       80.760000       15.976893 
      9       80.740000       15.976893 
      9       80.720000       15.976893 
      9       80.680000       15.976893 
      9       80.760000       15.976893 
      9       80.700000       15.976893 
      9       80.710000       15.978331 
      9       80.800000       15.976893 
      9       80.720000       15.976893 
      9       80.700000       15.976893 
      9       80.740000       15.976893 
      9       80.700000       15.978331 
      10       80.710000       15.976893 
      10       80.660000       15.978331 
      10       80.650000       15.976893 
      10       80.700000       15.976893 
      10       80.690000       15.976893 
      10       80.720000       15.978331 
      10       80.660000       15.976893 
      10       80.680000       15.978331 
      10       80.700000       15.976893 
      10       80.620000       15.976893 
      10       80.580000       15.976893 
      10       80.730000       15.976893 
      10       80.650000       15.976893 
      10       80.590000       15.976893 
      10       80.680000       15.976893 
      11       80.630000       15.976893 
      11       80.670000       15.976893 
      11       80.670000       15.976893 
      11       80.590000       15.976893 
      11       80.710000       15.976893 
      11       80.560000       15.976893 
      11       80.680000       15.976893 
      11       80.680000       15.976893 
      11       80.570000       15.976893 
      11       80.680000       15.976893 
      11       80.530000       15.978331 
      11       80.650000       15.976893 
      11       80.660000       15.978331 
      11       80.650000       15.978331 
      11       80.610000       15.978331 
      11       80.580000       15.978331 
      12       80.600000       15.978331 
      12       80.620000       15.978331 
      12       80.640000       15.978331 
      12       80.580000       15.978331 
      12       80.600000       15.978331 
      12       80.610000       15.978331 
      12       80.580000       15.976893 
      12       80.590000       15.978331 
      12       80.580000       15.978331 
      12       80.530000       15.976893 
      12       80.650000       15.978331 
      12       80.610000       15.976893 
      12       80.510000       15.978331 
      12       80.540000       15.978331 
      12       80.620000       15.978331 
      13       80.520000       15.978331 
      13       80.560000       15.978331 
      13       80.550000       15.978331 
      13       80.570000       15.978331 
      13       80.590000       15.978331 
      13       80.580000       15.978331 
      13       80.690000       15.978331 
      13       80.490000       15.978331 
      13       80.600000       15.978331 
      13       80.600000       15.978331 
      13       80.500000       15.978331 
      13       80.600000       15.978331 
      13       80.530000       15.978331 
      13       80.490000       15.978331 
      13       80.590000       15.976893 
      14       80.490000       15.978332 
      14       80.550000       15.978332 
      14       80.550000       15.978332 
      14       80.540000       15.978332 
      14       80.540000       15.978332 
      14       80.470000       15.978332 
      14       80.470000       15.976920 
      14       80.490000       15.979205 
      14       80.550000       15.979205 
      14       80.570000       15.979205 
      14       80.500000       15.979205 
      14       80.500000       15.979205 
      14       80.500000       15.979205 
      14       80.470000       15.979205 
      14       80.470000       15.979205 
      15       80.480000       15.979205 
      15       80.430000       15.979205 
      15       80.450000       15.979205 
      15       80.490000       15.979205 
      15       80.470000       15.979205 
      15       80.500000       15.979205 
      15       80.440000       15.979205 
      15       80.480000       15.979205 
      15       80.470000       15.979205 
      15       80.410000       15.979205 
      15       80.530000       15.979205 
      15       80.430000       15.979205 
      15       80.490000       15.979205 
      15       80.460000       15.979205 
      15       80.420000       15.987261 
      15       80.490000       16.021756 
      16       80.390000       16.037454 
      16       80.410000       16.037454 
      16       80.450000       16.006059 
      16       80.440000       15.984161 
      16       80.470000       15.977350 
      16       80.420000       15.978345 
      16       80.380000       15.978345 
      16       80.470000       15.976893 
      16       80.430000       15.976893 
      16       80.430000       15.978331 
      16       80.400000       15.976893 
      16       80.460000       15.976893 
      16       80.430000       15.976893 
      16       80.430000       15.976893 
      16       80.490000       15.976893 
      17       80.400000       15.976893 
      17       80.400000       15.976893 
      17       80.460000       15.976893 
      17       80.390000       15.976893 
      17       80.430000       15.976893 
      17       80.360000       15.976893 
      17       80.420000       15.978331 
      17       80.370000       15.976893 
      17       80.390000       15.976893 
      17       80.420000       15.978331 
      17       80.330000       15.976893 
      17       80.420000       15.978331 
      17       80.400000       15.976893 
      17       80.370000       15.978331 
      17       80.440000       15.976893 
      18       80.390000       15.976893 
      18       80.390000       15.976893 
      18       80.340000       15.976893 
      18       80.430000       15.978331 
      18       80.420000       15.976893 
      18       80.400000       15.976893 
      18       80.380000       15.976893 
      18       80.350000       15.976893 
      18       80.370000       15.976893 
      18       80.370000       15.978331 
      18       80.400000       15.976893 
      18       80.370000       15.976893 
      18       80.310000       15.976893 
      18       80.360000       15.976893 
      18       80.340000       15.976893 
      19       80.390000       15.976893 
      19       80.380000       15.976893 
      19       80.350000       15.976893 
      19       80.340000       15.976893 
      19       80.350000       15.976893 
      19       80.340000       15.976893 
      19       80.340000       15.976893 
      19       80.380000       15.976893 
      19       80.380000       15.976893 
      19       80.390000       15.976893 
      19       80.370000       15.976893 
      19       80.380000       15.976893 
      19       80.410000       15.976893 
      19       80.320000       15.976893 
      19       80.390000       15.976893 
      20       80.280000       15.976893 
      20       80.360000       15.976893 
      20       80.300000       15.976893 
      20       80.370000       15.976893 
      20       80.300000       15.976893 
      20       80.350000       15.976893 
      20       80.310000       15.976893 
      20       80.310000       15.976893 
      20       80.230000       15.976893 
      20       80.330000       15.976893 
      20       80.390000       15.976893 
      20       80.260000       15.976893 
      20       80.290000       15.978331 
      20       80.340000       15.978331 
      20       80.320000       15.976893 
      21       80.310000       15.976893 
      21       80.340000       15.976893 
      21       80.310000       15.976893 
      21       80.270000       15.976893 
      21       80.330000       15.976893 
      21       80.300000       15.978331 
      21       80.360000       15.976893 
      21       80.290000       15.976893 
      21       80.360000       15.976893 
      21       80.210000       15.976893 
      21       80.300000       15.976893 
      21       80.270000       15.976893 
      21       80.270000       15.976893 
      21       80.330000       15.978331 
      21       80.320000       15.976893 
      22       80.240000       15.976893 
      22       80.320000       15.976893 
      22       80.260000       15.976893 
      22       80.320000       15.976893 
      22       80.320000       15.976893 
      22       80.200000       15.976893 
      22       80.280000       15.978332 
      22       80.300000       15.978332 
      22       80.280000       15.976920 
      22       80.310000       15.976920 
      22       80.270000       15.976920 
      22       80.260000       15.979218 
      22       80.280000       15.987691 
      22       80.270000       16.026726 
      22       80.300000       16.026726 
      23       80.250000       16.056682 
      23       80.240000       16.056682 
      23       80.290000       16.056682 
      23       80.190000       16.056682 
      23       80.320000       16.056682 
      23       80.220000       16.056682 
      23       80.350000       16.056682 
      23       80.210000       16.056682 
      23       80.310000       16.056682 
      23       80.360000       16.026726 
      23       80.230000       16.026726 
      23       80.350000       15.987691 
      23       80.240000       15.987691 
      23       80.240000       15.987691 
      23       80.280000       15.987691 
      23       80.230000       15.987691 
      24       80.270000       15.987691 
      24       80.290000       15.987691 
      24       80.190000       15.987691 
      24       80.260000       15.987691 
      24       80.230000       15.979218 
      24       80.200000       15.979218 
      24       80.340000       15.976920 
      24       80.270000       15.976920 
      24       80.240000       15.976920 
      24       80.250000       15.976920 
      24       80.230000       15.978332 
      24       80.270000       15.976893 
      24       80.300000       15.976893 
      24       80.240000       15.976893 
      24       80.240000       15.976893 
      25       80.230000       15.976893 
      25       80.240000       15.976893 
      25       80.280000       15.978331 
      25       80.270000       15.976893 
      25       80.270000       15.976893 
      25       80.220000       15.976893 
      25       80.250000       15.976893 
      25       80.270000       15.976893 
      25       80.230000       15.976893 
      25       80.280000       15.976893 
      25       80.180000       15.976893 
      25       80.190000       15.976893 
      25       80.220000       15.976893 
      25       80.250000       15.976893 
      25       80.250000       15.976893 
      26       80.180000       15.976893 
      26       80.200000       15.976893 
      26       80.230000       15.976893 
      26       80.240000       15.976893 
      26       80.240000       15.976893 
      26       80.230000       15.976893 
      26       80.190000       15.976893 
      26       80.190000       15.976893 
      26       80.200000       15.976893 
      26       80.150000       15.976893 
      26       80.170000       15.976893 
      26       80.200000       15.976893 
      26       80.220000       15.976893 
      26       80.170000       15.976893 
      26       80.210000       15.976893 
      27       80.180000       15.976893 
      27       80.200000       15.976893 
      27       80.180000       15.976893 
      27       80.130000       15.978331 
      27       80.220000       15.978331 
      27       80.160000       15.976893 
      27       80.270000       15.976893 
      27       80.160000       15.978331 
      27       80.180000       15.976893 
      27       80.250000       15.978331 
      27       80.230000       15.976893 
      27       80.290000       15.978331 
      27       80.200000       15.978331 
      27       80.180000       15.976893 
      27       80.250000       15.978331 
      28       80.150000       15.976893 
      28       80.170000       15.976893 
      28       80.290000       15.976893 
      28       80.070000       15.978331 
      28       80.180000       15.976893 
      28       80.180000       15.976893 
      28       80.050000       15.976893 
      28       80.340000       15.978331 
      28       80.100000       15.976893 
      28       80.080000       15.978331 
      28       80.160000       15.976893 
      28       80.010000       15.976893 
      28       80.080000       15.976893 
      28       79.840000       15.976893 
      28       79.730000       15.976893 
      29       79.730000       15.976893 
      29       79.600000       15.976893 
      29       79.620000       15.976893 
      29       79.680000       15.976893 
      29       79.640000       15.976893 
      29       79.610000       15.978331 
      29       79.680000       15.976893 
      29       79.660000       15.976893 
      29       79.600000       15.976893 
      29       79.680000       15.976893 
      29       79.690000       15.976893 
      29       79.660000       15.976893 
      29       79.680000       15.976893 
      29       79.640000       15.976893 
      29       79.590000       15.976893 
      30       79.640000       15.976893 
      30       79.630000       15.978331 
      30       79.640000       15.976893 
      30       79.650000       15.976893 
      30       79.570000       15.978331 
      30       79.650000       15.976893 
      30       79.600000       15.976893 
      30       79.630000       15.976893 
      30       79.650000       15.978331 
      30       79.640000       15.978331 
      30       79.720000       15.976893 
      30       79.600000       15.978331 
      30       79.610000       15.976893 
      30       79.640000       15.976893 
      30       79.630000       15.976893 
      31       79.640000       15.976893 
      31       79.560000       15.976893 
      31       79.610000       15.976893 
      31       79.620000       15.976893 
      31       79.600000       15.976893 
      31       79.670000       15.976893 
      31       79.600000       15.976893 
      31       79.600000       15.978331 
      31       79.610000       15.978331 
      31       79.610000       15.976893 
      31       79.650000       15.978331 
      31       79.620000       15.978331 
      31       79.600000       15.976893 
      31       79.640000       15.976893 
      31       79.620000       15.978331 
      31       79.570000       15.976893 
      32       79.630000       15.978331 
      32       79.620000       15.978331 
      32       79.610000       15.976893 
      32       79.650000       15.978331 
      32       79.670000       15.978331 
      32       79.650000       15.976893 
      32       79.620000       15.978331 
      32       79.620000       15.976893 
      32       79.620000       15.976893 
      32       79.650000       15.976893 
      32       79.620000       15.976893 
      32       79.690000       15.978331 
      32       79.650000       15.976893 
      32       79.520000       15.976893 
      32       79.640000       15.976893 
      33       79.640000       15.976893 
      33       79.640000       15.976893 
      33       79.570000       15.976893 
      33       79.660000       15.976893 
      33       79.650000       15.976893 
      33       79.570000       15.976893 
      33       79.610000       15.976893 
      33       79.660000       15.976893 
      33       79.680000       15.976893 
      33       79.630000       15.976893 
      33       79.620000       15.976893 
      33       79.630000       15.978331 
      33       79.680000       15.978331 
      33       79.590000       15.976893 
      33       79.610000       15.976893 
      34       79.660000       15.976893 
      34       79.630000       15.978331 
      34       79.630000       15.976893 
      34       79.610000       15.976893 
      34       79.600000       15.976893 
      34       79.630000       15.978331 
      34       79.580000       15.976893 
      34       79.600000       15.976893 
      34       79.580000       15.978331 
      34       79.620000       15.978331 
      34       79.630000       15.978331 
      34       79.570000       15.976893 
      34       79.640000       15.978331 
      34       79.580000       15.976893 
      34       79.570000       15.978331 
      35       79.620000       15.976893 
      35       79.540000       15.976893 
      35       79.620000       15.976893 
      35       79.580000       15.976893 
      35       79.650000       15.976893 
      35       79.630000       15.976893 
      35       79.650000       15.976893 
      35       79.610000       15.976893 
      35       79.600000       15.976893 
      35       79.640000       15.976893 
      35       79.620000       15.976893 
      35       79.610000       15.978331 
      35       79.580000       15.976893 
      35       79.650000       15.978331 
      35       79.600000       15.978331 
      35       79.660000       15.978331 
      36       79.570000       15.978331 
      36       79.650000       15.978331 
      36       79.600000       15.976893 
      36       79.600000       15.978331 
      36       79.590000       15.978331 
      36       79.560000       15.978331 
      36       79.570000       15.978331 
      36       79.680000       15.978331 
      36       79.600000       15.978331 
      36       79.610000       15.976893 
      36       79.610000       15.978331 
      36       79.600000       15.976893 
      36       79.570000       15.978331 
      36       79.660000       15.978331 
      36       79.610000       15.978331 
      37       79.590000       15.978331 
      37       79.610000       15.978331 
      37       79.640000       15.978331 
      37       79.600000       15.976893 
      37       79.630000       15.978332 
      37       79.550000       15.978332 
      37       79.600000       15.978332 
      37       79.540000       15.978332 
      37       79.590000       15.978332 
      37       79.580000       15.978332 
      37       79.640000       15.978332 
      37       79.670000       15.978332 
      37       79.600000       15.978332 
      37       79.610000       15.978332 
      37       79.570000       15.978332 
      38       79.650000       15.978332 
      38       79.580000       15.978332 
      38       79.500000       15.978332 
      38       79.620000       15.978332 
      38       79.620000       15.978332 
      38       79.600000       15.978332 
      38       79.620000       15.978332 
      38       79.600000       15.978332 
      38       79.570000       15.978332 
      38       79.600000       15.978332 
      38       79.610000       15.978332 
      38       79.570000       15.978332 
      38       79.640000       15.978332 
      38       79.620000       15.978332 
      38       79.600000       15.976920 
      38       79.630000       15.979205 
      39       79.570000       15.979205 
      39       79.610000       15.979205 
      39       79.570000       15.987261 
      39       79.610000       16.021756 
      39       79.620000       16.021756 
      39       79.560000       16.021756 
      39       79.570000       16.021756 
      39       79.590000       16.037454 
      39       79.610000       16.006059 
      39       79.630000       15.984161 
      39       79.640000       15.977350 
      39       79.630000       15.977350 
      39       79.630000       15.977350 
      39       79.600000       15.977350 
      39       79.610000       15.977350 
      40       79.620000       15.977350 
      40       79.540000       15.977350 
      40       79.540000       15.977350 
      40       79.640000       15.978345 
      40       79.630000       15.976893 
      40       79.540000       15.976893 
      40       79.680000       15.978331 
      40       79.620000       15.976893 
      40       79.560000       15.976893 
      40       79.620000       15.978331 
      40       79.640000       15.976893 
      40       79.560000       15.976893 
      40       79.610000       15.976893 
      40       79.670000       15.976893 
      40       79.570000       15.976893 
      41       79.570000       15.976893 
      41       79.550000       15.976893 
      41       79.530000       15.978331 
      41       79.590000       15.978331 
      41       79.560000       15.976893 
      41       79.630000       15.978331 
      41       79.560000       15.976893 
      41       79.590000       15.976893 
      41       79.610000       15.976893 
      41       79.550000       15.976893 
      41       79.610000       15.976893 
      41       79.600000       15.976893 
      41       79.580000       15.976893 
      41       79.560000       15.976893 
      41       79.620000       15.976893 
      42       79.560000       15.976893 
      42       79.600000       15.978331 
      42       79.560000       15.976880 
      42       79.530000       15.976880 
      42       79.570000       15.977888 
      42       79.590000       15.971481 
      42       79.560000       15.971481 
      42       79.590000       15.971481 
      42       79.570000       15.953691 
      42       79.490000       15.931600 
      42       79.520000       15.931600 
      42       79.580000       15.929937 
      42       79.590000       15.931600 
      42       79.590000       15.953691 
      42       79.630000       15.953691 
      42       79.560000       15.953691 
      43       79.560000       15.953691 
      43       79.580000       15.953691 
      43       79.580000       15.953691 
      43       79.580000       15.953691 
      43       79.570000       15.971481 
      43       79.610000       15.977888 
      43       79.510000       15.977888 
      43       79.670000       15.976880 
      43       79.560000       15.978331 
      43       79.630000       15.978331 
      43       79.550000       15.978331 
      43       79.600000       15.978331 
      43       79.610000       15.978331 
      43       79.620000       15.978331 
      43       79.630000       15.976893 
      44       79.650000       15.978331 
      44       79.680000       15.978331 
      44       79.650000       15.978331 
      44       79.640000       15.978331 
      44       79.600000       15.978331 
      44       79.600000       15.976893 
      44       79.620000       15.978331 
      44       79.630000       15.978331 
      44       79.640000       15.976880 
      44       79.660000       15.976880 
      44       79.660000       15.977875 
      44       79.660000       15.977875 
      44       79.640000       15.977875 
      44       79.650000       15.977875 
      44       79.640000       15.977875 
      45       79.640000       15.977875 
      45       79.660000       15.977875 
      45       79.550000       15.977875 
      45       79.610000       15.977875 
      45       79.590000       15.977875 
      45       79.660000       15.977875 
      45       79.630000       15.977875 
      45       79.650000       15.971064 
      45       79.590000       15.949165 
      45       79.640000       15.917771 
      45       79.630000       15.933468 
      45       79.610000       15.933468 
      45       79.610000       15.933468 
      45       79.670000       15.933468 
      45       79.540000       15.933468 
      46       79.630000       15.967963 
      46       79.620000       15.976020 
      46       79.610000       15.976020 
      46       79.630000       15.978305 
      46       79.680000       15.976893 
      46       79.670000       15.976893 
      46       79.660000       15.976893 
      46       79.630000       15.978331 
      46       79.640000       15.976893 
      46       79.590000       15.976893 
      46       79.620000       15.976893 
      46       79.610000       15.978331 
      46       79.630000       15.976893 
      46       79.620000       15.978332 
      46       79.660000       15.976920 
      46       79.690000       15.976920 
      47       79.690000       15.976920 
      47       79.710000       15.976920 
      47       79.660000       15.976920 
      47       79.640000       15.976920 
      47       79.670000       15.976920 
      47       79.630000       15.976920 
      47       79.620000       15.976920 
      47       79.660000       15.976920 
      47       79.670000       15.976920 
      47       79.650000       15.979218 
      47       79.570000       15.987691 
      47       79.710000       15.987691 
      47       79.610000       16.026726 
      47       79.660000       16.056682 
      47       79.600000       16.056682 
      48       79.700000       16.056682 
      48       79.640000       16.056682 
      48       79.600000       16.026726 
      48       79.640000       15.987691 
      48       79.720000       15.987691 
      48       79.690000       15.987691 
      48       79.630000       15.987691 
      48       79.700000       15.987691 
      48       79.620000       15.987691 
      48       79.710000       15.987691 
      48       79.690000       15.987691 
      48       79.660000       15.987691 
      48       79.710000       15.987691 
      48       79.650000       15.987691 
      48       79.640000       15.987691 
      49       79.660000       15.987691 
      49       79.640000       15.987691 
      49       79.620000       15.987691 
      49       79.650000       15.987691 
      49       79.670000       15.987691 
      49       79.720000       15.979218 
      49       79.590000       15.976920 
      49       79.670000       15.978332 
      49       79.640000       15.978332 
      49       79.630000       15.978332 
      49       79.700000       15.978332 
      49       79.690000       15.976893 
      49       79.670000       15.978331 
      49       79.700000       15.978331 
      49       79.620000       15.978331 
      49       79.710000       15.976893 
      50       79.650000       15.978331 
      50       79.690000       15.978331 
      50       79.740000       15.978331 
      50       79.960000       15.978331 
      50       80.040000       15.978331 
      50       80.110000       15.976893 
      50       80.060000       15.978331 
      50       80.020000       15.978331 
      50       80.050000       15.978331 
      50       80.080000       15.976893 
      50       80.050000       15.978331 
      50       80.030000       15.978331 
      50       80.070000       15.978331 
      50       80.050000       15.978331 
      51       80.070000       15.978331 
      51       80.020000       15.978331 
      51       80.080000       15.978331 
      51       80.050000       15.978331 
      51       80.060000       15.978331 
      51       80.090000       15.978331 
      51       80.000000       15.978331 
      51       80.070000       15.978331 
      51       80.000000       15.976880 
      51       80.080000       15.977875 
      51       80.090000       15.977875 
      51       80.080000       15.977875 
      51       80.060000       15.971064 
      51       80.070000       15.949165 
      51       80.050000       15.949165 
      51       80.030000       15.917771 
      52       80.040000       15.933468 
      52       80.090000       15.933468 
      52       80.000000       15.933468 
      52       80.060000       15.933468 
      52       80.040000       15.933468 
      52       80.030000       15.967963 
      52       80.030000       15.976020 
      52       80.080000       15.978305 
      52       80.050000       15.978305 
      52       80.020000       15.978305 
      52       80.010000       15.978305 
      52       80.040000       15.978305 
      52       80.030000       15.978305 
      52       80.110000       15.978305 
      52       80.010000       15.978305 
      53       80.030000       15.976893 
      53       80.090000       15.976893 
      53       80.030000       15.978331 
      53       80.070000       15.976893 
      53       79.980000       15.978331 
      53       80.020000       15.978331 
      53       80.060000       15.976893 
      53       80.010000       15.978331 
      53       80.030000       15.978331 
      53       79.970000       15.978331 
      53       80.020000       15.978331 
      53       79.980000       15.978331 
      53       80.030000       15.978331 
      53       79.990000       15.978331 
      53       80.050000       15.978331 
      53       80.050000       15.978331 
      54       80.050000       15.978331 
      54       80.020000       15.978331 
      54       80.080000       15.976893 
      54       80.030000       15.978332 
      54       80.040000       15.978332 
      54       80.030000       15.976920 
      54       80.020000       15.979205 
      54       80.050000       15.979205 
      54       80.100000       15.979205 
      54       80.120000       15.979205 
      54       79.960000       15.979205 
      54       80.070000       15.979205 
      54       80.010000       15.979205 
      54       80.050000       15.979205 
      54       79.970000       15.979205 
      55       80.020000       15.987261 
      55       80.050000       16.021756 
      55       80.030000       16.021756 
      55       79.990000       16.021756 
      55       80.020000       16.021756 
      55       80.040000       16.021756 
      55       80.030000       16.021756 
      55       80.000000       16.021756 
      55       80.080000       16.037454 
      55       79.980000       16.006059 
      55       80.040000       16.006059 
      55       80.060000       16.006059 
      55       79.970000       16.006059 
      55       80.060000       16.006059 
      55       80.040000       15.984161 
      56       80.010000       15.977350 
      56       79.990000       15.977350 
      56       80.040000       15.977350 
      56       80.030000       15.977350 
      56       79.990000       15.977350 
      56       79.980000       15.977350 
      56       80.010000       15.977350 
      56       80.030000       15.977350 
      56       79.970000       15.977350 
      56       80.050000       15.978345 
      56       80.040000       15.976893 
      56       80.010000       15.976893 
      56       80.020000       15.976893 
      56       79.980000       15.976893 
      56       80.040000       15.978331 
      57       80.020000       15.978331 
      57       80.010000       15.978331 
      57       79.990000       15.976893 
      57       80.020000       15.976893 
      57       79.970000       15.978331 
      57       79.950000       15.976893 
      57       80.020000       15.978331 
      57       80.020000       15.976893 
      57       79.920000       15.976893 
      57       79.970000       15.976893 
      57       80.090000       15.976893 
      57       80.010000       15.976893 
      57       79.950000       15.976893 
      57       80.050000       15.976893 
      57       80.000000       15.976893 
      58       79.960000       15.978331 
      58       80.010000       15.976893 
      58       79.980000       15.978332 
      58       80.020000       15.978332 
      58       80.090000       15.978332 
      58       79.950000       15.978332 
      58       79.990000       15.976920 
      58       80.020000       15.979218 
      58       79.980000       15.979218 
      58       79.940000       15.979218 
      58       79.980000       15.979218 
      58       79.990000       15.987691 
      58       80.000000       15.987691 
      58       79.950000       16.026726 
      58       80.020000       16.056682 
      59       79.990000       16.026726 
      59       79.940000       16.026726 
      59       80.050000       15.987691 
      59       79.970000       15.979218 
      59       80.020000       15.979218 
      59       79.960000       15.976920 
      59       80.000000       15.978345 
      59       80.020000       15.978345 
      59       80.010000       15.978345 
      59       79.960000       15.977350 
      59       80.010000       15.984161 
      59       79.990000       15.984161 
      59       79.980000       16.006059 
      59       80.000000       16.037454 
      59       79.930000       16.037454 
      59       79.970000       16.037454 
      60       79.950000       16.037454 
      60       79.950000       16.037454 
      60       80.010000       16.037454 
      60       79.940000       16.037454 
      60       80.030000       16.037454 
      60       80.040000       16.037454 
      60       79.980000       16.037454 
      60       79.990000       16.037454 
      60       79.940000       16.037454 
      60       79.980000       16.037454 
      60       79.960000       16.037454 
      60       79.970000       16.037454 
      60       80.020000       16.021756 
      60       79.960000       15.987261 
      60       79.980000       15.987261 
      61       79.950000       15.979205 
