Human trial picking the raspberry twin 

 time    ||     output     ||     loadcell

      0.015677       -799.020000       0.030000 
      0.031989       -799.020000       0.010000 
      0.047571       -799.020000       0.120000 
      0.063369       -799.020000       0.000000 
      0.079192       -799.020000       0.050000 
      0.095629       -799.020000       0.050000 
      0.109951       -799.020000       0.100000 
      0.126850       -799.020000       0.010000 
      0.141515       -799.020000       0.050000 
      0.158472       -799.019995       0.010000 
      0.187262       -799.018807       0.000000 
      0.203220       -798.911877       0.050000 
      0.216972       -795.370830       0.060000 
      0.232462       -752.232048       0.130000 
      0.248876       -558.897425       0.040000 
      0.263304       -240.142114       0.040000 
      0.279473       -46.802549       0.080000 
      0.295165       -3.644969       0.130000 
      0.310535       -0.088225       0.070000 
      0.325496       0.003009       0.040000 
      0.340781       -0.014601       0.110000 
      0.357223       -0.019553       0.030000 
      0.372759       -0.019982       0.020000 
      0.386779       -0.019982       0.140000 
      0.401769       -0.019553       0.020000 
      0.417928       -0.014597       0.070000 
      0.433886       0.004201       0.050000 
      0.449040       0.019899       0.080000 
      0.463540       0.004201       0.060000 
      0.479203       -0.014597       0.010000 
      0.494563       -0.019553       0.080000 
      0.511047       -0.019982       0.100000 
      0.524991       -0.019995       0.180000 
      0.541022       -0.019982       0.020000 
      0.556322       -0.019553       0.070000 
      0.571366       -0.014597       0.040000 
      0.587281       0.004201       0.080000 
      0.601589       0.019899       0.040000 
      0.617290       0.004201       0.050000 
      0.632044       -0.014597       0.050000 
      0.647257       -0.019553       0.120000 
      0.663636       -0.019982       0.040000 
      0.679107       -0.019996       0.050000 
      0.694103       -0.019996       0.030000 
      0.723835       -0.019996       0.070000 
      0.740003       -0.019996       0.040000 
      0.753751       -0.019996       0.010000 
      0.769726       -0.019996       0.030000 
      0.784385       -0.019982       0.110000 
      0.799703       -0.019552       0.020000 
      0.814620       -0.014583       0.050000 
      0.831018       0.004658       0.130000 
      0.846284       0.025741       0.050000 
      0.860947       0.033798       0.020000 
      0.876945       0.049495       0.030000 
      0.892673       0.044539       0.120000 
      0.908600       0.009614       0.110000 
      0.923571       -0.014153       0.130000 
      0.937855       -0.019526       0.010000 
      0.953241       -0.019539       0.090000 
      0.968782       -0.014596       0.050000 
      0.985283       0.004201       0.130000 
      1.000352       0.019899       0.080000 
      1.016184       0.004201       0.070000 
      1.031214       -0.014597       0.040000 
      1.046022       -0.019553       0.080000 
      1.062089       -0.019982       0.100000 
      1.077581       -0.019996       0.050000 
      1.092868       -0.019996       0.110000 
      1.107406       -0.019996       0.030000 
      1.123804       -0.019982       0.090000 
      1.139650       -0.019539       0.000000 
      1.155653       -0.014153       0.170000 
      1.170786       0.009600       0.000000 
      1.187001       0.044096       0.020000 
      1.201889       0.044109       0.010000 
      1.217694       0.010044       0.080000 
      1.232794       -0.008754       0.070000 
      1.247774       0.004658       0.050000 
      1.262794       0.019925       0.010000 
      1.277787       0.004645       0.090000 
      1.292982       -0.009198       0.100000 
      1.308851       0.004645       0.120000 
      1.324605       0.019912       0.010000 
      1.339847       0.004201       0.050000 
      1.355572       -0.014596       0.040000 
      1.369859       -0.019539       0.010000 
      1.386425       -0.019539       0.060000 
      1.400921       -0.014596       0.010000 
      1.416346       0.004201       0.040000 
      1.432676       0.019899       0.150000 
      1.447634       0.004201       0.030000 
      1.463630       -0.014597       0.090000 
      1.479608       -0.019553       0.100000 
      1.494985       -0.019982       0.030000 
      1.508938       -0.019996       0.050000 
      1.525494       -0.019996       0.090000 
      1.541049       -0.019996       0.110000 
      1.557006       -0.019996       0.070000 
      1.571675       -0.019996       0.110000 
      1.587525       -0.019996       0.010000 
      1.603482       -0.019996       0.060000 
      1.619442       -0.019996       0.010000 
      1.634293       -0.019996       0.030000 
      1.651259       -0.019982       0.080000 
      1.665396       -0.019539       0.040000 
      1.680895       -0.014153       0.040000 
      1.696658       0.009600       0.020000 
      1.712820       0.044096       0.110000 
      1.727555       0.044096       0.040000 
      1.742790       0.009600       0.110000 
      1.758823       -0.014153       0.080000 
      1.774779       -0.019539       0.150000 
      1.790324       -0.019982       0.100000 
      1.806255       -0.019982       0.050000 
      1.821397       -0.019539       0.000000 
      1.836357       -0.014153       0.130000 
      1.851337       0.009600       0.100000 
      1.867278       0.044096       0.020000 
      1.882262       0.044109       0.090000 
      1.897234       0.010044       0.010000 
      1.912352       -0.008754       0.130000 
      1.928315       0.004658       0.030000 
      1.945274       0.019925       0.010000 
      1.959234       0.004645       0.140000 
      1.975063       -0.009198       0.150000 
      1.992207       0.004645       0.030000 
      2.007348       0.019912       0.010000 
      2.022309       0.004201       0.110000 
      2.036302       -0.014597       0.060000 
      2.052391       -0.019553       0.000000 
      2.067680       -0.019982       0.070000 
      2.082873       -0.019996       0.010000 
      2.098807       -0.019996       0.030000 
      2.114325       -0.019982       0.130000 
      2.128856       -0.019553       0.020000 
      2.145331       -0.014597       0.100000 
      2.160847       0.004201       0.060000 
      2.175268       0.019899       0.010000 
      2.191869       0.004201       0.040000 
      2.207380       -0.014596       0.000000 
      2.223023       -0.019539       0.170000 
      2.238380       -0.019539       0.090000 
      2.253760       -0.014596       0.060000 
      2.269100       0.004201       0.020000 
      2.284481       0.019899       0.040000 
      2.299794       0.004201       0.080000 
      2.315036       -0.014597       0.010000 
      2.330501       -0.019553       0.040000 
      2.346141       -0.019982       0.050000 
      2.361284       -0.019996       0.020000 
      2.376877       -0.019996       0.050000 
      2.392751       -0.019996       0.030000 
      2.408135       -0.019996       0.010000 
      2.424246       -0.019996       0.020000 
      2.441064       -0.019996       0.070000 
      2.455027       -0.019996       0.100000 
      2.471578       -0.019996       0.070000 
      2.486995       -0.019996       0.030000 
      2.502354       -0.019996       0.070000 
      2.518456       -0.019996       0.090000 
      2.532900       -0.019996       0.030000 
      2.548266       -0.019996       0.020000 
      2.564449       -0.019996       0.060000 
      2.579241       -0.019996       0.070000 
      2.593719       -0.019996       0.000000 
      2.610805       -0.019996       0.120000 
      2.625901       -0.019996       0.100000 
      2.642337       -0.019996       0.080000 
      2.657613       -0.019996       0.050000 
      2.674598       -0.019996       0.040000 
      2.689804       -0.019996       0.110000 
      2.704134       -0.019996       0.100000 
      2.721176       -0.019996       0.070000 
      2.735138       -0.019996       0.120000 
      2.750133       -0.019996       0.100000 
      2.780137       -0.019996       0.060000 
      2.796841       -0.019996       0.040000 
      2.810630       -0.019996       0.030000 
      2.826588       -0.019996       0.080000 
      2.841820       -0.019996       0.000000 
      2.856550       -0.019996       0.050000 
      2.871496       -0.019996       0.050000 
      2.887227       -0.019996       0.060000 
      2.902399       -0.019996       0.070000 
      2.918279       -0.019996       0.020000 
      2.933210       -0.019996       0.000000 
      2.949442       -0.019996       0.040000 
      2.964981       -0.019996       0.040000 
      2.979384       -0.019996       0.130000 
      2.994817       -0.019996       0.010000 
      3.011216       -0.019996       0.060000 
      3.025338       -0.019996       0.070000 
      3.042075       -0.019996       0.050000 
      3.057620       -0.019996       0.120000 
      3.072940       -0.019996       0.000000 
      3.088372       -0.019982       0.100000 
      3.103622       -0.019553       0.100000 
      3.119745       -0.014597       0.070000 
      3.135247       0.004201       0.000000 
      3.150342       0.019899       0.050000 
      3.165460       0.004201       0.030000 
      3.181197       -0.014597       0.040000 
      3.196967       -0.019553       0.030000 
      3.212633       -0.019982       0.030000 
      3.243162       -0.019996       0.040000 
      3.260234       -0.019995       0.070000 
      3.276061       -0.019969       0.000000 
      3.291655       -0.019109       0.030000 
      3.306457       -0.009198       0.080000 
      3.322521       0.028399       0.020000 
      3.337444       0.059806       0.100000 
      3.352405       0.028842       0.010000 
      3.367444       -0.003798       0.030000 
      3.382747       0.005114       0.100000 
      3.398199       0.020812       0.080000 
      3.412591       0.015000       0.170000 
      3.428768       0.033798       0.120000 
      3.444194       0.060236       0.050000 
      3.460149       0.028412       0.010000 
      3.490358       -0.009197       0.030000 
      3.506073       -0.019109       0.010000 
      3.521083       -0.019969       0.020000 
      3.535950       -0.019995       0.060000 
      3.552669       -0.019996       0.050000 
      3.582692       -0.019996       0.010000 
      3.598547       -0.019996       0.070000 
      3.614315       -0.019996       0.040000 
      3.628764       -0.019996       0.060000 
      3.643925       -0.019996       0.000000 
      3.660973       -0.019996       0.020000 
      3.675761       -0.019996       0.100000 
      3.692271       -0.019996       0.050000 
      3.706948       -0.019996       0.030000 
      3.737724       -0.019996       0.090000 
      3.753333       -0.019996       0.020000 
      3.770002       -0.019996       0.130000 
      3.785317       -0.019996       0.120000 
      3.800600       -0.019982       0.150000 
      3.816014       -0.019553       0.060000 
      3.832376       -0.014597       0.010000 
      3.863015       0.004201       0.080000 
      3.878790       0.019899       0.090000 
      3.892924       0.004201       0.130000 
      3.908974       -0.014597       0.070000 
      3.926765       -0.019553       0.040000 
      3.941844       -0.019982       0.060000 
      3.972777       -0.019996       0.020000 
      3.990377       -0.019996       0.140000 
      4.005075       -0.019996       0.050000 
      4.021091       -0.019996       0.010000 
      4.036664       -0.019996       0.040000 
      4.050675       -0.019996       0.090000 
      4.082077       -0.019996       0.010000 
      4.099165       -0.019996       0.060000 
      4.115077       -0.019996       0.110000 
      4.130596       -0.019996       0.020000 
      4.146795       -0.019996       0.020000 
      4.161180       -0.019996       0.040000 
      4.176980       -0.019996       0.100000 
      4.193118       -0.019996       0.000000 
      4.208253       -0.019996       0.010000 
      4.223475       -0.019996       0.120000 
      4.238714       -0.019996       0.040000 
      4.254930       -0.019996       0.010000 
      4.270475       -0.019996       0.050000 
      4.286927       -0.019996       0.110000 
      4.302305       -0.019996       0.000000 
      4.318675       -0.019996       0.040000 
      4.332860       -0.019996       0.020000 
      4.348207       -0.019996       0.030000 
      4.364118       -0.019996       0.070000 
      4.379327       -0.019996       0.060000 
      4.394821       -0.019996       0.010000 
      4.410107       -0.019996       0.040000 
      4.425280       -0.019996       0.020000 
      4.439719       -0.019996       0.080000 
      4.456865       -0.019996       0.070000 
      4.471926       -0.019996       0.090000 
      4.486405       -0.019996       0.000000 
      4.502666       -0.019996       0.100000 
      4.517472       -0.019996       0.060000 
      4.532094       -0.019996       0.050000 
      4.547870       -0.019996       0.060000 
      4.562768       -0.019996       0.050000 
      4.578973       -0.019996       0.090000 
      4.595433       -0.019996       0.150000 
      4.609691       -0.019996       0.010000 
      4.640643       -0.019996       0.040000 
      4.657399       -0.019996       0.010000 
      4.673654       -0.019996       0.020000 
      4.689659       -0.019996       0.040000 
      4.706041       -0.019996       0.000000 
      4.721377       -0.019996       0.050000 
      4.736504       -0.019996       0.000000 
      4.752319       -0.019996       0.010000 
      4.766948       -0.019996       0.020000 
      4.797745       -0.019996       0.070000 
      4.813589       -0.019996       0.010000 
      4.829716       -0.019996       0.120000 
      4.844330       -0.019996       0.050000 
      4.860724       -0.019996       0.070000 
      4.876724       -0.019996       0.100000 
      4.890868       -0.019996       0.060000 
      4.906562       -0.019996       0.030000 
      4.921792       -0.019996       0.130000 
      4.952872       -0.019996       0.160000 
      4.969121       -0.019996       0.050000 
      4.985480       -0.019996       0.010000 
      4.999689       -0.019996       0.060000 
      5.015264       -0.020009       0.010000 
      5.030913       -0.020439       0.220000 
      5.045772       -0.025395       0.010000 
      5.060632       -0.044193       0.270000 
      5.076774       -0.059890       0.090000 
      5.092485       -0.044193       0.170000 
      5.107740       -0.025395       0.000000 
      5.122972       -0.020439       0.130000 
      5.138793       -0.020009       0.150000 
      5.154516       -0.019996       0.120000 
      5.170563       -0.019996       0.060000 
      5.187038       -0.019996       0.090000 
      5.203195       -0.019996       0.070000 
      5.217693       -0.019996       0.060000 
      5.233350       -0.019996       0.030000 
      5.248772       -0.019996       0.020000 
      5.264431       -0.019996       0.070000 
      5.279792       -0.019996       0.080000 
      5.295118       -0.019996       0.030000 
      5.310400       -0.019996       0.140000 
      5.325414       -0.019996       0.030000 
      5.339756       -0.019996       0.010000 
      5.371497       -0.019996       0.050000 
      5.388172       -0.019996       0.030000 
      5.403676       -0.019996       0.020000 
      5.419675       -0.019996       0.030000 
      5.435066       -0.019996       0.090000 
      5.449209       -0.019996       0.010000 
      5.465761       -0.019996       0.080000 
      5.480491       -0.019996       0.130000 
      5.496792       -0.019982       0.150000 
      5.512056       -0.019553       0.040000 
      5.527578       -0.014597       0.100000 
      5.543631       0.004201       0.010000 
      5.558853       0.019899       0.090000 
      5.574032       0.004201       0.020000 
      5.589567       -0.014597       0.170000 
      5.605450       -0.019553       0.010000 
      5.621022       -0.019982       0.110000 
      5.637333       -0.019996       0.070000 
      5.653407       -0.019996       0.100000 
      5.667760       -0.019996       0.020000 
      5.684216       -0.019996       0.100000 
      5.699375       -0.019996       0.080000 
      5.715044       -0.019996       0.050000 
      5.729625       -0.019996       0.000000 
      5.744769       -0.019996       0.090000 
      5.760220       -0.019996       0.010000 
      5.776753       -0.019996       0.070000 
      5.791939       -0.019996       0.030000 
      5.807762       -0.019996       0.030000 
      5.823150       -0.019996       0.010000 
      5.838575       -0.019996       0.090000 
      5.853529       -0.019996       0.040000 
      5.870768       -0.019996       0.110000 
      5.885673       -0.019996       0.100000 
      5.900392       -0.019996       0.080000 
      5.915389       -0.019996       0.100000 
      5.931383       -0.019996       0.070000 
      5.947242       -0.019996       0.040000 
      5.963230       -0.019996       0.050000 
      5.979037       -0.019996       0.010000 
      6.010781       -0.019996       0.060000 
      6.026130       -0.019996       0.000000 
      6.042467       -0.019982       0.060000 
      6.057459       -0.019553       0.020000 
      6.073415       -0.014597       0.090000 
      6.090339       0.004201       0.030000 
      6.106327       0.019899       0.070000 
      6.122285       0.004201       0.080000 
      6.137085       -0.014597       0.110000 
      6.152463       -0.019553       0.030000 
      6.168438       -0.019982       0.020000 
      6.185423       -0.019996       0.060000 
      6.200528       -0.019996       0.080000 
      6.215522       -0.019996       0.060000 
      6.229516       -0.019996       0.050000 
      6.259661       -0.019996       0.040000 
      6.274787       -0.019996       0.080000 
      6.291266       -0.019996       0.010000 
      6.305537       -0.019996       0.040000 
      6.320706       -0.019996       0.050000 
      6.336369       -0.019996       0.010000 
      6.353072       -0.019996       0.070000 
      6.368972       -0.019996       0.090000 
      6.385013       -0.019996       0.080000 
      6.400696       -0.019996       0.130000 
      6.416095       -0.019996       0.020000 
      6.431473       -0.019996       0.010000 
      6.446575       -0.019996       0.010000 
      6.462264       -0.019996       0.060000 
      6.478588       -0.019996       0.000000 
      6.493583       -0.019996       0.010000 
      6.507679       -0.019996       0.080000 
      6.524824       -0.019996       0.090000 
      6.538646       -0.019996       0.020000 
      6.555165       -0.019996       0.040000 
      6.584750       -0.019996       0.060000 
      6.601127       -0.019996       0.020000 
      6.616725       -0.019996       0.030000 
      6.632485       -0.019996       0.040000 
      6.649769       -0.019996       0.050000 
      6.663311       -0.019996       0.070000 
      6.680094       -0.019996       0.050000 
      6.694313       -0.019996       0.100000 
      6.710946       -0.019996       0.050000 
      6.725549       -0.019996       0.070000 
      6.741631       -0.019996       0.030000 
      6.757749       -0.019996       0.000000 
      6.772790       -0.019996       0.030000 
      6.788767       -0.019996       0.040000 
      6.804573       -0.019996       0.010000 
      6.821110       -0.019996       0.040000 
      6.835799       -0.019996       0.060000 
      6.851094       -0.019996       0.120000 
      6.867691       -0.019996       0.080000 
      6.881900       -0.019996       0.130000 
      6.896996       -0.019996       0.070000 
      6.914108       -0.019996       0.040000 
      6.930035       -0.019996       0.000000 
      6.944282       -0.019996       0.100000 
      6.959750       -0.019996       0.060000 
      6.976437       -0.019996       0.030000 
      6.992469       -0.019996       0.020000 
      7.008707       -0.019996       0.070000 
      7.024224       -0.019996       0.070000 
      7.041131       -0.019996       0.030000 
      7.056742       -0.019996       0.010000 
      7.085281       -0.019996       0.080000 
      7.100315       -0.019996       0.030000 
      7.116492       -0.019996       0.130000 
      7.132320       -0.019996       0.010000 
      7.147670       -0.019996       0.070000 
      7.162042       -0.019996       0.040000 
      7.178341       -0.019996       0.070000 
      7.193091       -0.019996       0.060000 
      7.208766       -0.019996       0.200000 
      7.224247       -0.019996       0.070000 
      7.239158       -0.019996       0.150000 
      7.255579       -0.019996       0.040000 
      7.270652       -0.019996       0.080000 
      7.287393       -0.019996       0.080000 
      7.302714       -0.019996       0.140000 
      7.318699       -0.019996       0.090000 
      7.333934       -0.019996       0.110000 
      7.350868       -0.019996       0.010000 
      7.364770       -0.019996       0.100000 
      7.379220       -0.019996       0.050000 
      7.395797       -0.019996       0.010000 
      7.411047       -0.019996       0.010000 
      7.426765       -0.019996       0.080000 
      7.440846       -0.019996       0.030000 
      7.457777       -0.019996       0.080000 
      7.473086       -0.019996       0.020000 
      7.490061       -0.019996       0.010000 
      7.505254       -0.019996       0.050000 
      7.520226       -0.019996       0.020000 
      7.536229       -0.019996       0.010000 
      7.566261       -0.019996       0.110000 
      7.582206       -0.019996       0.040000 
      7.597558       -0.019996       0.100000 
      7.613546       -0.019996       0.040000 
      7.628588       -0.019996       0.110000 
      7.658426       -0.019996       0.090000 
      7.674773       -0.019996       0.050000 
      7.690705       -0.019996       0.050000 
      7.705863       -0.019996       0.090000 
      7.721473       -0.019996       0.020000 
      7.736463       -0.019996       0.010000 
      7.751249       -0.019996       0.200000 
      7.766566       -0.019996       0.070000 
      7.781898       -0.019996       0.130000 
      7.796510       -0.019996       0.050000 
      7.811619       -0.019996       0.060000 
      7.827507       -0.019996       0.080000 
      7.843431       -0.019996       0.090000 
      7.859325       -0.019996       0.080000 
      7.875065       -0.019996       0.180000 
      7.889807       -0.019996       0.200000 
      7.906405       -0.019996       0.020000 
      7.921396       -0.019996       0.050000 
      7.937529       -0.019996       0.110000 
      7.953308       -0.019996       0.070000 
      7.968898       -0.019996       0.070000 
      7.984772       -0.019996       0.050000 
      7.999118       -0.019996       0.010000 
      8.014362       -0.019996       0.030000 
      8.029749       -0.019996       0.050000 
      8.046160       -0.019996       0.070000 
      8.075585       -0.019996       0.060000 
      8.091874       -0.019996       0.070000 
      8.108634       -0.019996       0.020000 
      8.122694       -0.019996       0.050000 
      8.137571       -0.019996       0.050000 
      8.153950       -0.019996       0.090000 
      8.168722       -0.019996       0.550000 
      8.184361       -0.019996       0.660000 
      8.199752       -0.019996       7.140000 
      8.215662       -0.019996       11.080000 
      8.232193       -0.019996       13.350000 
      8.247716       -0.019996       15.450000 
      8.262913       -0.019996       16.030000 
      8.278399       -0.019996       19.990000 
      8.293900       -0.019996       22.900000 
      8.308978       -0.019996       26.670000 
      8.325147       -0.019996       37.290000 
      8.341119       -0.019996       43.900000 
      8.356554       -0.019996       59.300000 
      8.371515       -0.019982       67.530000 
      8.386983       -0.019552       83.930000 
      8.403334       -0.014583       93.780000 
      8.418449       0.004685       105.350000 
      8.433553       0.026669       130.300000 
      8.449488       0.046047       141.840000 
      8.466712       0.118196       162.190000 
      8.481840       0.249581       172.940000 
      8.497424       0.446837       197.470000 
      8.514381       0.682563       209.160000 
      8.529404       0.772264       225.970000 
      8.544706       0.758038       232.890000 
      8.560760       0.813188       240.110000 
      8.575516       0.893859       258.040000 
      8.591775       0.948623       267.520000 
      8.607809       0.974244       281.590000 
      8.623997       0.984114       285.460000 
      8.639977       1.038549       289.840000 
      8.655488       1.280534       292.420000 
      8.670484       1.679570       296.100000 
      8.686958       1.924657       306.430000 
      8.702925       2.016912       312.060000 
      8.717473       2.197008       321.090000 
      8.733733       2.511397       323.670000 
      8.748091       2.769094       325.240000 
      8.764428       2.911787       328.120000 
      8.780008       2.980447       331.660000 
      8.798757       3.053634       339.920000 
      8.810852       3.215112       344.560000 
      8.826377       3.488504       349.090000 
      8.842410       3.787062       352.810000 
      8.857595       3.943929       352.640000 
      8.874637       3.977264       351.440000 
      8.888827       3.980850       350.780000 
      8.904290       3.992212       350.890000 
      8.919951       4.047337       352.790000 
      8.936182       4.167573       354.090000 
      8.949926       4.330225       355.460000 
      8.965330       4.506500       356.100000 
      8.980624       4.682165       357.340000 
      8.997517       4.858409       360.910000 
      9.011860       4.956540       362.080000 
      9.027083       4.978177       362.530000 
      9.043170       4.979950       360.950000 
      9.057804       4.980004       356.920000 
      9.074658       4.980004       355.380000 
      9.089631       4.980004       354.720000 
      9.105433       4.980004       354.360000 
      9.121021       4.980004       354.430000 
      9.136941       4.980004       354.710000 
      9.151313       4.980004       354.440000 
      9.167560       4.980004       354.680000 
      9.183211       4.980004       354.730000 
      9.198737       4.980018       353.890000 
      9.215438       4.980475       351.220000 
      9.230910       4.986371       350.210000 
      9.246060       5.017740       350.590000 
      9.261585       5.103482       351.280000 
      9.277553       5.266134       340.570000 
      9.291689       5.476903       229.510000 
      9.307833       5.676322       157.410000 
      9.322948       5.857952       29.070000 
      9.337456       5.956527       4.360000 
      9.353663       5.978177       9.110000 
      9.368662       5.979950       4.680000 
      9.384383       5.980004       5.530000 
      9.400639       5.980018       7.800000 
      9.415194       5.980447       5.650000 
      9.431686       5.985402       3.750000 
      9.447447       6.004057       5.980000 
      9.461695       6.014520       7.530000 
      9.478407       5.918257       5.850000 
      9.493573       5.334240       4.510000 
      9.509571       3.492337       4.930000 
      9.523956       0.983062       7.730000 
      9.539173       -0.023128       7.460000 
      9.554556       0.430681       5.500000 
      9.569631       0.869046       6.230000 
      9.586213       0.969414       7.650000 
      9.602208       0.953583       8.370000 
      9.617879       0.824641       7.520000 
      9.632130       0.519374       7.890000 
      9.648847       0.175591       9.180000 
      9.664810       -0.042863       8.690000 
      9.679940       -0.244639       7.770000 
      9.694985       -0.511441       7.570000 
      9.709820       -0.751305       8.650000 
      9.724566       -0.934309       8.430000 
      9.739794       -1.073722       5.920000 
      9.756423       -1.218665       5.690000 
      9.772068       -1.349897       6.440000 
      9.787910       -1.428510       7.330000 
      9.803675       -1.509961       6.480000 
      9.818957       -1.548579       5.520000 
      9.834783       -1.435152       6.300000 
      9.850071       -1.288229       7.090000 
      9.865386       -1.193156       6.420000 
      9.880998       -1.181095       5.720000 
      9.896455       -1.212826       6.700000 
      9.912110       -1.233035       7.420000 
      9.926504       -1.284074       7.270000 
      9.942803       -1.300227       6.380000 
      9.957140       -1.258105       6.720000 
      9.973110       -1.252320       8.320000 
      9.989157       -1.263890       8.210000 
      10.004448       -1.264859       7.540000 
      10.019754       -1.244180       7.480000 
      10.034567       -1.220022       8.250000 
      10.050967       -1.196685       8.410000 
      10.066676       -1.185514       7.460000 
      10.081775       -1.219969       6.980000 
      10.097219       -1.253632       7.450000 
      10.112311       -1.233864       7.690000 
      10.127333       -1.188645       6.350000 
      10.142339       -1.198983       5.930000 
      10.158421       -1.289899       6.770000 
      10.173246       -1.300255       7.040000 
      10.188482       -1.253233       6.660000 
      10.205324       -1.299400       5.960000 
      10.220007       -1.363903       6.460000 
      10.235663       -1.418196       7.240000 
      10.252651       -1.453551       6.770000 
      10.268731       -1.432924       6.240000 
      10.284176       -1.376114       7.050000 
      10.300080       -1.330255       7.690000 
      10.315671       -1.327263       7.230000 
      10.331271       -1.336469       6.910000 
      10.346761       -1.325434       7.630000 
      10.362517       -1.243224       8.140000 
      10.375465       -1.169028       8.030000 
      10.390837       -1.160349       7.040000 
      10.407583       -1.211549       7.170000 
      10.422741       -1.239197       7.660000 
      10.437590       -1.253205       7.530000 
      10.453439       -1.273289       6.970000 
      10.467935       -1.231166       6.610000 
      10.485688       -1.155505       7.030000 
      10.500381       -1.174716       7.220000 
      10.514493       -1.211882       6.490000 
      10.530785       -1.163075       6.420000 
      10.546852       -1.160377       6.900000 
      10.561874       -1.195714       7.090000 
      10.575967       -1.167973       6.490000 
      10.591125       -1.130338       6.410000 
      10.607634       -1.115496       6.680000 
      10.622677       -1.096269       7.320000 
      10.638617       -1.085501       7.100000 
      10.653191       -1.119996       6.850000 
      10.668952       -1.154478       7.090000 
      10.685098       -1.143333       7.520000 
      10.700129       -1.120896       7.440000 
      10.716757       -1.107940       7.110000 
      10.732597       -1.139751       7.370000 
      10.746935       -1.229394       7.600000 
      10.763632       -1.267446       7.540000 
      10.778944       -1.224925       7.010000 
      10.793473       -1.190859       6.910000 
      10.808769       -1.214583       7.400000 
      10.825030       -1.223995       7.250000 
      10.840772       -1.167961       6.890000 
      10.856379       -1.101655       6.670000 
      10.872196       -1.057261       6.960000 
      10.887383       -1.061774       6.970000 
      10.902358       -1.120010       6.670000 
      10.918079       -1.178701       6.510000 
      10.933398       -1.189459       7.030000 
      10.948983       -1.178732       7.230000 
      10.963354       -1.184544       6.750000 
      10.979551       -1.160830       6.750000 
      10.995087       -1.116440       7.050000 
      11.010601       -1.142062       7.430000 
      11.026176       -1.228438       7.170000 
      11.041684       -1.274688       7.040000 
      11.057545       -1.251807       7.230000 
      11.073578       -1.241978       7.490000 
      11.089600       -1.226751       7.270000 
      11.104855       -1.239764       7.000000 
      11.120681       -1.311039       7.290000 
      11.136485       -1.352178       7.470000 
      11.152506       -1.345108       7.040000 
      11.169116       -1.322197       6.880000 
      11.184304       -1.301141       6.990000 
      11.199476       -1.231707       7.170000 
      11.214201       -1.199856       6.910000 
      11.230887       -1.257246       6.770000 
      11.246820       -1.276887       6.880000 
      11.261791       -1.251931       7.240000 
      11.277522       -1.241483       7.150000 
      11.291522       -1.305724       6.860000 
      11.307200       -1.392087       7.010000 
      11.323138       -1.399328       7.210000 
      11.338697       -1.338837       7.230000 
      11.353325       -1.326268       7.100000 
      11.369686       -1.336150       7.000000 
      11.385600       -1.322707       7.280000 
      11.401032       -1.317795       7.340000 
      11.416691       -1.311014       7.030000 
      11.431558       -1.359531       7.050000 
      11.446982       -1.438293       7.080000 
      11.462333       -1.430280       7.340000 
      11.477556       -1.379702       7.210000 
      11.493161       -1.420882       6.860000 
      11.508835       -1.471088       6.960000 
      11.524439       -1.457246       7.100000 
      11.539365       -1.471548       7.010000 
      11.554648       -1.490412       6.880000 
      11.571247       -1.498900       6.920000 
      11.586599       -1.521891       7.110000 
      11.600601       -1.544124       7.120000 
      11.615937       -1.583824       6.940000 
      11.632147       -1.651214       6.880000 
      11.648232       -1.745200       7.230000 
      11.663657       -1.739942       7.280000 
      11.679749       -1.664530       7.000000 
      11.709378       -1.627557       7.290000 
      11.724741       -1.691324       7.220000 
      11.741777       -1.668333       7.040000 
      11.757362       -1.573860       7.160000 
      11.772698       -1.552764       7.290000 
      11.787515       -1.553603       7.200000 
      11.803789       -1.522818       7.000000 
      11.819565       -1.501616       6.980000 
      11.834782       -1.587355       7.110000 
      11.849082       -1.716270       7.120000 
      11.865548       -1.762532       7.030000 
      11.880427       -1.697476       6.950000 
      11.896117       -1.630323       7.050000 
      11.912306       -1.585443       7.130000 
      11.926589       -1.520480       7.080000 
      11.943010       -1.461344       7.020000 
      11.958761       -1.451862       7.000000 
      11.973139       -1.477457       7.120000 
      11.989627       -1.528053       7.120000 
      12.005223       -1.599355       7.020000 
      12.020185       -1.603785       7.080000 
      12.034547       -1.566259       7.170000 
      12.049834       -1.586373       7.140000 
      12.065408       -1.660333       7.000000 
      12.081491       -1.707385       7.000000 
      12.096813       -1.707385       7.150000 
      12.112912       -1.660360       7.160000 
      12.128526       -1.587300       6.970000 
      12.143802       -1.578374       7.020000 
      12.159383       -1.667947       7.090000 
      12.173599       -1.746806       7.010000 
      12.189610       -1.678258       6.940000 
      12.205362       -1.557278       7.000000 
      12.219522       -1.549248       7.110000 
      12.234735       -1.634348       7.190000 
      12.251869       -1.699785       7.060000 
      12.268123       -1.702472       7.100000 
      12.283115       -1.713670       7.150000 
      12.298439       -1.700671       7.190000 
      12.315073       -1.633949       7.150000 
      12.329499       -1.607954       7.130000 
      12.346568       -1.627194       7.210000 
      12.361372       -1.679215       7.160000 
      12.377762       -1.753564       7.060000 
      12.392956       -1.772376       7.050000 
      12.407809       -1.719109       7.090000 
      12.424345       -1.656777       7.010000 
      12.439590       -1.637549       7.090000 
      12.469503       -1.674246       7.030000 
      12.485396       -1.723579       7.190000 
      12.501132       -1.703798       7.210000 
      12.516150       -1.642492       7.090000 
      12.532419       -1.646023       7.070000 
      12.547413       -1.729891       7.120000 
      12.564338       -1.768346       7.150000 
      12.580027       -1.735723       7.130000 
      12.594240       -1.739254       7.260000 
      12.611103       -1.794398       7.220000 
      12.626436       -1.773303       7.110000 
      12.642487       -1.690470       7.080000 
      12.658343       -1.662580       7.160000 
      12.673151       -1.694939       7.130000 
      12.688448       -1.722166       7.050000 
      12.704616       -1.686802       7.110000 
      12.720354       -1.623140       7.150000 
      12.734806       -1.635707       7.210000 
      12.751661       -1.620449       7.080000 
      12.767722       -1.546533       7.080000 
      12.782768       -1.559589       7.190000 
      12.798096       -1.688490       7.170000 
      12.813484       -1.806980       7.150000 
      12.829148       -1.788848       7.110000 
      12.843817       -1.678372       7.050000 
      12.859588       -1.580089       7.080000 
      12.876685       -1.598984       7.160000 
      12.890158       -1.632549       7.170000 
      12.907194       -1.627579       7.110000 
      12.923024       -1.574303       7.190000 
      12.938736       -1.532997       7.160000 
      12.953453       -1.607536       7.110000 
      12.969601       -1.637352       7.200000 
      12.984532       -1.592365       7.190000 
      12.999781       -1.601562       7.150000 
      13.015511       -1.716035       7.040000 
      13.030466       -1.810899       7.100000 
      13.044497       -1.810153       7.200000 
      13.060814       -1.770206       7.160000 
      13.077026       -1.807039       7.080000 
      13.093207       -1.879131       7.040000 
      13.108168       -1.907411       7.140000 
      13.122126       -1.889459       7.120000 
      13.137087       -1.850008       7.090000 
      13.152568       -1.824952       7.010000 
      13.168469       -1.809224       7.110000 
      13.183698       -1.766646       7.150000 
      13.198695       -1.720953       7.140000 
      13.214535       -1.750049       7.170000 
      13.229308       -1.794855       7.210000 
      13.245272       -1.768417       7.130000 
      13.260411       -1.736623       7.120000 
      13.274372       -1.750492       7.120000 
      13.290771       -1.784571       7.210000 
      13.306569       -1.789943       7.180000 
      13.320966       -1.779631       7.130000 
      13.335926       -1.795328       7.170000 
      13.351896       -1.808727       7.110000 
      13.367233       -1.789056       7.210000 
      13.383187       -1.744609       7.170000 
      13.397933       -1.700755       7.080000 
      13.412969       -1.669330       7.110000 
      13.428128       -1.642462       7.180000 
      13.444156       -1.615997       7.240000 
      13.459292       -1.655031       7.110000 
      13.474252       -1.719925       7.200000 
      13.488148       -1.719096       7.180000 
      13.504482       -1.708811       7.120000 
      13.520464       -1.731596       7.110000 
      13.537100       -1.724978       7.080000 
      13.551828       -1.728483       7.170000 
      13.566840       -1.756789       7.140000 
      13.580755       -1.742351       7.090000 
      13.597760       -1.727250       7.120000 
      13.613514       -1.723970       7.170000 
      13.628860       -1.740675       7.130000 
      13.644084       -1.739210       7.100000 
      13.659335       -1.724508       7.170000 
      13.674737       -1.714583       7.200000 
      13.689932       -1.690399       7.190000 
      13.705206       -1.655462       7.190000 
      13.720962       -1.650519       7.140000 
      13.736733       -1.666659       7.170000 
      13.752486       -1.680101       7.010000 
      13.768393       -1.724911       7.060000 
      13.783693       -1.777775       7.190000 
      13.799022       -1.772402       7.170000 
      13.814390       -1.695745       7.130000 
      13.829865       -1.620536       7.140000 
      13.845833       -1.616396       7.200000 
      13.861390       -1.617379       7.090000 
      13.876359       -1.612812       7.070000 
      13.890540       -1.662175       7.190000 
      13.907351       -1.682218       7.170000 
      13.922239       -1.669318       7.170000 
      13.937460       -1.637881       7.170000 
      13.953050       -1.579641       7.190000 
      13.968328       -1.484200       7.250000 
      13.984372       -1.441634       7.210000 
      13.998680       -1.541979       7.200000 
      14.014048       -1.636950       7.100000 
      14.029471       -1.631139       7.120000 
      14.044461       -1.570662       7.220000 
      14.060193       -1.505668       7.150000 
      14.075286       -1.483743       7.100000 
      14.090777       -1.509711       7.260000 
      14.106708       -1.578245       7.160000 
      14.121787       -1.593942       7.100000 
      14.135624       -1.528522       7.100000 
      14.166401       -1.489129       7.120000 
      14.182453       -1.511067       7.030000 
      14.197398       -1.589943       7.070000 
      14.213113       -1.653135       7.180000 
      14.228568       -1.656692       7.160000 
      14.245154       -1.616881       7.170000 
      14.260993       -1.565290       7.180000 
      14.276439       -1.582386       7.240000 
      14.292202       -1.632925       7.200000 
      14.306076       -1.647359       7.190000 
      14.321865       -1.585847       7.060000 
      14.337366       -1.507567       7.070000 
      14.352375       -1.535251       7.210000 
      14.369915       -1.616408       7.100000 
      14.383885       -1.616824       7.060000 
      14.399911       -1.606114       7.150000 
      14.414943       -1.620425       7.150000 
      14.429671       -1.638793       7.120000 
      14.446460       -1.640166       7.130000 
      14.462394       -1.616811       7.040000 
      14.477354       -1.581899       7.110000 
      14.492424       -1.511040       7.050000 
      14.507674       -1.496299       7.080000 
      14.522778       -1.554477       7.070000 
      14.539263       -1.566990       7.100000 
      14.555187       -1.493986       7.150000 
      14.569782       -1.404756       7.130000 
      14.585768       -1.348801       7.120000 
      14.601318       -1.317810       7.110000 
      14.616725       -1.371712       7.060000 
      14.632822       -1.498789       7.090000 
      14.648973       -1.573357       7.120000 
      14.663453       -1.565152       7.130000 
      14.680150       -1.537534       7.080000 
      14.696422       -1.479146       7.150000 
      14.711050       -1.463642       7.200000 
      14.726650       -1.500229       7.130000 
      14.741811       -1.564859       7.080000 
      14.757456       -1.607775       7.170000 
      14.772691       -1.606538       7.090000 
      14.788928       -1.550421       7.240000 
      14.804249       -1.448778       7.160000 
      14.819694       -1.434892       7.150000 
      14.834280       -1.536079       7.200000 
      14.850414       -1.548178       7.130000 
      14.867525       -1.491261       7.100000 
      14.882857       -1.475144       7.150000 
      14.898606       -1.394813       7.110000 
      14.913682       -1.264613       7.090000 
      14.929030       -1.261749       7.230000 
      14.943366       -1.398067       7.160000 
      14.960355       -1.475504       7.160000 
      14.974700       -1.493113       7.190000 
      14.991581       -1.485819       7.120000 
      15.005740       -1.460860       7.150000 
      15.021194       -1.479658       7.120000 
      15.037738       -1.525324       7.070000 
      15.051753       -1.519042       7.150000 
      15.067072       -1.501599       7.220000 
      15.083551       -1.484004       7.050000 
      15.097762       -1.365813       7.100000 
      15.112881       -1.237109       7.030000 
      15.129945       -1.246201       7.140000 
      15.144956       -1.338778       7.150000 
      15.159865       -1.436635       7.050000 
      15.175083       -1.494331       7.100000 
      15.190421       -1.539624       7.080000 
      15.204774       -1.489030       7.120000 
      15.221891       -1.412838       7.180000 
      15.236727       -1.391343       7.070000 
      15.253547       -1.367559       7.070000 
      15.268653       -1.416492       7.080000 
      15.284534       -1.450851       7.090000 
      15.300162       -1.443793       7.180000 
      15.315644       -1.493959       7.230000 
      15.330079       -1.527025       7.210000 
      15.346120       -1.440206       7.100000 
      15.362107       -1.329896       7.030000 
      15.377106       -1.324121       7.200000 
      15.393520       -1.340634       7.220000 
      15.408946       -1.360457       7.220000 
      15.423959       -1.420815       7.120000 
      15.438538       -1.488170       7.150000 
      15.454497       -1.521670       7.080000 
      15.470286       -1.486372       7.110000 
      15.485554       -1.418641       7.140000 
      15.503208       -1.422764       7.190000 
      15.517890       -1.434738       7.200000 
      15.532102       -1.429935       7.120000 
      15.549102       -1.444636       7.000000 
      15.564353       -1.460803       7.180000 
      15.580334       -1.455434       7.190000 
      15.595358       -1.479161       7.110000 
      15.610965       -1.523525       7.190000 
      15.626351       -1.497043       7.180000 
      15.641794       -1.400741       7.130000 
      15.657663       -1.316440       7.040000 
      15.671999       -1.302125       7.130000 
      15.688325       -1.315080       7.190000 
      15.702357       -1.319996       7.110000 
      15.717966       -1.324952       7.150000 
      15.733529       -1.339250       7.150000 
      15.750291       -1.341522       7.180000 
      15.764616       -1.333492       7.140000 
      15.780149       -1.361220       7.130000 
      15.795670       -1.371145       7.160000 
      15.812066       -1.382303       7.070000 
      15.826364       -1.426736       7.050000 
      15.841851       -1.412741       7.180000 
      15.858369       -1.386899       7.280000 
      15.873409       -1.399276       7.030000 
      15.889338       -1.428534       6.990000 
      15.905308       -1.397916       7.130000 
      15.920265       -1.306181       7.120000 
      15.937357       -1.241563       7.210000 
      15.952101       -1.254120       7.170000 
      15.969068       -1.302983       7.160000 
      15.983614       -1.367004       7.190000 
      15.998976       -1.345991       7.140000 
      16.014903       -1.254576       7.190000 
      16.030832       -1.270331       7.160000 
      16.046892       -1.364347       7.060000 
      16.062783       -1.452705       7.250000 
      16.079738       -1.477305       7.200000 
      16.094697       -1.438336       7.140000 
      16.110655       -1.377390       7.140000 
      16.126685       -1.339320       7.110000 
      16.143571       -1.354948       7.130000 
      16.159541       -1.330308       7.110000 
      16.175572       -1.263988       7.120000 
      16.190730       -1.253704       7.110000 
      16.206702       -1.276072       7.190000 
      16.220752       -1.330821       7.230000 
      16.236904       -1.414073       7.110000 
      16.251175       -1.476458       7.070000 
      16.266314       -1.467420       7.090000 
      16.281965       -1.377014       7.110000 
      16.297175       -1.307054       7.150000 
      16.313234       -1.359049       7.110000 
      16.344191       -1.455819       7.140000 
      16.361244       -1.500572       7.260000 
      16.376131       -1.404754       7.270000 
      16.392138       -1.255933       7.200000 
      16.408285       -1.228719       7.140000 
      16.425205       -1.315055       7.120000 
      16.439970       -1.478784       7.140000 
      16.455198       -1.574453       7.140000 
      16.470175       -1.532536       7.050000 
      16.485498       -1.428912       7.130000 
      16.500700       -1.354146       7.170000 
      16.517129       -1.316480       7.210000 
      16.531374       -1.350076       7.220000 
      16.546758       -1.400214       7.250000 
      16.563323       -1.391714       7.240000 
      16.577960       -1.365249       7.120000 
      16.592986       -1.319982       7.120000 
      16.608636       -1.274299       7.240000 
      16.624839       -1.242892       7.180000 
      16.639846       -1.216037       7.190000 
      16.656736       -1.255905       7.140000 
      16.672748       -1.330294       7.210000 
      16.686953       -1.362561       7.190000 
      16.702271       -1.370662       7.130000 
      16.718394       -1.374246       7.160000 
      16.732758       -1.390412       7.100000 
      16.749128       -1.396201       7.150000 
      16.763840       -1.408314       7.170000 
      16.779637       -1.447279       7.100000 
      16.794047       -1.407811       7.060000 
      16.809976       -1.261747       7.140000 
      16.826593       -1.168560       7.120000 
      16.841642       -1.221823       7.160000 
      16.858614       -1.294923       7.110000 
      16.874723       -1.298887       7.200000 
      16.890755       -1.316925       7.230000 
      16.906227       -1.388047       7.140000 
      16.920337       -1.444205       7.120000 
      16.937345       -1.411385       7.210000 
      16.952956       -1.352347       7.180000 
      16.967624       -1.311497       7.160000 
      16.984267       -1.331720       7.190000 
      17.014966       -1.389903       7.160000 
      17.031348       -1.431165       7.150000 
      17.045504       -1.418582       7.090000 
      17.061756       -1.326295       7.110000 
      17.077434       -1.257318       7.190000 
      17.093643       -1.302581       7.130000 
      17.108541       -1.380044       7.160000 
      17.124579       -1.423595       7.180000 
      17.140316       -1.462064       7.270000 
      17.156785       -1.470161       7.180000 
      17.171737       -1.403869       7.160000 
      17.187606       -1.361760       7.130000 
      17.203112       -1.372945       7.100000 
      17.218985       -1.404325       7.120000 
      17.234738       -1.464832       7.210000 
      17.249514       -1.502831       7.220000 
      17.264988       -1.487713       7.190000 
      17.280849       -1.433824       7.120000 
      17.296941       -1.353233       7.100000 
      17.313056       -1.299883       7.140000 
      17.328916       -1.336619       7.140000 
      17.343613       -1.355351       7.140000 
      17.358768       -1.337078       7.140000 
      17.374979       -1.349051       7.160000 
      17.391037       -1.300684       7.240000 
      17.406610       -1.199010       7.180000 
      17.422006       -1.178787       7.230000 
      17.437764       -1.197155       7.140000 
      17.452868       -1.233049       7.170000 
      17.468563       -1.300214       7.110000 
      17.483781       -1.308714       7.150000 
      17.497895       -1.283714       7.120000 
      17.513438       -1.285390       7.190000 
      17.529177       -1.265316       7.140000 
      17.545894       -1.228550       7.110000 
      17.560863       -1.218695       7.230000 
      17.575753       -1.216440       7.130000 
      17.590817       -1.284198       7.160000 
      17.606462       -1.384420       7.150000 
      17.636744       -1.387727       7.150000 
      17.668722       -1.352680       7.060000 
      17.684676       -1.339347       7.150000 
      17.699043       -1.314611       7.150000 
      17.715394       -1.362675       7.190000 
      17.730316       -1.451239       7.220000 
      17.746431       -1.480900       7.100000 
      17.761590       -1.378178       7.010000 
      17.776529       -1.220550       7.150000 
      17.791740       -1.134420       7.100000 
      17.807569       -1.114736       7.140000 
      17.823364       -1.169374       7.250000 
      17.838525       -1.293472       7.190000 
      17.854195       -1.331081       7.170000 
      17.870718       -1.248665       7.100000 
      17.886260       -1.166676       7.080000 
      17.901327       -1.146046       7.310000 
      17.917004       -1.142905       7.210000 
      17.932078       -1.144721       7.160000 
      17.947594       -1.214167       7.170000 
      17.962875       -1.265662       7.090000 
      17.978256       -1.238407       7.200000 
      17.992917       -1.254977       7.190000 
      18.009275       -1.295701       7.100000 
      18.025039       -1.272916       7.200000 
      18.040637       -1.249149       7.200000 
      18.056604       -1.231623       7.150000 
      18.072068       -1.185528       7.150000 
      18.086455       -1.185514       7.120000 
      18.102514       -1.231194       7.170000 
      18.117223       -1.244206       7.250000 
      18.132480       -1.254521       7.170000 
      18.148897       -1.284087       7.230000 
      18.164020       -1.279145       7.250000 
      18.178987       -1.230808       7.200000 
      18.193974       -1.210611       7.160000 
      18.208298       -1.242435       7.220000 
      18.224581       -1.273789       7.220000 
      18.239321       -1.312797       7.180000 
      18.255141       -1.319039       7.210000 
      18.272080       -1.250492       7.130000 
      18.286830       -1.202141       7.140000 
      18.301643       -1.245106       7.240000 
      18.318715       -1.294842       7.060000 
      18.333686       -1.272889       7.090000 
      18.348416       -1.249108       7.220000 
      18.363448       -1.230280       7.120000 
      18.379526       -1.168873       7.090000 
      18.396998       -1.107040       7.120000 
      18.412308       -1.080558       7.150000 
      18.427697       -1.090440       7.130000 
      18.442860       -1.090897       7.160000 
      18.458576       -1.086844       7.150000 
      18.474897       -1.142022       7.200000 
      18.488903       -1.256692       7.150000 
      18.504163       -1.327980       7.100000 
      18.518754       -1.267907       7.220000 
      18.535276       -1.195855       7.170000 
      18.551073       -1.192172       7.250000 
      18.565385       -1.195839       7.140000 
      18.583110       -1.203856       7.120000 
      18.597171       -1.235666       7.230000 
      18.612626       -1.238337       7.160000 
      18.628503       -1.219110       7.130000 
      18.643618       -1.190843       7.140000 
      18.658716       -1.156347       7.160000 
      18.674203       -1.160861       7.200000 
      18.690941       -1.209211       7.120000 
      18.706440       -1.230294       7.150000 
      18.721689       -1.209294       7.120000 
      18.737332       -1.227141       7.130000 
      18.753002       -1.276100       7.110000 
      18.768193       -1.335595       7.050000 
      18.783848       -1.366134       7.140000 
      18.799087       -1.300670       7.240000 
      18.814200       -1.247377       7.110000 
      18.829979       -1.202501       7.160000 
      18.845014       -1.187325       7.190000 
      18.860243       -1.216812       7.120000 
      18.875478       -1.168860       7.100000 
      18.906343       -1.120080       7.140000 
      18.922290       -1.137466       7.150000 
      18.937311       -1.144690       7.160000 
      18.952094       -1.155018       7.180000 
      18.968321       -1.190802       7.270000 
      18.982641       -1.219096       7.300000 
      18.998637       -1.237907       7.260000 
      19.014443       -1.230737       7.170000 
      19.029864       -1.185930       7.200000 
      19.045299       -1.190457       7.190000 
      19.060291       -1.249535       7.060000 
      19.074861       -1.254034       7.200000 
      19.090285       -1.208328       7.190000 
      19.106586       -1.189916       7.100000 
      19.122499       -1.154947       7.160000 
      19.137563       -1.079686       7.130000 
      19.153544       -1.032165       7.140000 
      19.168746       -1.027248       7.190000 
      19.183073       -1.056818       7.210000 
      19.198604       -1.130781       7.200000 
      19.214811       -1.232052       7.150000 
      19.229472       -1.288529       7.150000 
      19.245736       -1.249565       7.130000 
      19.260978       -1.220469       7.170000 
      19.276725       -1.260319       7.260000 
      19.291800       -1.272846       7.260000 
      19.306909       -1.218666       7.220000 
      19.322279       -1.150935       7.170000 
      19.337925       -1.107966       7.220000 
      19.354186       -1.110598       7.110000 
      19.370172       -1.164913       7.050000 
      19.385130       -1.199259       7.270000 
      19.401069       -1.186455       7.190000 
      19.416775       -1.207346       7.120000 
      19.432343       -1.266200       7.160000 
      19.448106       -1.231069       7.210000 
      19.462233       -1.161816       7.060000 
      19.478827       -1.124870       7.190000 
      19.494802       -1.117418       7.200000 
      19.509250       -1.105615       7.050000 
      19.525503       -1.135307       6.910000 
      19.540650       -1.197486       7.350000 
      19.557467       -1.194385       7.400000 
      19.571486       -1.114654       7.000000 
      19.586739       -1.086387       6.940000 
      19.600749       -1.112382       7.160000 
      19.617536       -1.122224       7.510000 
      19.633326       -1.134793       7.110000 
      19.648263       -1.109614       6.760000 
      19.663596       -1.060417       7.050000 
      19.680112       -1.050479       7.610000 
      19.695470       -1.060360       7.250000 
      19.709813       -1.044247       6.590000 
      19.725388       -1.026725       6.850000 
      19.740372       -1.036636       8.100000 
      19.756907       -1.092614       8.450000 
      19.772832       -1.140135       6.060000 
      19.788604       -1.098443       5.920000 
      19.803811       -1.066259       8.580000 
      19.818964       -1.091729       8.470000 
      19.833637       -1.120009       6.740000 
      19.848776       -1.148693       5.970000 
      19.865369       -1.178688       7.910000 
      19.879640       -1.160333       7.990000 
      19.894781       -1.115110       6.060000 
      19.911747       -1.126281       5.430000 
      19.927705       -1.160347       8.270000 
      19.942663       -1.167974       8.710000 
      19.956846       -1.165733       5.940000 
      19.973815       -1.150491       5.950000 
      19.988285       -1.155434       8.320000 
      20.004352       -1.189486       8.190000 
      20.021463       -1.202898       7.010000 
      20.037251       -1.165289       6.410000 
      20.052439       -1.110127       7.480000 
      20.067545       -1.101198       7.890000 
      20.083423       -1.109198       6.860000 
      20.098834       -1.089540       6.610000 
      20.114536       -1.050935       7.420000 
      20.130701       -1.037093       8.140000 
      20.145612       -1.074286       6.780000 
      20.161596       -1.125325       6.290000 
      20.177176       -1.124522       7.620000 
      20.191438       -1.128925       8.050000 
      20.207530       -1.162605       7.500000 
      20.222892       -1.171074       6.340000 
      20.237566       -1.180986       6.840000 
      20.252708       -1.145066       7.920000 
      20.269011       -1.114680       7.390000 
      20.284082       -1.136566       6.610000 
      20.298366       -1.138807       6.930000 
      20.314261       -1.124495       7.550000 
      20.330262       -1.114570       7.720000 
      20.345607       -1.089956       6.710000 
      20.359808       -1.050062       6.550000 
      20.376981       -1.026308       7.730000 
      20.391868       -1.026295       7.840000 
      20.407957       -1.049619       7.170000 
      20.422748       -1.084544       6.540000 
      20.439721       -1.089943       7.040000 
      20.454875       -1.079632       7.670000 
      20.470132       -1.095355       6.990000 
      20.484627       -1.109627       6.550000 
      20.501039       -1.100325       7.240000 
      20.516263       -1.099316       7.560000 
      20.532499       -1.116438       6.930000 
      20.547964       -1.117254       6.480000 
      20.562324       -1.111039       7.280000 
      20.579033       -1.074675       7.820000 
      20.594865       -1.055018       6.850000 
      20.609902       -1.060777       6.640000 
      20.626280       -1.044220       6.930000 
      20.641402       -1.025409       7.690000 
      20.656779       -1.020896       7.440000 
      20.673205       -1.025865       6.510000 
      20.688367       -1.050062       6.920000 
      20.704262       -1.090372       7.770000 
      20.721182       -1.119082       7.310000 
      20.736754       -1.137894       6.710000 
      20.752638       -1.130280       7.020000 
      20.768652       -1.080101       7.630000 
      20.784425       -1.061290       7.270000 
      20.799125       -1.090386       6.740000 
      20.814405       -1.108325       7.160000 
      20.830768       -1.089943       7.630000 
      20.846802       -1.055904       7.590000 
      20.862615       -1.056347       6.810000 
      20.878334       -1.095799       6.940000 
      20.894185       -1.138351       7.650000 
      20.908518       -1.159434       7.470000 
      20.924134       -1.144193       7.060000 
      20.940576       -1.125825       6.820000 
      20.955981       -1.125408       7.210000 
      20.972561       -1.139237       7.420000 
      20.988718       -1.140649       7.090000 
      21.003914       -1.123083       6.880000 
