

 time    ||    gripping force   ||   raspberry measurement 

      0       0.070000       -802.392157 
      0       0.040000       -802.392157 
      0       0.090000       -802.392157 
      0       0.100000       -802.392157 
      0       0.110000       -802.392157 
      0       0.130000       -802.392157 
      0       0.100000       -802.392157 
      0       0.070000       -802.392157 
      0       0.120000       -802.392157 
      0       0.070000       -802.392157 
      0       0.070000       -802.392157 
      0       0.280000       -802.392157 
      0       0.440000       -802.392157 
      0       0.010000       -802.392157 
      0       0.260000       -802.392157 
      0       0.460000       -802.392157 
      0       0.110000       -802.392157 
      0       0.190000       -802.392157 
      0       0.220000       -802.392157 
      0       0.230000       -802.392157 
      1       0.100000       -802.392157 
      1       0.160000       -802.392157 
      1       0.060000       -802.392157 
      1       0.170000       -802.392157 
      1       0.240000       -802.392157 
      1       0.100000       -802.392157 
      1       0.230000       -794.368235 
      1       0.240000       -786.424553 
      1       0.480000       -786.424553 
      1       0.280000       -786.424553 
      1       0.670000       -786.424553 
      1       0.270000       -786.424553 
      1       0.850000       -778.560307 
      1       0.800000       -770.774704 
      1       4.010000       -770.774704 
      2       18.650000       -763.066952 
      2       43.920000       -755.435103 
      2       66.890000       -747.774493 
      2       91.950000       -744.220137 
      2       101.510000       -700.918952 
      2       107.080000       -506.853448 
      2       106.130000       -186.882082 
      2       105.030000       7.204061 
      2       105.140000       50.527145 
      2       105.040000       50.527145 
      2       104.310000       50.527145 
      2       103.880000       50.527145 
      2       102.560000       50.527145 
      2       99.660000       54.099053 
      2       91.460000       54.189263 
      2       79.660000       54.173124 
      2       59.970000       54.173124 
      2       45.040000       54.167729 
      3       34.340000       54.183135 
      3       28.170000       54.275110 
      3       26.140000       54.573726 
      3       26.470000       55.063619 
      3       26.810000       55.549994 
      3       26.950000       55.549994 
      3       27.110000       55.549994 
      3       27.460000       55.888895 
      3       28.300000       56.036487 
      3       29.290000       56.036487 
      3       30.130000       56.063896 
      3       31.470000       56.063896 
      3       33.080000       56.066652 
      3       34.440000       56.052239 
      3       35.930000       56.052239 
      4       36.190000       55.977322 
      4       36.210000       55.761639 
      4       36.110000       55.433954 
      4       36.090000       55.069515 
      4       35.730000       54.721619 
      4       35.370000       54.488967 
      4       34.240000       54.488967 
      4       33.440000       54.488967 
      4       32.920000       54.488967 
      4       32.750000       54.488967 
      4       32.290000       54.414395 
      4       31.810000       54.421534 
      4       31.220000       54.371244 
      4       30.690000       54.270459 
      4       30.580000       54.270459 
      5       30.400000       54.260604 
      5       30.380000       54.388353 
      5       30.310000       54.516952 
      5       30.230000       54.516952 
      5       30.070000       54.581117 
      5       29.760000       54.675664 
      5       29.460000       54.785018 
      5       29.050000       54.792673 
      5       28.920000       54.792673 
      5       28.100000       54.716082 
      5       27.790000       54.716082 
      5       27.750000       54.629983 
      5       27.810000       54.593768 
      5       27.830000       54.636224 
      5       27.850000       54.666289 
      6       27.870000       54.613811 
      6       27.940000       54.550206 
      6       27.920000       54.513413 
      6       27.960000       54.546149 
      6       27.900000       54.585530 
      6       27.980000       54.529965 
      6       28.040000       54.439909 
      6       28.120000       54.418839 
      6       28.450000       54.482040 
      6       28.960000       54.522284 
      6       29.320000       54.522284 
      6       29.700000       54.509841 
      6       29.850000       54.529911 
      6       29.970000       54.513810 
      6       30.270000       54.420583 
      7       30.420000       54.408539 
      7       30.450000       54.436609 
      7       30.620000       54.391469 
      7       30.680000       54.336281 
      7       30.700000       54.334022 
      7       30.630000       54.317466 
      7       30.710000       54.306698 
      7       30.780000       54.306698 
      7       30.840000       54.338536 
      7       30.770000       54.338536 
      7       30.780000       54.360917 
      7       30.760000       54.373988 
      7       30.780000       54.407127 
      7       30.790000       54.486915 
      7       30.760000       54.550538 
      8       30.770000       54.558218 
      8       30.800000       54.528194 
      8       30.800000       54.465945 
      8       30.740000       54.489743 
      8       30.770000       54.656836 
      8       30.750000       54.791286 
      8       30.760000       54.791286 
      8       30.720000       54.762593 
      8       30.790000       54.633112 
      8       30.720000       54.633112 
      8       30.720000       54.542996 
      8       30.730000       54.532773 
      8       30.750000       54.497172 
      8       30.670000       54.497172 
      8       30.620000       54.497172 
      8       30.540000       54.497172 
      9       30.480000       54.424764 
      9       30.440000       54.434909 
      9       30.390000       54.505794 
      9       30.240000       54.505794 
      9       30.210000       54.480189 
      9       30.010000       54.497301 
      9       29.890000       54.585932 
      9       29.680000       54.582814 
      9       29.580000       54.478487 
      9       29.460000       54.398643 
      9       29.490000       54.426990 
      9       29.480000       54.497242 
      9       29.570000       54.596371 
      9       29.480000       54.693076 
      9       29.550000       54.708799 
      10       29.520000       54.708799 
      10       29.480000       54.616029 
      10       29.610000       54.512137 
      10       29.710000       54.465875 
      10       29.900000       54.439962 
      10       29.990000       54.439962 
      10       30.030000       54.484689 
      10       30.000000       54.576587 
      10       30.130000       54.543806 
      10       30.000000       54.450264 
      10       30.020000       54.448878 
      10       30.020000       54.448878 
      10       29.990000       54.547004 
      10       29.970000       54.596288 
      11       30.060000       54.577046 
      11       30.000000       54.567577 
      11       29.940000       54.487842 
      11       29.990000       54.402242 
      11       29.980000       54.402242 
      11       29.970000       54.402242 
      11       30.010000       54.402242 
      11       30.040000       54.419737 
      11       29.960000       54.444693 
      11       29.960000       54.444693 
      11       29.970000       54.444693 
      11       30.010000       54.444693 
      11       30.010000       54.444693 
      11       29.940000       54.417992 
      11       30.030000       54.381492 
      12       30.010000       54.400509 
      12       29.970000       54.400509 
      12       30.020000       54.439754 
      12       29.960000       54.482083 
      12       29.960000       54.482083 
      12       29.920000       54.480092 
      12       30.000000       54.454289 
      12       30.030000       54.455992 
      12       30.080000       54.503540 
      12       30.190000       54.516982 
      12       30.190000       54.530438 
      12       30.180000       54.578376 
      12       30.140000       54.583745 
      12       30.220000       54.583745 
      12       30.190000       54.561859 
      12       30.170000       54.561859 
      13       30.150000       54.561859 
      13       30.200000       54.518715 
      13       30.190000       54.492412 
      13       30.200000       54.530408 
      13       30.200000       54.538465 
      13       30.240000       54.471303 
      13       30.220000       54.482488 
      13       30.110000       54.482488 
      13       30.130000       54.538948 
      13       30.120000       54.525966 
      13       30.100000       54.543951 
      13       30.170000       54.630354 
      13       30.170000       54.685086 
      13       30.160000       54.640279 
      13       30.090000       54.640279 
      14       30.050000       54.582890 
      14       29.910000       54.582890 
      14       29.980000       54.582890 
      14       29.630000       54.573987 
      14       29.730000       54.585075 
      14       29.720000       54.582526 
      14       29.670000       54.540197 
      14       29.650000       54.505412 
      14       29.650000       54.505412 
      14       29.590000       54.498584 
      14       29.670000       54.514294 
      14       29.610000       54.458707 
      14       29.710000       54.455189 
      14       29.610000       54.554579 
      14       29.780000       54.554579 
      14       29.990000       54.554175 
      15       30.100000       54.516556 
      15       30.200000       54.538508 
      15       30.190000       54.538508 
      15       30.210000       54.538508 
      15       30.150000       54.550118 
      15       30.140000       54.524653 
      15       30.180000       54.514727 
      15       30.140000       54.567175 
      15       30.080000       54.567175 
      15       30.140000       54.546091 
      15       30.200000       54.466320 
      15       30.180000       54.466320 
      15       30.150000       54.454693 
      15       30.180000       54.473859 
      15       30.180000       54.447947 
      16       30.140000       54.361391 
      16       30.120000       54.334576 
      16       30.220000       54.364975 
      16       30.170000       54.406255 
      16       30.120000       54.406255 
      16       30.130000       54.485600 
      16       30.220000       54.535669 
      16       30.130000       54.501757 
      16       30.120000       54.478819 
      16       30.130000       54.483758 
      16       30.080000       54.483758 
      16       29.970000       54.395927 
      16       29.930000       54.323848 
      16       29.620000       54.346997 
      16       29.670000       54.346997 
      17       29.600000       54.404938 
      17       29.600000       54.487758 
      17       29.550000       54.478372 
      17       29.600000       54.362764 
      17       29.650000       54.385299 
      17       29.690000       54.525812 
      17       29.990000       54.565482 
      17       30.080000       54.515991 
      17       30.170000       54.540433 
      17       30.160000       54.618170 
      17       30.160000       54.618170 
      17       30.100000       54.643946 
      17       30.210000       54.588165 
      17       30.120000       54.588165 
      17       30.060000       54.593297 
      18       30.150000       54.585460 
      18       30.110000       54.503180 
      18       30.080000       54.448422 
      18       30.080000       54.488272 
      18       30.140000       54.526408 
      18       30.160000       54.513851 
      18       30.110000       54.491403 
      18       30.140000       54.477132 
      18       30.040000       54.559144 
      18       30.180000       54.613714 
      18       30.110000       54.524679 
      18       30.080000       54.517872 
      18       30.040000       54.517872 
      18       29.940000       54.517872 
      18       29.990000       54.583758 
      19       29.910000       54.556833 
      19       29.960000       54.499570 
      19       29.930000       54.451922 
      19       29.910000       54.449803 
      19       29.920000       54.471233 
      19       29.890000       54.471233 
      19       29.940000       54.505297 
      19       29.970000       54.502587 
      19       29.910000       54.454649 
      19       29.880000       54.438535 
      19       29.930000       54.412926 
      19       29.900000       54.387457 
      19       29.910000       54.416969 
      19       29.960000       54.416969 
      19       29.910000       54.446118 
      20       29.890000       54.417425 
      20       29.930000       54.393259 
      20       29.950000       54.441179 
      20       29.840000       54.485999 
      20       29.940000       54.485999 
      20       29.880000       54.485999 
      20       29.900000       54.441180 
      20       29.940000       54.393285 
      20       29.860000       54.418312 
      20       29.880000       54.456930 
      20       29.950000       54.456930 
      20       29.950000       54.465820 
      20       29.950000       54.473088 
      20       29.920000       54.473088 
      20       29.910000       54.473088 
      21       29.880000       54.490943 
      21       29.930000       54.514271 
      21       29.900000       54.529095 
      21       29.880000       54.564406 
      21       29.890000       54.564406 
      21       29.930000       54.518310 
      21       29.920000       54.399528 
      21       29.920000       54.377656 
      21       29.900000       54.393200 
      21       29.950000       54.438176 
      21       29.940000       54.535310 
      21       30.050000       54.610156 
      21       30.120000       54.590972 
      21       30.190000       54.555508 
      21       30.330000       54.560034 
      21       30.240000       54.543850 
      22       30.240000       54.531807 
      22       30.230000       54.482873 
      22       30.200000       54.482873 
      22       30.280000       54.418396 
      22       30.180000       54.433623 
      22       30.120000       54.494969 
      22       30.260000       54.497228 
      22       30.200000       54.441680 
      22       30.220000       54.452891 
      22       30.210000       54.498571 
      22       30.210000       54.500425 
      22       30.220000       54.500425 
      22       30.260000       54.522328 
      22       30.310000       54.556433 
      22       30.210000       54.554591 
      23       30.060000       54.519241 
      23       29.960000       54.485145 
      23       29.850000       54.503110 
      23       29.650000       54.503110 
      23       29.560000       54.482847 
      23       29.750000       54.446219 
      23       29.720000       54.481961 
      23       29.780000       54.492312 
      23       29.720000       54.436778 
      23       29.730000       54.436778 
      23       29.780000       54.440352 
      23       29.760000       54.517438 
      23       29.760000       54.599428 
      23       29.710000       54.625467 
      23       29.700000       54.590003 
      24       29.740000       54.549333 
      24       29.910000       54.526785 
      24       29.910000       54.542148 
      24       30.020000       54.542148 
      24       30.060000       54.543297 
      24       30.220000       54.543297 
      24       30.220000       54.477127 
      24       30.220000       54.357349 
      24       30.190000       54.357349 
      24       30.220000       54.357349 
      24       30.230000       54.357349 
      24       30.110000       54.297893 
      24       30.210000       54.339410 
      24       30.230000       54.466372 
      24       30.210000       54.576905 
      25       30.240000       54.565791 
      25       30.230000       54.565791 
      25       30.230000       54.565791 
      25       30.170000       54.465863 
      25       30.200000       54.429150 
      25       30.100000       54.434922 
      25       30.030000       54.434922 
      25       29.970000       54.435891 
      25       29.920000       54.486930 
      25       29.860000       54.522311 
      25       29.940000       54.522311 
      25       29.890000       54.505784 
      25       29.970000       54.505784 
      25       29.890000       54.521885 
      25       29.910000       54.545635 
      26       29.900000       54.505768 
      26       29.880000       54.434523 
      26       29.880000       54.434523 
      26       29.870000       54.418812 
      26       29.910000       54.486513 
      26       29.890000       54.486513 
      26       29.800000       54.534850 
      26       29.820000       54.492315 
      26       29.850000       54.447522 
      26       29.880000       54.447522 
      26       29.870000       54.487816 
      26       29.890000       54.521465 
      26       29.830000       54.495443 
      26       29.810000       54.479373 
      26       29.880000       54.479373 
      26       29.840000       54.496745 
      27       29.790000       54.536762 
      27       29.890000       54.549152 
      27       29.960000       54.512968 
      27       29.940000       54.455522 
      27       29.940000       54.438576 
      27       29.880000       54.413410 
      27       29.850000       54.394226 
      27       29.890000       54.394226 
      27       29.860000       54.394226 
      27       30.000000       54.458706 
      27       30.090000       54.575217 
      27       30.170000       54.638396 
      27       30.170000       54.603914 
      27       30.220000       54.517385 
      27       30.200000       54.434106 
      28       30.180000       54.402655 
      28       30.180000       54.414365 
      28       30.160000       54.420513 
      28       30.140000       54.442175 
      28       30.180000       54.450495 
      28       30.220000       54.424263 
      28       30.110000       54.410685 
      28       30.200000       54.460115 
      28       30.130000       54.491413 
      28       30.200000       54.533610 
      28       30.230000       54.621481 
      28       30.130000       54.713659 
      28       30.190000       54.726396 
      28       30.090000       54.665266 
      28       30.190000       54.596881 
      28       30.100000       54.466708 
      29       30.100000       54.430230 
      29       29.890000       54.430230 
      29       29.850000       54.492150 
      29       29.760000       54.492150 
      29       29.720000       54.505890 
      29       29.720000       54.469378 
      29       29.770000       54.447575 
      29       29.810000       54.446567 
      29       29.750000       54.542188 
      29       29.740000       54.624872 
      29       29.730000       54.595981 
      29       29.740000       54.595981 
      29       29.690000       54.561740 
      29       29.680000       54.588797 
      29       29.760000       54.598487 
      30       29.830000       54.564157 
      30       29.860000       54.564157 
      30       29.970000       54.511074 
      30       30.040000       54.523807 
      30       30.070000       54.544237 
      30       30.190000       54.508093 
      30       30.220000       54.443883 
      30       30.150000       54.443883 
      30       30.190000       54.468685 
      30       30.110000       54.566220 
      30       30.200000       54.601767 
      30       30.120000       54.585078 
      30       30.150000       54.585078 
      30       30.190000       54.585078 
      30       30.170000       54.585078 
      31       30.140000       54.618380 
      31       30.220000       54.644639 
      31       30.170000       54.617521 
      31       30.110000       54.617521 
      31       30.190000       54.575179 
      31       30.170000       54.564601 
      31       30.170000       54.539794 
      31       30.240000       54.519294 
      31       30.160000       54.501715 
      31       30.170000       54.516578 
      31       30.090000       54.528100 
      31       30.120000       54.528100 
      31       29.940000       54.528100 
      31       30.050000       54.504481 
      31       30.020000       54.504481 
      32       30.000000       54.500745 
      32       30.040000       54.454259 
      32       30.030000       54.370804 
      32       30.080000       54.382115 
      32       30.020000       54.433938 
      32       30.020000       54.471258 
      32       30.040000       54.435794 
      32       30.060000       54.435794 
      32       30.080000       54.383857 
      32       30.010000       54.383857 
      32       30.080000       54.391958 
      32       30.010000       54.479772 
      32       29.990000       54.606613 
      32       29.960000       54.606613 
      32       29.860000       54.623625 
      32       29.880000       54.581547 
      33       29.830000       54.573934 
      33       29.910000       54.584684 
      33       29.870000       54.578886 
      33       29.900000       54.537153 
      33       29.880000       54.556920 
      33       29.830000       54.610156 
      33       29.880000       54.569416 
      33       29.900000       54.458290 
      33       29.920000       54.395528 
      33       29.910000       54.429151 
      33       29.860000       54.505339 
      33       29.890000       54.546105 
      33       29.930000       54.528653 
      33       29.860000       54.547508 
      33       29.850000       54.547508 
      34       29.900000       54.547508 
      34       29.900000       54.651034 
      34       29.850000       54.704770 
      34       29.930000       54.651064 
      34       29.910000       54.612056 
      34       29.880000       54.628139 
      34       29.900000       54.610267 
      34       29.890000       54.565404 
      34       29.880000       54.515211 
      34       29.860000       54.515211 
      34       29.840000       54.467233 
      34       29.900000       54.497312 
      34       29.870000       54.535737 
      34       30.020000       54.492356 
      34       30.020000       54.492356 
      35       30.050000       54.447992 
      35       30.130000       54.494128 
      35       30.030000       54.557333 
      35       30.150000       54.594073 
      35       30.040000       54.594073 
      35       30.100000       54.625897 
      35       30.070000       54.600301 
      35       30.100000       54.600301 
      35       30.020000       54.600301 
      35       30.070000       54.527351 
      35       30.070000       54.477988 
      35       30.120000       54.469501 
      35       30.060000       54.477088 
      35       30.020000       54.516096 
      35       30.060000       54.546092 
      36       30.090000       54.546092 
      36       30.030000       54.546092 
      36       30.020000       54.517412 
      36       30.090000       54.492856 
      36       30.090000       54.537110 
      36       30.070000       54.537110 
      36       30.030000       54.578013 
      36       30.060000       54.574320 
      36       30.090000       54.594144 
      36       30.080000       54.608841 
      36       30.030000       54.602653 
      36       30.100000       54.553294 
      36       30.090000       54.541719 
      36       30.060000       54.598101 
      36       30.020000       54.598101 
      36       30.060000       54.605310 
      37       30.070000       54.576148 
      37       30.030000       54.567675 
      37       30.070000       54.567675 
      37       30.020000       54.555531 
      37       30.080000       54.520597 
      37       30.050000       54.501356 
      37       30.000000       54.576131 
      37       30.130000       54.607499 
      37       30.090000       54.607499 
      37       30.090000       54.538105 
      37       30.070000       54.521040 
      37       30.070000       54.524154 
      37       30.080000       54.559215 
      37       30.020000       54.632542 
      37       30.060000       54.609797 
      38       30.090000       54.609797 
      38       30.060000       54.554649 
      38       30.050000       54.531365 
      38       30.070000       54.486958 
      38       30.040000       54.513966 
      38       30.070000       54.595788 
      38       30.060000       54.625467 
      38       30.090000       54.593603 
      38       30.000000       54.551490 
      38       30.080000       54.464532 
      38       30.070000       54.383941 
      38       30.050000       54.429581 
      38       30.000000       54.429581 
      38       29.990000       54.521922 
      38       29.910000       54.521922 
      39       29.860000       54.559575 
      39       29.830000       54.573934 
      39       29.870000       54.606697 
      39       29.890000       54.681946 
      39       29.850000       54.731269 
      39       29.810000       54.736168 
      39       29.900000       54.706599 
      39       29.870000       54.566746 
      39       29.850000       54.435507 
      39       29.820000       54.435450 
      39       29.820000       54.501268 
      39       29.870000       54.501268 
      39       29.890000       54.531350 
      39       29.910000       54.519587 
      39       29.910000       54.513008 
      39       29.910000       54.513008 
      40       29.850000       54.486430 
      40       29.830000       54.460575 
      40       29.860000       54.485131 
      40       29.920000       54.561332 
      40       29.820000       54.545622 
      40       29.890000       54.465877 
      40       29.820000       54.449750 
      40       29.880000       54.455558 
      40       29.840000       54.439436 
      40       29.930000       54.439436 
      40       29.850000       54.423365 
      40       29.860000       54.496786 
      40       29.870000       54.496786 
      40       29.870000       54.496786 
      40       29.940000       54.496786 
      41       29.860000       54.594127 
      41       29.880000       54.622311 
      41       30.080000       54.664547 
      41       30.060000       54.690849 
      41       30.020000       54.719762 
      41       29.990000       54.719762 
      41       30.080000       54.736556 
      41       30.030000       54.678512 
      41       30.070000       54.645627 
      41       30.000000       54.698613 
      41       30.130000       54.686386 
      41       30.090000       54.589711 
      41       30.070000       54.485634 
      41       30.020000       54.523405 
      41       30.030000       54.651851 
      42       30.000000       54.651851 
      42       30.010000       54.651851 
      42       30.060000       54.673955 
      42       30.090000       54.631298 
      42       30.040000       54.631381 
      42       30.030000       54.631381 
      42       30.030000       54.674359 
      42       30.060000       54.742064 
      42       30.020000       54.729468 
      42       30.090000       54.729468 
      42       30.030000       54.676215 
      42       30.060000       54.645680 
      42       30.000000       54.636750 
      42       30.050000       54.636750 
      42       30.030000       54.636750 
      42       30.060000       54.686057 
      43       30.060000       54.711043 
      43       30.080000       54.711043 
      43       30.070000       54.651118 
      43       30.060000       54.651118 
      43       30.090000       54.607544 
      43       29.980000       54.614338 
      43       29.980000       54.614698 
      43       30.010000       54.613022 
      43       30.040000       54.591790 
      43       30.030000       54.583912 
      43       30.070000       54.615101 
      43       29.970000       54.647504 
      43       30.070000       54.614684 
      43       30.030000       54.579373 
      43       30.080000       54.577518 
      44       30.080000       54.611180 
      44       30.040000       54.627710 
      44       30.080000       54.606214 
      44       29.970000       54.621469 
      44       30.120000       54.640706 
      44       29.940000       54.587856 
      44       30.100000       54.529624 
      44       30.110000       54.582917 
      44       30.070000       54.685556 
      44       30.060000       54.693989 
      44       29.970000       54.693989 
      44       30.020000       54.631367 
      44       30.120000       54.590930 
      44       30.060000       54.555589 
      44       30.020000       54.555589 
      45       30.090000       54.496870 
      45       30.090000       54.496870 
      45       30.090000       54.528224 
      45       30.070000       54.591829 
      45       30.060000       54.591829 
      45       30.060000       54.583798 
      45       30.070000       54.583798 
      45       30.000000       54.550193 
      45       30.020000       54.542995 
      45       29.990000       54.615666 
      45       30.100000       54.675148 
      45       30.010000       54.615692 
      45       30.020000       54.543869 
      45       30.060000       54.560615 
      45       30.020000       54.629010 
      46       30.070000       54.674469 
      46       30.010000       54.659482 
      46       30.070000       54.704538 
      46       30.120000       54.768823 
      46       30.020000       54.776239 
      46       30.060000       54.720890 
      46       29.990000       54.683509 
      46       29.970000       54.681891 
      46       30.020000       54.681891 
      46       30.020000       54.681891 
      46       30.020000       54.675399 
      46       30.030000       54.682390 
      46       30.040000       54.734048 
      46       30.070000       54.685960 
      46       30.030000       54.685960 
      47       30.050000       54.633224 
      47       30.030000       54.686929 
      47       30.020000       54.724924 
      47       30.070000       54.652947 
      47       30.010000       54.594491 
      47       29.990000       54.621105 
      47       29.930000       54.583703 
      47       29.810000       54.540501 
      47       29.870000       54.552742 
      47       29.710000       54.617534 
      47       29.750000       54.667508 
      47       29.790000       54.647517 
      47       29.740000       54.562680 
      47       29.810000       54.549873 
      47       29.810000       54.626298 
      48       29.830000       54.671271 
      48       29.800000       54.643784 
      48       29.800000       54.618368 
      48       29.810000       54.585571 
      48       29.910000       54.545318 
      48       29.810000       54.524668 
      48       29.800000       54.606228 
      48       29.780000       54.724994 
      48       29.770000       54.713271 
      48       29.880000       54.619337 
      48       29.780000       54.619337 
      48       29.820000       54.593176 
      48       29.940000       54.659229 
      48       29.980000       54.698084 
      48       30.040000       54.689631 
      49       30.010000       54.671235 
      49       30.010000       54.729051 
      49       30.020000       54.742491 
      49       30.040000       54.616123 
      49       30.040000       54.567751 
      49       30.050000       54.665403 
      49       30.030000       54.757674 
      49       30.000000       54.677530 
      49       29.970000       54.547040 
      49       30.030000       54.547040 
      49       30.010000       54.582128 
      49       30.050000       54.582128 
      49       30.050000       54.658133 
      49       30.030000       54.652957 
      49       30.080000       54.598119 
      50       30.030000       54.644474 
      50       30.050000       54.644474 
      50       30.050000       54.766192 
      50       30.010000       54.766192 
      50       30.010000       54.825037 
      50       30.040000       54.825037 
      50       30.050000       54.825037 
      50       30.030000       54.818217 
      50       30.000000       54.801726 
      50       30.010000       54.731711 
      50       30.010000       54.644475 
      50       29.970000       54.632668 
      50       30.040000       54.678470 
      50       30.020000       54.684632 
      50       30.060000       54.672684 
      51       29.990000       54.668022 
      51       30.090000       54.683925 
      51       29.960000       54.739298 
      51       30.030000       54.792784 
      51       30.020000       54.763079 
      51       29.940000       54.724720 
      51       30.030000       54.703945 
      51       30.080000       54.738645 
      51       29.990000       54.830744 
      51       30.000000       54.894085 
      51       30.010000       54.866621 
      51       30.020000       54.760088 
      51       30.010000       54.634524 
      51       30.000000       54.650787 
      51       30.000000       54.766247 
      52       29.980000       54.820565 
      52       29.960000       54.805730 
      52       29.960000       54.821857 
      52       30.000000       54.821857 
      52       30.000000       54.821857 
      52       30.010000       54.844722 
      52       30.000000       54.794070 
      52       29.980000       54.674873 
      52       30.040000       54.584760 
      52       29.990000       54.627808 
      52       29.970000       54.699452 
      52       30.030000       54.699452 
      52       30.020000       54.652351 
      52       30.060000       54.568689 
      52       29.980000       54.621399 
      52       30.000000       54.698609 
      53       29.960000       54.646952 
      53       29.960000       54.610824 
      53       30.020000       54.616859 
      53       30.090000       54.641759 
      53       30.000000       54.649623 
      53       29.980000       54.614378 
      53       30.000000       54.573949 
      53       29.990000       54.638618 
      53       29.980000       54.759867 
      53       30.020000       54.794111 
      53       29.970000       54.738371 
      53       30.000000       54.670456 
      53       29.980000       54.607045 
      53       29.990000       54.610434 
      53       29.970000       54.653127 
      54       30.040000       54.667324 
      54       29.990000       54.589922 
      54       30.080000       54.527572 
      54       30.010000       54.527572 
      54       30.020000       54.556769 
      54       29.920000       54.660197 
      54       29.970000       54.725275 
      54       29.960000       54.748002 
      54       30.030000       54.688994 
      54       30.020000       54.634631 
      54       29.980000       54.616471 
      54       30.000000       54.614391 
      54       30.030000       54.607558 
      54       30.000000       54.651561 
      54       30.040000       54.651561 
      55       30.020000       54.716442 
      55       29.960000       54.710253 
      55       30.020000       54.710253 
      55       30.040000       54.676564 
      55       30.050000       54.667205 
      55       30.030000       54.648763 
      55       30.040000       54.648763 
      55       30.030000       54.648763 
      55       30.050000       54.648763 
      55       30.020000       54.578913 
      55       29.970000       54.473989 
      55       30.050000       54.473989 
      55       29.990000       54.475388 
      55       30.000000       54.475388 
      55       30.050000       54.576158 
      56       30.050000       54.634381 
      56       30.020000       54.596398 
      56       29.980000       54.556865 
      56       29.980000       54.571799 
      56       30.030000       54.571799 
      56       30.000000       54.605300 
      56       30.000000       54.605300 
      56       30.030000       54.688368 
      56       29.980000       54.750012 
      56       29.970000       54.771300 
      56       29.980000       54.784564 
      56       29.930000       54.777516 
      56       30.010000       54.719627 
      56       30.040000       54.668158 
      56       29.960000       54.668158 
      57       29.980000       54.618755 
      57       30.030000       54.587457 
      57       30.040000       54.587457 
      57       30.010000       54.611141 
      57       29.990000       54.616549 
      57       30.030000       54.554208 
      57       29.980000       54.539562 
      57       30.010000       54.655908 
      57       29.990000       54.751959 
      57       30.020000       54.722230 
      57       29.970000       54.722230 
      57       30.030000       54.704055 
      57       30.020000       54.699332 
      57       29.990000       54.699332 
      57       30.030000       54.658288 
      58       29.970000       54.579290 
      58       30.000000       54.533606 
      58       29.960000       54.469958 
      58       30.000000       54.427393 
      58       30.020000       54.495984 
      58       29.970000       54.579675 
      58       29.920000       54.635849 
      58       30.040000       54.654551 
      58       30.000000       54.638508 
      58       29.970000       54.612069 
      58       30.030000       54.641125 
      58       30.020000       54.665362 
      58       29.930000       54.596701 
      58       30.000000       54.465514 
      58       30.030000       54.330039 
      58       30.080000       54.332460 
      59       29.980000       54.456419 
      59       29.990000       54.566745 
      59       29.980000       54.566745 
      59       30.010000       54.566745 
      59       30.000000       54.599486 
      59       30.020000       54.641595 
      59       30.030000       54.684204 
      59       30.000000       54.684204 
      59       30.000000       54.684204 
      59       29.960000       54.702169 
      59       29.980000       54.702169 
      59       29.980000       54.702169 
      59       29.970000       54.737069 
      59       29.960000       54.681113 
      59       30.040000       54.591874 
      60       30.030000       54.591874 
      60       29.960000       54.582128 
      60       30.020000       54.613312 
      60       29.960000       54.649762 
      60       29.920000       54.622284 
      60       29.960000       54.608025 
      60       30.010000       54.563606 
      60       30.010000       54.515265 
      60       29.970000       54.536778 
      60       30.020000       54.551492 
      60       29.930000       54.551492 
      60       30.000000       54.551492 
      60       30.030000       54.551492 
      60       30.050000       54.607680 
      60       30.010000       54.695776 
      61       29.950000       54.731362 
