

 time    ||    gripping force   ||   raspberry measurement 

      0       32.480000       -794.025000 
      0       31.320000       -794.025000 
      1       14.410000       -786.084750 
      1       13.900000       -778.223903 
      1       12.920000       -770.441663 
      1       12.710000       -762.737247 
      3       18.190000       -755.109874 
      3       19.030000       -747.558776 
      3       20.390000       -740.083188 
      3       20.400000       -732.682351 
      4       20.530000       -725.354359 
      4       20.550000       -717.995590 
      4       21.400000       -714.475843 
      4       21.750000       -671.597117 
      5       25.010000       -479.435196 
      5       26.160000       -162.648573 
      5       26.980000       29.426419 
      5       27.100000       72.246896 
      5       27.300000       75.789937 
      6       28.920000       75.924892 
      7       29.000000       75.896936 
      7       29.000000       75.867845 
      7       28.980000       75.897827 
      7       29.020000       75.936835 
      7       28.960000       75.944449 
      7       28.920000       75.936835 
      7       28.980000       75.897827 
      8       28.990000       75.867871 
      8       28.940000       75.897814 
      8       28.960000       75.936405 
      8       28.940000       75.939506 
      8       28.920000       75.918467 
      9       28.950000       75.887099 
      9       28.940000       75.902796 
      9       28.960000       75.937292 
      10       28.940000       75.945348 
      10       28.900000       75.947633 
      10       28.890000       75.946221 
      10       28.930000       75.947633 
      10       28.940000       75.945335 
      10       28.950000       75.936862 
      10       28.920000       75.897827 
      10       28.900000       75.867845 
      11       28.890000       75.896941 
      11       29.020000       75.926037 
      11       30.480000       75.896055 
      11       30.800000       75.857046 
      11       30.970000       75.849433 
      11       30.920000       75.857073 
      12       30.920000       75.896941 
      12       30.880000       75.936808 
      12       30.880000       75.944448 
      12       30.900000       75.936835 
      13       30.840000       75.897827 
      13       30.870000       75.867845 
      13       30.840000       75.896941 
      13       30.860000       75.926037 
      13       30.820000       75.896055 
      13       30.790000       75.857046 
      14       30.850000       75.849433 
      14       30.790000       75.857073 
      14       30.850000       75.896941 
      14       30.860000       75.936835 
      14       30.790000       75.945335 
      14       30.790000       75.947633 
      14       30.790000       75.946221 
      14       30.780000       75.947673 
      15       30.810000       75.946665 
      15       30.790000       75.953059 
      16       30.780000       75.970418 
      16       30.760000       75.987527 
      16       30.750000       75.969532 
      16       30.780000       75.942234 
      17       30.800000       75.897384 
      17       30.770000       75.857060 
      17       30.800000       75.848547 
      17       30.780000       75.846248 
      17       30.760000       75.847660 
      17       30.760000       75.846248 
      17       30.770000       75.848546 
      18       30.790000       75.857046 
      18       30.750000       75.896941 
      19       30.800000       75.936835 
      19       30.770000       75.945335 
      20       30.790000       75.947633 
      20       30.780000       75.946221 
      21       30.780000       75.947633 
      21       30.790000       75.945348 
      22       30.790000       75.937292 
      22       30.770000       75.902796 
      23       30.780000       75.887099 
      23       30.790000       75.918494 
      23       30.750000       75.940392 
      23       30.760000       75.947203 
      23       30.800000       75.946208 
      23       30.800000       75.947660 
      23       30.780000       75.946221 
      23       30.740000       75.947660 
      24       30.810000       75.946221 
      24       30.790000       75.947660 
      24       30.730000       75.946221 
      24       30.860000       75.947660 
      26       30.750000       75.946221 
      26       30.760000       75.947633 
      26       30.810000       75.945335 
      26       30.750000       75.936835 
      26       30.770000       75.896941 
      26       30.760000       75.857046 
      27       30.800000       75.848546 
      27       30.740000       75.846248 
      27       30.770000       75.847660 
      27       30.750000       75.846248 
      28       30.750000       75.848546 
      28       30.800000       75.857046 
      28       30.760000       75.896941 
      28       30.750000       75.936835 
      28       30.800000       75.945335 
      28       30.730000       75.947633 
      28       30.750000       75.946221 
      28       30.820000       75.947660 
      29       30.750000       75.946221 
      29       30.780000       75.947660 
      29       30.720000       75.946221 
      29       30.780000       75.947660 
      29       30.740000       75.946221 
      29       30.780000       75.947660 
      29       30.810000       75.946221 
      30       30.760000       75.947633 
      30       30.770000       75.945335 
      30       30.760000       75.936862 
      30       30.790000       75.897827 
      30       30.750000       75.867871 
      30       30.800000       75.897814 
      30       30.760000       75.936405 
      30       30.780000       75.939506 
      31       30.840000       75.918467 
      31       30.740000       75.887099 
      31       30.770000       75.902796 
      32       30.720000       75.937292 
      32       30.730000       75.945348 
      32       30.740000       75.947633 
      32       30.800000       75.946208 
      32       30.840000       75.947203 
      33       30.780000       75.940392 
      34       30.800000       75.918494 
      34       30.790000       75.887099 
      35       30.780000       75.902796 
      35       30.870000       75.937265 
      35       30.840000       75.944462 
      35       30.810000       75.936835 
      35       30.830000       75.897827 
      35       30.830000       75.867871 
      36       30.820000       75.897827 
      36       30.790000       75.936835 
      36       30.790000       75.944448 
      37       30.820000       75.936808 
      37       30.770000       75.896941 
      37       30.820000       75.857087 
      37       30.800000       75.849876 
      37       30.810000       75.862472 
      37       30.780000       75.921138 
      37       30.820000       75.976729 
      37       30.810000       75.969532 
      37       30.810000       75.953032 
      37       30.830000       75.946664 
      38       30.860000       75.947673 
      38       30.810000       75.946222 
      38       30.810000       75.947660 
      38       30.820000       75.946221 
      38       30.790000       75.947660 
      38       30.810000       75.946221 
      39       30.820000       75.947660 
      39       30.800000       75.946208 
      39       30.800000       75.947203 
      39       30.850000       75.940392 
      39       30.790000       75.918493 
      39       30.820000       75.887073 
      40       30.790000       75.901910 
      40       30.840000       75.926493 
      40       30.780000       75.896954 
      40       30.800000       75.867818 
      40       30.800000       75.896941 
      41       30.770000       75.926063 
      41       30.810000       75.896941 
      41       30.790000       75.867845 
      41       30.830000       75.897827 
      41       30.820000       75.936862 
      41       30.790000       75.945335 
      41       30.810000       75.947646 
      42       30.790000       75.946664 
      42       30.830000       75.953059 
      42       30.820000       75.970445 
      43       30.760000       75.988427 
      43       30.860000       75.980787 
      43       30.790000       75.996484 
      43       30.800000       76.007225 
      43       30.820000       75.975401 
      43       30.820000       75.953462 
      43       30.830000       75.945791 
      43       30.810000       75.936875 
      43       30.810000       75.897814 
      44       30.830000       75.867415 
      44       30.790000       75.891971 
      44       30.810000       75.906809 
      44       30.800000       75.875388 
      45       30.790000       75.853489 
      45       30.850000       75.846705 
      45       30.780000       75.848560 
      45       30.740000       75.857047 
      45       30.760000       75.896941 
      45       30.820000       75.936835 
      45       30.780000       75.945334 
      45       30.820000       75.947606 
      46       30.820000       75.945334 
      46       30.810000       75.936835 
      46       30.820000       75.896941 
      46       30.780000       75.857073 
      47       30.840000       75.849433 
      47       30.810000       75.857073 
      47       30.810000       75.896941 
      47       30.810000       75.936835 
      47       30.780000       75.945334 
      47       30.710000       75.947606 
      48       30.690000       75.945335 
      48       30.730000       75.936862 
      48       30.700000       75.897827 
      48       30.560000       75.867871 
      48       30.530000       75.897827 
      48       30.570000       75.936835 
      48       30.560000       75.944449 
      48       30.490000       75.936835 
      49       30.360000       75.897827 
      49       30.350000       75.867845 
      49       30.400000       75.896941 
      49       30.400000       75.926063 
      49       30.330000       75.896941 
      49       30.340000       75.867845 
      49       30.350000       75.897827 
      50       30.320000       75.936835 
      50       30.310000       75.944449 
      50       30.290000       75.936835 
      50       30.330000       75.897827 
      50       30.360000       75.867845 
      50       30.320000       75.896954 
      51       30.310000       75.926493 
      51       30.350000       75.901910 
      51       30.340000       75.887072 
      51       30.290000       75.918467 
      51       30.320000       75.939506 
      51       30.350000       75.936405 
      51       30.320000       75.897814 
      51       30.310000       75.867871 
      52       30.310000       75.897827 
      52       30.300000       75.936835 
      52       30.330000       75.944448 
      53       30.320000       75.936808 
      53       30.310000       75.896941 
      53       30.300000       75.857073 
      53       30.330000       75.849433 
      53       30.330000       75.857073 
      53       30.350000       75.896941 
      53       30.350000       75.936835 
      54       30.280000       75.945335 
      54       30.330000       75.947660 
      54       30.330000       75.947107 
      54       30.290000       75.958431 
      54       30.290000       75.993729 
      54       30.310000       76.016623 
      55       30.250000       75.945335 
      55       30.290000       75.867871 
      55       30.320000       75.850320 
      55       30.320000       75.857100 
      55       30.300000       75.896941 
      55       30.260000       75.936808 
      55       30.320000       75.944448 
      55       30.320000       75.936835 
      56       30.240000       75.897827 
      56       30.290000       75.867871 
      56       30.230000       75.897827 
      56       30.320000       75.936835 
      56       30.320000       75.944448 
      56       30.270000       75.936808 
      57       30.360000       75.896940 
      57       30.240000       75.857046 
      57       30.270000       75.848547 
      57       30.250000       75.846275 
      57       30.320000       75.848546 
      58       30.280000       75.857020 
      58       30.280000       75.896054 
      58       30.280000       75.926010 
      58       30.260000       75.896054 
      58       30.230000       75.857020 
      58       30.300000       75.848560 
      58       30.260000       75.846705 
      58       30.270000       75.853516 
      59       30.310000       75.876274 
      59       30.310000       75.917607 
      59       30.280000       75.940366 
      59       30.240000       75.947203 
      59       30.260000       75.946208 
      59       30.260000       75.947660 
      59       30.220000       75.946221 
      60       30.300000       75.947633 
      60       30.260000       75.945335 
      60       30.270000       75.936862 
      60       30.300000       75.897827 
      60       30.290000       75.867871 
      60       30.330000       75.897827 
