

 time    ||    gripping force   ||   raspberry measurement 

      0       31.410000       1.851013 
      0       25.810000       1.940626 
      0       25.480000       1.980077 
      0       23.800000       1.933459 
      0       19.020000       1.888706 
      0       15.950000       1.934386 
      0       15.680000       1.992218 
      0       13.710000       2.005634 
      1       12.450000       2.007932 
      1       11.410000       2.001537 
      1       11.120000       1.982861 
      1       10.680000       1.949891 
      1       10.490000       1.897149 
      1       10.510000       1.785782 
      1       10.510000       1.604842 
      1       10.520000       1.340687 
      1       10.590000       1.198341 
      1       10.680000       1.249599 
      2       10.670000       1.301657 
      2       10.740000       1.258998 
      2       10.680000       1.208805 
      2       10.680000       1.158596 
      2       10.780000       1.117829 
      2       10.730000       1.109303 
      2       10.690000       1.107031 
      2       10.740000       1.109303 
      2       10.740000       1.117802 
      2       10.830000       1.157683 
      2       10.790000       1.197134 
      2       10.790000       1.200262 
      2       10.760000       1.179222 
      2       10.850000       1.147828 
      2       10.820000       1.162679 
      2       10.840000       1.187679 
      2       10.880000       1.162652 
      2       10.820000       1.146942 
      2       10.870000       1.168424 
      2       10.840000       1.151868 
      2       10.860000       1.117373 
      2       10.870000       1.110175 
      2       10.840000       1.117802 
      2       10.850000       1.156810 
      2       10.890000       1.186766 
      3       10.890000       1.156810 
      3       10.890000       1.117762 
      3       10.880000       1.108859 
      3       10.900000       1.101605 
      3       10.980000       1.084219 
      3       10.930000       1.067083 
      3       10.900000       1.084232 
      3       10.960000       1.102022 
      3       10.920000       1.113385 
      3       10.980000       1.131617 
      3       10.980000       1.154139 
      3       10.970000       1.160314 
      3       10.990000       1.172064 
      3       10.990000       1.141916 
      3       11.020000       1.073934 
      3       11.000000       1.048729 
      3       10.900000       1.079290 
      3       10.820000       1.101592 
      3       10.680000       1.113372 
      3       10.600000       1.131604 
      3       10.570000       1.153709 
      3       10.490000       1.155372 
      4       10.580000       1.153722 
      4       10.610000       1.132061 
      4       10.670000       1.119227 
      4       10.640000       1.131618 
      4       10.630000       1.148323 
      4       10.640000       1.131175 
      4       10.630000       1.113815 
      4       10.620000       1.107447 
      4       10.630000       1.109302 
      4       10.710000       1.117346 
      4       10.690000       1.151841 
      4       10.670000       1.167538 
      4       10.660000       1.136144 
      4       10.670000       1.114245 
      4       10.700000       1.107434 
      4       11.060000       1.108429 
      5       13.250000       1.106978 
      5       21.620000       1.108416 
      5       35.690000       1.106977 
      5       49.840000       1.108416 
      5       57.740000       1.107004 
      6       57.620000       1.109302 
      6       57.330000       1.117776 
      6       57.350000       1.156810 
      6       57.050000       1.186766 
      6       57.000000       1.156810 
      6       56.910000       1.117776 
      6       56.930000       1.109316 
      6       56.880000       1.107489 
      7       56.700000       1.115240 
      7       56.660000       1.150609 
      7       56.620000       1.263262 
      7       56.590000       1.478794 
      7       56.540000       1.766154 
      7       56.420000       1.991139 
      7       56.370000       2.072770 
      8       56.240000       2.032075 
      8       56.260000       1.977854 
      8       56.190000       1.984662 
      8       56.150000       1.996206 
      9       56.010000       1.983776 
      9       56.080000       1.967056 
      9       56.080000       1.983775 
      9       56.090000       1.996179 
      10       56.040000       1.983775 
      10       55.990000       1.967070 
      10       55.970000       1.984219 
      10       55.960000       2.001578 
      10       55.990000       2.007973 
      11       55.950000       2.006964 
      11       55.950000       2.008416 
      11       56.010000       2.006977 
      11       57.960000       2.008416 
      12       57.940000       2.006977 
      12       57.870000       2.008416 
      12       57.840000       2.006977 
      12       57.820000       2.008416 
      12       57.780000       2.006977 
      14       57.790000       2.008416 
      14       57.760000       2.006977 
      14       57.730000       2.008416 
      14       57.750000       2.006977 
      14       57.750000       2.008416 
      14       57.710000       2.006977 
      14       57.750000       2.008416 
      14       57.680000       2.006977 
      14       57.670000       2.008416 
      15       57.700000       2.006977 
      15       57.660000       2.008416 
      15       57.660000       2.006977 
      15       57.670000       2.008416 
      15       57.670000       2.006977 
      16       57.560000       2.008416 
      16       57.640000       2.006977 
      16       57.610000       2.008416 
      16       57.590000       2.006977 
      16       57.600000       2.008416 
      17       57.580000       2.006977 
      17       57.550000       2.008416 
      17       57.510000       2.006977 
      17       57.510000       2.008416 
      17       57.520000       2.006977 
      17       57.510000       2.008416 
      17       57.530000       2.006977 
      17       57.520000       2.008389 
      18       59.660000       2.006091 
      18       59.670000       1.997618 
      19       59.560000       1.958583 
      19       59.500000       1.928601 
      20       59.430000       1.957710 
      20       59.460000       1.987249 
      20       59.370000       1.962666 
      20       59.400000       1.947828 
      20       59.300000       1.979249 
      21       59.390000       2.001148 
      21       59.380000       2.007959 
      21       59.350000       2.006964 
      21       59.370000       2.008416 
      21       59.330000       2.006977 
      22       59.280000       2.008416 
      22       59.310000       2.006977 
      22       59.230000       2.008416 
      22       59.290000       2.006977 
      22       59.300000       2.008416 
      22       59.240000       2.006977 
      23       59.230000       2.008416 
      23       59.210000       2.006977 
      24       59.180000       2.008416 
      25       59.230000       2.006977 
      25       59.200000       2.008416 
      25       59.220000       2.006977 
      25       59.220000       2.008416 
      25       59.190000       2.006977 
      26       59.200000       2.008416 
      27       59.210000       2.006977 
      27       59.280000       2.008416 
      27       59.240000       2.007004 
      27       59.220000       2.009302 
      27       59.280000       2.017776 
      28       59.160000       2.056810 
      28       59.190000       2.086766 
      29       59.190000       2.056810 
      29       59.150000       2.017776 
      29       59.170000       2.009302 
      29       59.150000       2.007004 
      29       59.190000       2.008416 
      29       59.140000       2.006977 
      29       59.170000       2.008416 
      29       59.160000       2.006977 
      29       59.210000       2.008416 
      30       59.110000       2.006977 
      30       59.170000       2.008416 
      30       59.150000       2.006977 
      30       59.170000       2.008416 
      30       59.150000       2.006977 
      30       59.160000       2.008416 
      30       59.160000       2.006964 
      32       59.120000       2.007973 
      32       59.100000       2.001578 
      32       59.100000       1.984219 
      32       59.120000       1.967083 
      33       59.130000       1.984219 
      33       59.110000       2.001578 
      33       59.110000       2.007973 
      33       59.080000       2.006964 
      33       59.140000       2.008416 
      34       59.070000       2.006977 
      34       59.090000       2.008416 
      35       59.030000       2.006977 
      35       59.090000       2.008416 
      36       59.090000       2.006977 
      36       59.040000       2.008416 
      36       59.050000       2.006977 
      36       59.050000       2.008416 
      37       59.020000       2.006978 
      37       59.030000       2.008429 
      37       59.040000       2.007434 
      37       59.020000       2.014245 
      37       59.030000       2.036144 
      37       59.020000       2.067538 
      37       59.050000       2.051841 
      37       59.030000       2.017346 
      38       59.030000       2.009289 
      38       59.030000       2.007004 
      38       59.020000       2.008416 
      38       59.040000       2.006977 
      38       59.080000       2.008416 
      38       59.040000       2.006977 
      38       59.140000       2.008416 
      39       59.110000       2.006977 
      39       59.110000       2.008416 
      39       59.220000       2.006977 
      39       59.220000       2.008416 
      39       59.250000       2.006977 
      40       59.250000       2.008416 
      40       59.310000       2.007004 
      40       59.270000       2.009302 
      40       59.250000       2.017802 
      41       59.270000       2.057697 
      41       59.340000       2.097591 
      41       59.300000       2.106090 
      41       59.320000       2.108362 
      41       59.270000       2.106090 
      41       59.300000       2.097591 
      43       59.240000       2.057697 
      43       59.300000       2.017802 
      44       59.270000       2.009302 
      44       59.280000       2.006991 
      44       59.250000       2.007973 
      44       59.230000       2.001578 
      44       59.290000       1.984219 
      44       59.230000       1.967110 
      45       59.200000       1.985105 
      45       59.290000       2.012376 
      45       59.240000       2.056367 
      45       59.260000       2.086752 
      45       59.240000       2.056810 
      46       59.210000       2.017762 
      46       59.240000       2.008859 
      46       59.180000       2.001605 
      46       59.260000       1.984219 
      46       59.210000       1.967083 
      46       59.230000       1.984219 
      46       59.210000       2.001578 
      46       59.220000       2.007973 
      47       59.190000       2.006991 
      47       59.260000       2.009289 
      48       59.150000       2.017346 
      48       59.170000       2.051841 
      48       59.630000       2.067538 
      48       59.720000       2.036170 
      49       59.730000       2.015131 
      49       59.730000       2.018259 
      50       59.760000       2.057710 
      50       59.750000       2.097564 
      50       59.760000       2.105204 
      50       59.770000       2.097564 
      52       59.750000       2.057696 
      52       59.740000       2.017802 
      52       59.700000       2.009302 
      52       59.700000       2.007004 
      52       59.700000       2.008416 
      52       59.710000       2.006977 
      53       59.690000       2.008416 
      53       59.730000       2.006977 
      53       59.730000       2.008416 
      53       59.660000       2.006977 
      54       59.650000       2.008416 
      54       59.670000       2.006977 
      54       59.680000       2.008416 
      54       59.620000       2.006977 
      55       59.660000       2.008416 
      55       59.670000       2.006977 
      56       59.680000       2.008416 
      56       59.680000       2.006977 
      56       59.690000       2.008416 
      56       59.630000       2.007004 
      58       59.730000       2.009302 
      58       59.740000       2.017776 
      59       59.740000       2.056810 
      59       59.760000       2.086766 
      60       59.780000       2.056810 
      60       59.780000       2.017776 
      60       59.770000       2.009302 
      60       59.770000       2.007004 
      60       59.780000       2.008416 
      60       59.790000       2.006964 
      60       59.770000       2.007973 
      60       59.760000       2.001578 
      61       59.750000       1.984219 
