Human trial picking the raspberry twin 

 time    ||     output     ||     loadcell

      0.000000       -797.995000       0.020000 
      0.015594       -797.995000       0.070000 
      0.030660       -797.995000       0.020000 
      0.045953       -797.995000       0.030000 
      0.062253       -797.995000       0.090000 
      0.077786       -797.995000       0.150000 
      0.092080       -797.995000       0.060000 
      0.108719       -797.995000       0.020000 
      0.123680       -797.995000       0.010000 
      0.138100       -797.994995       0.030000 
      0.155000       -797.993809       0.010000 
      0.170006       -797.887012       0.020000 
      0.185091       -794.350397       0.060000 
      0.200160       -751.265606       0.000000 
      0.214875       -558.172968       0.010000 
      0.230470       -239.817028       0.050000 
      0.245697       -46.724390       0.020000 
      0.260859       -3.639599       0.100000 
      0.275585       -0.102984       0.110000 
      0.289670       0.003813       0.060000 
      0.305840       0.004999       0.090000 
      0.321873       0.005004       0.090000 
      0.338083       0.005004       0.010000 
      0.353337       0.004991       0.050000 
      0.368414       0.004561       0.020000 
      0.383745       -0.000395       0.030000 
      0.398395       -0.019193       0.080000 
      0.413676       -0.034890       0.020000 
      0.429965       -0.019193       0.010000 
      0.445555       -0.000395       0.020000 
      0.461278       0.004534       0.030000 
      0.477435       0.004104       0.150000 
      0.493462       -0.005807       0.040000 
      0.508173       -0.043833       0.050000 
      0.525026       -0.080197       0.040000 
      0.541070       -0.068030       0.020000 
      0.556374       -0.051087       0.110000 
      0.572416       -0.044276       0.100000 
      0.588218       -0.040316       0.130000 
      0.602699       -0.019636       0.030000 
      0.619313       -0.000408       0.020000 
      0.648896       0.004561       0.040000 
      0.665491       0.004991       0.010000 
      0.681069       0.005004       0.090000 
      0.695392       0.005004       0.110000 
      0.711271       0.005004       0.080000 
      0.726428       0.005004       0.050000 
      0.742441       0.005004       0.060000 
      0.758494       0.005004       0.040000 
      0.774699       0.005004       0.070000 
      0.789668       0.004991       0.000000 
      0.804647       0.004561       0.050000 
      0.819238       -0.000395       0.040000 
      0.835628       -0.019206       0.090000 
      0.850503       -0.035333       0.000000 
      0.865628       -0.024592       0.040000 
      0.896627       -0.024592       0.030000 
      0.912623       -0.035333       0.020000 
      0.927945       -0.019206       0.060000 
      0.944818       -0.000395       0.100000 
      0.959949       0.004561       0.040000 
      0.976405       0.004978       0.050000 
      0.991981       0.004561       0.030000 
      1.007810       -0.000395       0.030000 
      1.037921       -0.019193       0.030000 
      1.053461       -0.034890       0.040000 
      1.084802       -0.019193       0.030000 
      1.101270       -0.000395       0.000000 
      1.117057       0.004561       0.030000 
      1.133560       0.004991       0.010000 
      1.147775       0.005004       0.070000 
      1.163159       0.005004       0.100000 
      1.178386       0.005004       0.080000 
      1.192789       0.005004       0.020000 
      1.208153       0.005004       0.040000 
      1.223297       0.005004       0.010000 
      1.239900       0.005004       0.040000 
      1.255388       0.005004       0.000000 
      1.270635       0.005004       0.070000 
      1.286444       0.004991       0.010000 
      1.301847       0.004561       0.050000 
      1.332025       -0.000422       0.010000 
      1.347490       -0.020079       0.070000 
      1.363562       -0.045702       0.030000 
      1.380816       -0.068030       0.010000 
      1.393516       -0.085582       0.090000 
      1.409845       -0.068030       0.060000 
      1.425466       -0.045702       0.010000 
      1.440400       -0.020079       0.040000 
      1.457282       -0.000435       0.020000 
      1.472563       0.004118       0.040000 
      1.487379       -0.000408       0.010000 
      1.503903       -0.019193       0.000000 
      1.518278       -0.034890       0.050000 
      1.580053       -0.019193       0.120000 
      1.596086       -0.000395       0.030000 
      1.610941       0.004561       0.060000 
      1.624924       0.004991       0.050000 
      1.640898       0.005004       0.030000 
      1.656308       0.005004       0.040000 
      1.671122       0.005004       0.070000 
      1.686026       0.005004       0.040000 
      1.701593       0.005004       0.050000 
      1.717190       0.004991       0.020000 
      1.732286       0.004561       0.080000 
      1.748297       -0.000395       0.090000 
      1.763825       -0.019193       0.070000 
      1.779375       -0.034890       0.040000 
      1.808530       -0.019193       0.010000 
      1.825307       -0.000395       0.130000 
      1.841136       0.004561       0.150000 
      1.856105       0.004991       0.110000 
      1.888019       0.005004       0.010000 
      1.904837       0.005004       0.030000 
      1.920131       0.005004       0.120000 
      1.936203       0.005004       0.110000 
      1.952265       0.005004       0.040000 
      1.967267       0.005004       0.060000 
      1.984310       0.005004       0.030000 
      1.998368       0.005004       0.050000 
      2.015639       0.005004       0.070000 
      2.030522       0.005004       0.090000 
      2.045497       0.005004       0.060000 
      2.059819       0.005004       0.030000 
      2.075916       0.004991       0.020000 
      2.091852       0.004561       0.060000 
      2.107530       -0.000395       0.040000 
      2.122723       -0.019193       0.000000 
      2.138738       -0.034890       0.040000 
      2.154219       -0.019193       0.060000 
      2.183961       -0.000408       0.010000 
      2.215328       0.004118       0.080000 
      2.232182       -0.000408       0.030000 
      2.248213       -0.019206       0.150000 
      2.262357       -0.035333       0.160000 
      2.277612       -0.024592       0.010000 
      2.294326       -0.024592       0.100000 
      2.310614       -0.035333       0.020000 
      2.325238       -0.019206       0.100000 
      2.341492       -0.000395       0.050000 
      2.357414       0.004561       0.080000 
      2.371536       0.004991       0.090000 
      2.388570       0.005004       0.050000 
      2.403060       0.005004       0.070000 
      2.419351       0.005004       0.060000 
      2.435198       0.005004       0.020000 
      2.450115       0.005004       0.050000 
      2.464669       0.004991       0.020000 
      2.480748       0.004548       0.030000 
      2.496532       -0.000838       0.050000 
      2.512491       -0.024632       0.020000 
      2.527340       -0.060417       0.150000 
      2.542726       -0.075284       0.070000 
      2.557849       -0.097183       0.120000 
      2.573354       -0.120521       0.060000 
      2.588396       -0.068044       0.020000 
      2.603100       -0.011220       0.120000 
      2.618658       0.003218       0.070000 
      2.648965       -0.000892       0.030000 
      2.665617       -0.025036       0.060000 
      2.680501       -0.064486       0.060000 
      2.695657       -0.083284       0.050000 
      2.709825       -0.064486       0.120000 
      2.725742       -0.025048       0.050000 
      2.742743       -0.001295       0.060000 
      2.757815       -0.000878       0.080000 
      2.773291       -0.020106       0.050000 
      2.788449       -0.046131       0.060000 
      2.804704       -0.072986       0.030000 
      2.820767       -0.104381       0.020000 
      2.836039       -0.083741       0.110000 
      2.851422       -0.030448       0.220000 
      2.867578       -0.006694       0.000000 
      2.883200       -0.020106       0.040000 
      2.898283       -0.040303       0.070000 
      2.914342       -0.043403       0.000000 
      2.929572       -0.040732       0.060000 
      2.946199       -0.025035       0.000000 
      2.962126       -0.024605       0.030000 
      2.978143       -0.035333       0.050000 
      2.992870       -0.019206       0.030000 
      3.009582       -0.000395       0.080000 
      3.025474       0.004561       0.120000 
      3.040893       0.004991       0.060000 
      3.056583       0.005004       0.030000 
      3.072575       0.004991       0.060000 
      3.087963       0.004548       0.080000 
      3.104069       -0.000838       0.100000 
      3.118683       -0.024605       0.060000 
      3.135799       -0.059530       0.020000 
      3.150792       -0.064486       0.050000 
      3.166249       -0.048789       0.100000 
      3.182146       -0.040732       0.070000 
      3.198122       -0.019649       0.080000 
      3.214087       -0.000408       0.100000 
      3.229019       0.004561       0.010000 
      3.245600       0.004991       0.030000 
      3.260844       0.005004       0.070000 
      3.276778       0.004991       0.070000 
      3.291433       0.004561       0.030000 
      3.307894       -0.000395       0.080000 
      3.323294       -0.019193       0.060000 
      3.338797       -0.034890       0.110000 
      3.354217       -0.019193       0.130000 
      3.369263       -0.000408       0.150000 
      3.386267       0.004105       0.060000 
      3.400481       -0.000851       0.010000 
      3.415502       -0.024592       0.030000 
      3.430642       -0.059087       0.000000 
      3.446773       -0.059087       0.090000 
      3.461711       -0.024592       0.120000 
      3.477766       -0.000865       0.130000 
      3.492898       0.003661       0.070000 
      3.508082       -0.005821       0.020000 
      3.524624       -0.043833       0.060000 
      3.540586       -0.080197       0.070000 
      3.554546       -0.068030       0.030000 
      3.570669       -0.051087       0.040000 
      3.586016       -0.044276       0.020000 
      3.601075       -0.040329       0.030000 
      3.617120       -0.020093       0.170000 
      3.633108       -0.006264       0.040000 
      3.649215       -0.025479       0.080000 
      3.665271       -0.064513       0.010000 
      3.680959       -0.083728       0.060000 
      3.697139       -0.069899       0.010000 
      3.711527       -0.049675       0.010000 
      3.728068       -0.046158       0.060000 
      3.741726       -0.044290       0.080000 
      3.756771       -0.045728       0.000000 
      3.772884       -0.044720       0.030000 
      3.789422       -0.051101       0.080000 
      3.804159       -0.068030       0.040000 
      3.819491       -0.080197       0.030000 
      3.835260       -0.043833       0.050000 
      3.850520       -0.005807       0.040000 
      3.865462       0.004118       0.050000 
      3.881245       0.004964       0.000000 
      3.897363       0.004561       0.040000 
      3.912326       -0.000408       0.100000 
      3.926737       -0.019649       0.050000 
      3.942720       -0.040732       0.000000 
      3.957719       -0.048789       0.020000 
      3.973096       -0.064500       0.100000 
      3.989129       -0.059973       0.070000 
      4.005479       -0.030004       0.070000 
      4.020129       -0.025035       0.030000 
      4.035340       -0.035347       0.030000 
      4.051469       -0.019206       0.090000 
      4.067442       -0.000395       0.060000 
      4.082039       0.004561       0.160000 
      4.098558       0.004991       0.040000 
      4.113493       0.005004       0.020000 
      4.128312       0.005004       0.000000 
      4.143664       0.005004       0.080000 
      4.160743       0.004978       0.010000 
      4.175460       0.004118       0.050000 
      4.191507       -0.005821       0.080000 
      4.205877       -0.044276       0.070000 
      4.222346       -0.085583       0.060000 
      4.236740       -0.091797       0.050000 
      4.253310       -0.086026       0.060000 
      4.268836       -0.049675       0.030000 
      4.282732       -0.030018       0.010000 
      4.298417       -0.035790       0.100000 
      4.314662       -0.019663       0.050000 
      4.331104       -0.005821       0.000000 
      4.345947       -0.020523       0.020000 
      4.360727       -0.045715       0.010000 
      4.391522       -0.068031       0.000000 
      4.407839       -0.085609       0.020000 
      4.423069       -0.068917       0.060000 
      4.438823       -0.056500       0.110000 
      4.452878       -0.068487       0.120000 
      4.469315       -0.080667       0.050000 
      4.485241       -0.049676       0.160000 
      4.501098       -0.035404       0.140000 
      4.515442       -0.059987       0.090000 
      4.531323       -0.059557       0.040000 
      4.546850       -0.030005       0.000000 
      4.561513       -0.025478       0.020000 
      4.578062       -0.040746       0.090000 
      4.593089       -0.043403       0.030000 
      4.608238       -0.040289       0.050000 
      4.623992       -0.019636       0.050000 
      4.639033       -0.000408       0.060000 
      4.654943       0.004561       0.010000 
      4.670137       0.004991       0.020000 
      4.686252       0.005004       0.050000 
      4.701468       0.005004       0.140000 
      4.717178       0.005004       0.030000 
      4.733488       0.004991       0.050000 
      4.749333       0.004548       0.000000 
      4.764652       -0.000838       0.010000 
      4.779366       -0.024592       0.030000 
      4.794929       -0.059100       0.030000 
      4.810281       -0.059530       0.050000 
      4.825481       -0.029991       0.040000 
      4.840535       -0.025035       0.020000 
      4.855575       -0.035360       0.030000 
      4.871056       -0.019650       0.020000 
      4.886175       -0.005808       0.040000 
      4.902295       -0.020119       0.130000 
      4.917310       -0.041632       0.110000 
      4.931770       -0.059614       0.070000 
      4.948309       -0.113780       0.000000 
      4.962507       -0.150560       0.030000 
      4.978120       -0.126793       0.050000 
      4.993517       -0.115622       0.040000 
      5.008940       -0.084667       0.040000 
      5.025238       -0.031361       0.070000 
      5.040770       -0.017506       0.040000 
      5.056831       -0.068943       0.030000 
      5.071989       -0.125490       0.060000 
      5.087533       -0.115981       0.070000 
      5.102949       -0.090982       0.090000 
      5.118265       -0.044733       0.010000 
      5.134178       -0.006278       0.020000 
      5.149550       -0.001309       0.020000 
      5.165695       -0.020119       0.090000 
      5.181310       -0.046132       0.010000 
      5.196918       -0.073000       0.060000 
      5.212961       -0.104837       0.050000 
      5.228484       -0.089583       0.030000 
      5.242442       -0.060044       0.060000 
      5.257402       -0.070772       0.070000 
      5.274357       -0.083781       0.060000 
      5.291325       -0.065400       0.090000 
      5.304276       -0.036277       0.050000 
      5.319236       -0.054645       0.000000 
      5.335193       -0.099438       0.010000 
      5.351152       -0.083311       0.060000 
      5.365113       -0.030448       0.040000 
      5.380073       -0.007123       0.090000 
      5.396036       -0.025062       0.120000 
      5.410991       -0.059101       0.030000 
      5.426949       -0.059087       0.010000 
      5.441916       -0.024605       0.040000 
      5.456868       -0.001281       0.010000 
      5.471828       -0.000878       0.000000 
      5.486788       -0.020093       0.030000 
      5.577545       -0.045688       0.030000 
      5.593503       -0.067587       0.080000 
      5.608462       -0.080210       0.010000 
      5.625429       -0.044720       0.010000 
      5.640378       -0.016619       0.070000 
      5.656334       -0.044720       0.030000 
      5.673291       -0.080210       0.030000 
      5.688146       -0.067587       0.000000 
      5.705030       -0.045702       0.050000 
      5.720603       -0.020522       0.060000 
      5.735198       -0.005821       0.080000 
      5.751292       -0.019663       0.020000 
      5.765635       -0.035790       0.080000 
      5.781762       -0.029991       0.000000 
      5.797340       -0.048802       0.030000 
      5.813385       -0.075671       0.030000 
      5.828361       -0.048816       0.050000 
      5.844466       -0.030448       0.020000 
      5.859546       -0.041632       0.090000 
      5.875620       -0.049272       0.000000 
      5.891720       -0.070329       0.010000 
      5.907505       -0.089127       0.010000 
      5.921658       -0.088710       0.090000 
      5.936816       -0.065373       0.020000 
      5.968164       -0.030461       0.010000 
      5.984519       -0.025505       0.070000 
      5.999730       -0.041189       0.110000 
      6.014608       -0.048816       0.050000 
      6.031654       -0.064943       0.020000 
      6.047700       -0.065372       0.050000 
      6.062658       -0.054201       0.070000 
      6.079695       -0.064930       0.040000 
      6.095229       -0.059557       0.040000 
      6.110803       -0.025062       0.070000 
      6.127520       -0.006680       0.020000 
      6.141711       -0.025048       0.000000 
      6.156712       -0.059101       0.030000 
      6.172709       -0.059087       0.010000 
      6.188402       -0.024605       0.050000 
      6.203486       -0.001281       0.080000 
      6.219596       -0.000865       0.110000 
      6.234700       -0.019650       0.030000 
      6.250667       -0.040303       0.090000 
      6.266832       -0.043833       0.040000 
      6.282730       -0.045688       0.020000 
      6.312297       -0.043833       0.040000 
      6.327906       -0.040316       0.070000 
      6.344137       -0.020080       0.060000 
      6.359229       -0.005834       0.110000 
      6.376138       -0.020536       0.050000 
      6.391268       -0.046145       0.060000 
      6.406429       -0.072986       0.010000 
      6.421231       -0.104380       0.030000 
      6.436255       -0.083728       0.000000 
      6.451479       -0.030031       0.020000 
      6.467269       -0.002168       0.090000 
      6.482477       -0.006264       0.030000 
      6.498372       -0.043404       0.000000 
      6.514721       -0.074798       0.140000 
      6.529548       -0.043846       0.050000 
      6.544481       -0.011636       0.010000 
      6.560748       -0.025479       0.060000 
      6.576031       -0.059167       0.060000 
      6.591438       -0.060873       0.070000 
      6.607342       -0.046632       0.020000 
      6.622300       -0.103039       0.080000 
      6.639055       -0.179683       0.060000 
      6.654544       -0.137534       0.060000 
      6.669875       -0.070412       0.060000 
      6.685509       -0.067159       0.090000 
      6.701236       -0.070839       0.070000 
      6.716395       -0.078856       0.130000 
      6.731745       -0.110666       0.120000 
      6.747766       -0.113350       0.020000 
      6.762974       -0.094539       0.050000 
      6.794900       -0.070772       0.030000 
      6.811420       -0.049272       0.030000 
      6.827654       -0.041202       0.060000 
      6.843176       -0.025492       0.020000 
      6.858771       -0.030031       0.000000 
      6.873566       -0.060417       0.060000 
      6.888694       -0.069912       0.060000 
      6.903872       -0.073443       0.060000 
      6.919093       -0.086469       1.540000 
      6.934545       -0.073456       2.470000 
      6.948675       -0.070342       2.360000 
      6.965742       -0.065373       1.610000 
      6.981228       -0.048829       0.730000 
      6.996727       -0.041176       0.140000 
      7.011471       -0.025048       0.280000 
      7.027465       -0.024606       1.190000 
      7.043687       -0.035347       2.690000 
      7.058808       -0.019676       5.960000 
      7.073471       -0.006681       9.000000 
      7.089571       -0.030448       9.050000 
      7.104297       -0.083741       8.180000 
      7.120479       -0.104381       6.820000 
      7.135681       -0.072986       4.150000 
      7.151069       -0.046158       5.610000 
      7.166093       -0.020992       12.640000 
      7.182535       -0.011663       29.670000 
      7.197603       -0.049246       39.390000 
      7.213578       -0.099438       61.820000 
      7.229122       -0.088683       74.580000 
      7.244332       -0.054188       87.360000 
      7.258649       -0.041189       111.280000 
      7.274420       -0.020106       122.140000 
      7.290265       -0.005808       141.450000 
      7.305346       -0.019636       151.660000 
      7.319584       -0.034876       161.910000 
      7.335512       -0.018292       182.890000 
      7.352410       0.010982       194.830000 
      7.366629       0.062908       219.620000 
      7.383234       0.167091       230.030000 
      7.398671       0.388422       239.050000 
      7.413010       0.715274       256.450000 
      7.429554       0.912838       265.560000 
      7.444641       0.976724       275.560000 
      7.459073       0.999982       295.440000 
      7.475463       1.011853       303.820000 
      7.491818       1.054895       315.860000 
      7.506453       1.194402       320.560000 
      7.521585       1.459698       326.270000 
      7.537378       1.742128       341.090000 
      7.553360       1.898995       349.690000 
      7.569605       1.948445       368.440000 
      7.584192       1.959765       376.970000 
      7.599722       1.990316       392.370000 
      7.615755       2.082347       396.680000 
      7.630602       2.344998       397.280000 
      7.646362       2.729197       339.710000 
      7.661696       2.960482       288.550000 
      7.677747       3.067438       96.990000 
      7.693687       3.272716       13.680000 
      7.708999       3.609110       12.250000 
      7.724518       3.883365       3.500000 
      7.740055       4.037413       1.900000 
      7.755922       4.274970       7.960000 
      7.771483       4.647193       12.400000 
      7.788178       4.926872       2.050000 
      7.803352       5.136411       0.270000 
      7.818386       5.416328       2.840000 
      7.833986       5.691438       10.650000 
      7.849157       5.506434       6.330000 
      7.863565       4.109117       0.400000 
      7.879885       1.635698       4.160000 
      7.895451       0.157251       9.100000 
      7.911438       0.683212       5.770000 
      7.926760       1.655713       1.910000 
      7.941860       2.185609       6.160000 
      7.956818       2.449425       10.060000 
      7.972054       2.414426       9.770000 
      7.987803       2.128398       3.890000 
      8.004185       1.719126       4.670000 
      8.019130       1.173899       10.920000 
      8.033576       0.601071       9.450000 
      8.050060       0.009545       5.740000 
      8.066153       -0.533203       4.870000 
      8.082286       -0.872427       7.520000 
      8.097108       -1.037896       7.840000 
      8.112487       -1.180271       4.150000 
      8.127536       -1.423666       3.960000 
      8.143262       -1.753659       6.820000 
      8.158642       -1.948122       8.410000 
      8.174214       -1.991342       3.820000 
      8.189308       -1.994887       2.750000 
      8.204339       -1.994994       7.150000 
      8.219893       -1.994982       8.150000 
      8.235528       -1.994552       6.310000 
      8.250551       -1.989570       3.480000 
      8.266161       -1.969898       5.500000 
      8.281426       -1.943806       8.250000 
      8.296302       -1.915138       6.190000 
      8.312068       -1.860791       4.360000 
      8.326963       -1.767585       6.470000 
      8.343844       -1.578772       8.570000 
      8.359131       -1.347586       6.120000 
      8.373844       -1.198250       4.520000 
      8.388788       -1.148885       5.150000 
      8.403627       -1.130489       8.830000 
      8.420396       -1.142961       8.030000 
      8.435310       -1.145188       4.500000 
      8.452365       -1.073913       5.180000 
      8.467880       -1.017519       7.090000 
      8.483192       -1.026821       7.030000 
      8.498516       -1.069926       5.080000 
      8.513800       -1.107482       4.860000 
      8.529320       -1.104380       6.530000 
      8.544749       -1.049232       7.400000 
      8.559928       -1.006251       4.560000 
      8.573611       -0.995909       4.090000 
      8.589423       -0.995479       6.720000 
      8.606321       -1.000852       7.140000 
      8.622437       -1.025062       4.600000 
      8.638856       -1.065373       4.540000 
      8.653226       -1.094096       5.610000 
      8.668329       -1.113350       7.320000 
      8.683794       -1.111122       6.220000 
      8.699677       -1.084684       5.320000 
      8.716114       -1.099938       6.560000 
      8.731631       -1.124092       7.680000 
      8.746960       -1.089167       6.430000 
      8.762368       -1.036290       5.500000 
      8.777326       -1.031334       6.910000 
      8.793329       -1.064970       7.750000 
      8.808079       -1.083754       7.260000 
      8.823466       -1.070329       5.120000 
      8.840231       -1.054632       5.410000 
      8.855420       -1.064969       7.160000 
      8.869659       -1.060430       6.670000 
      8.885679       -1.035404       5.380000 
      8.901823       -1.049232       5.130000 
      8.917706       -1.075241       6.240000 
      8.932989       -1.043430       6.300000 
      8.947947       -1.006681       5.290000 
      8.964119       -1.006694       4.920000 
      8.980225       -1.043860       6.450000 
      8.995163       -1.080197       6.870000 
      9.009265       -1.068044       5.440000 
      9.025398       -1.051558       5.200000 
      9.041244       -1.050602       5.860000 
      9.056628       -1.076668       7.140000 
      9.072833       -1.125035       6.480000 
      9.088027       -1.188683       5.560000 
      9.105479       -1.228564       6.210000 
      9.119672       -1.212880       7.100000 
      9.135305       -1.170342       6.400000 
      9.151176       -1.125948       5.680000 
      9.167129       -1.106694       6.390000 
      9.181906       -1.124619       6.970000 
      9.198927       -1.154185       6.100000 
      9.214290       -1.141606       5.500000 
      9.229543       -1.124662       6.310000 
      9.245679       -1.184184       6.820000 
      9.260360       -1.215578       5.840000 
      9.276318       -1.162245       5.360000 
      9.291462       -1.151087       5.620000 
      9.307724       -1.150075       6.620000 
      9.322847       -1.105405       6.330000 
      9.339274       -1.085599       5.260000 
      9.354366       -1.117516       5.650000 
      9.369358       -1.151515       6.320000 
      9.385331       -1.222435       6.410000 
      9.400691       -1.367103       5.740000 
      9.415896       -1.496640       6.020000 
      9.430864       -1.470189       6.640000 
      9.447695       -1.353301       6.820000 
      9.463269       -1.248791       5.880000 
      9.478699       -1.172265       5.700000 
      9.493611       -1.180212       6.640000 
      9.508906       -1.226377       6.800000 
      9.525687       -1.215592       5.760000 
      9.540028       -1.186509       5.660000 
      9.555861       -1.132650       6.120000 
      9.571885       -1.130545       6.520000 
      9.587195       -1.224522       6.040000 
      9.603415       -1.263542       5.620000 
      9.619262       -1.207525       6.040000 
      9.634627       -1.175714       6.400000 
      9.650098       -1.155058       5.850000 
      9.666047       -1.100892       5.580000 
      9.681816       -1.066800       6.180000 
      9.695787       -1.101308       6.580000 
      9.711906       -1.159571       6.010000 
      9.727895       -1.189153       5.670000 
      9.744163       -1.200368       6.330000 
      9.759860       -1.224591       6.610000 
      9.775380       -1.259503       6.390000 
      9.790099       -1.263586       5.700000 
      9.805106       -1.237548       5.940000 
      9.820464       -1.186939       6.410000 
      9.836099       -1.115637       6.390000 
      9.851851       -1.111207       5.850000 
      9.867184       -1.148746       5.950000 
      9.882650       -1.129075       6.340000 
      9.898415       -1.060528       6.470000 
      9.914043       -1.038090       5.870000 
      9.929629       -1.082510       5.690000 
      9.946441       -1.167587       6.200000 
      9.960399       -1.243375       6.380000 
      9.976535       -1.226279       5.850000 
      9.991266       -1.151544       5.810000 
      10.007853       -1.091883       6.060000 
      10.023188       -1.106734       6.360000 
      10.038268       -1.160001       6.110000 
      10.054226       -1.188697       5.830000 
      10.070217       -1.194096       6.040000 
      10.087293       -1.190026       6.330000 
      10.102468       -1.176211       6.120000 
      10.117475       -1.179742       5.920000 
      10.132322       -1.216106       6.180000 
      10.147604       -1.238447       6.460000 
      10.164666       -1.245675       6.170000 
      10.180653       -1.248775       5.820000 
      10.196106       -1.259087       5.860000 
      10.210494       -1.234890       6.450000 
      10.226635       -1.179298       6.330000 
      10.241894       -1.151974       5.940000 
      10.257899       -1.143887       5.950000 
      10.272808       -1.135817       6.420000 
      10.287914       -1.106695       6.280000 
      10.304428       -1.114804       5.980000 
      10.319969       -1.182413       5.990000 
      10.334390       -1.224149       6.270000 
      10.350864       -1.272086       6.190000 
      10.365855       -1.315108       5.870000 
      10.382364       -1.268057       5.730000 
      10.397659       -1.217035       6.190000 
      10.412033       -1.225908       6.400000 
      10.428661       -1.258698       5.900000 
      10.444657       -1.254145       5.860000 
      10.459927       -1.206237       6.050000 
      10.476312       -1.190527       6.340000 
      10.489516       -1.234903       6.210000 
      10.504631       -1.248303       5.900000 
      10.519852       -1.199965       6.060000 
      10.536079       -1.161387       6.250000 
      10.550603       -1.177097       6.200000 
      10.565840       -1.219179       6.030000 
      10.582557       -1.257744       6.180000 
      10.597383       -1.247833       6.360000 
      10.612895       -1.170825       6.230000 
      10.627397       -1.097725       5.970000 
      10.644248       -1.117519       6.040000 
      10.658147       -1.202996       6.170000 
      10.673645       -1.243859       6.230000 
      10.690586       -1.197667       6.050000 
      10.706380       -1.158742       5.980000 
      10.721967       -1.167672       6.090000 
      10.736530       -1.253758       6.260000 
      10.753515       -1.357204       6.190000 
      10.767807       -1.341130       6.150000 
      10.784227       -1.231294       6.240000 
      10.798355       -1.158813       6.270000 
      10.814381       -1.199936       6.070000 
      10.830514       -1.272610       6.080000 
      10.845805       -1.281473       6.250000 
      10.862434       -1.319651       6.360000 
      10.877178       -1.336993       6.320000 
      10.892658       -1.258227       5.890000 
      10.906986       -1.136707       6.100000 
      10.922170       -1.066840       6.310000 
      10.937680       -1.066797       6.190000 
      10.953007       -1.071726       6.020000 
      10.969078       -1.090097       6.070000 
      10.985268       -1.164460       6.260000 
      11.001269       -1.217363       6.200000 
      11.017369       -1.183727       6.080000 
      11.032597       -1.117036       6.060000 
      11.048478       -1.110264       6.130000 
      11.065574       -1.157357       6.150000 
      11.081341       -1.173483       5.970000 
      11.097497       -1.200368       5.960000 
      11.112928       -1.240235       6.220000 
      11.128971       -1.260844       6.180000 
      11.144242       -1.244275       5.970000 
      11.160123       -1.144344       6.020000 
      11.175364       -1.049398       6.190000 
      11.190538       -1.055603       6.180000 
      11.206425       -1.183368       6.200000 
      11.221634       -1.339704       6.030000 
      11.236319       -1.322222       6.120000 
      11.252354       -1.161000       6.220000 
      11.267938       -1.114809       6.190000 
      11.283656       -1.212050       6.140000 
      11.299809       -1.295434       6.100000 
      11.315441       -1.299398       6.190000 
      11.330341       -1.241205       6.060000 
      11.344551       -1.238947       5.960000 
      11.361557       -1.291381       6.040000 
      11.376601       -1.262228       6.230000 
      11.392871       -1.211180       6.150000 
      11.408368       -1.201308       6.130000 
      11.424008       -1.215177       6.180000 
      11.439127       -1.227321       6.260000 
      11.453661       -1.256859       6.200000 
      11.469006       -1.315121       6.110000 
      11.485098       -1.283714       6.220000 
      11.499564       -1.218833       6.260000 
      11.516474       -1.212452       6.270000 
      11.532500       -1.195479       6.000000 
      11.548123       -1.184255       6.060000 
      11.564026       -1.210693       6.230000 
      11.579464       -1.208824       6.260000 
      11.595520       -1.180267       6.040000 
      11.610037       -1.168903       6.070000 
      11.625669       -1.161399       6.080000 
      11.640714       -1.122334       6.180000 
      11.656298       -1.092809       6.120000 
      11.671448       -1.061884       6.110000 
      11.687670       -1.091506       6.170000 
      11.703292       -1.193171       6.210000 
      11.719237       -1.295397       6.080000 
      11.735164       -1.380515       5.980000 
      11.751229       -1.333919       6.150000 
      11.766693       -1.180712       6.150000 
      11.782777       -1.135489       6.140000 
      11.798532       -1.215593       6.070000 
      11.814795       -1.297679       6.060000 
      11.829544       -1.301169       6.230000 
      11.844879       -1.240262       6.190000 
      11.860093       -1.160957       6.090000 
      11.875462       -1.131831       6.050000 
      11.891530       -1.147529       6.270000 
      11.906884       -1.179769       6.240000 
      11.922283       -1.245688       6.100000 
      11.937904       -1.307911       6.040000 
      11.953224       -1.333560       6.100000 
      11.968892       -1.314223       6.170000 
      11.984704       -1.282013       6.030000 
      12.001629       -1.284241       6.170000 
      12.016513       -1.323662       6.200000 
      12.032345       -1.299868       6.250000 
      12.047627       -1.219263       6.100000 
      12.061588       -1.201282       6.030000 
      12.076306       -1.206220       6.080000 
      12.091809       -1.179312       6.250000 
      12.108402       -1.181141       6.220000 
      12.123332       -1.208838       6.070000 
      12.139538       -1.210263       6.140000 
      12.153703       -1.179299       6.180000 
      12.170302       -1.176654       6.140000 
      12.185986       -1.195896       6.150000 
      12.200904       -1.224619       6.240000 
      12.216944       -1.264929       6.250000 
      12.232277       -1.289126       6.230000 
      12.247654       -1.294069       6.140000 
      12.262891       -1.288697       6.160000 
      12.278970       -1.260001       6.140000 
      12.294416       -1.206734       6.100000 
      12.310280       -1.191897       6.100000 
      12.324483       -1.252014       6.150000 
      12.340076       -1.332565       6.150000 
      12.356451       -1.378397       6.090000 
      12.371670       -1.356775       6.030000 
      12.387183       -1.297723       6.080000 
      12.401734       -1.245220       6.070000 
      12.417025       -1.269926       6.120000 
      12.433618       -1.289097       6.150000 
      12.449069       -1.224645       6.100000 
      12.464180       -1.172602       6.170000 
      12.479980       -1.206251       6.140000 
      12.495631       -1.272540       6.080000 
      12.511577       -1.275241       6.090000 
      12.526753       -1.220136       6.170000 
      12.540730       -1.236303       6.170000 
      12.556061       -1.300754       6.160000 
      12.573152       -1.317420       6.080000 
      12.588331       -1.312881       6.100000 
      12.602994       -1.281526       6.080000 
      12.619748       -1.215221       6.110000 
      12.635916       -1.212147       6.060000 
      12.651568       -1.261760       6.130000 
      12.666733       -1.304478       6.200000 
      12.681822       -1.361745       6.160000 
      12.698115       -1.391340       6.170000 
      12.712739       -1.338021       6.150000 
      12.727808       -1.329118       6.140000 
      12.742153       -1.336149       6.100000 
      12.759062       -1.259668       6.090000 
      12.774353       -1.221090       6.050000 
      12.789775       -1.264957       6.120000 
      12.805445       -1.313837       6.090000 
      12.820787       -1.410638       6.140000 
      12.835003       -1.457160       6.130000 
      12.850149       -1.319246       6.090000 
      12.866885       -1.179844       6.120000 
      12.882163       -1.223777       6.140000 
      12.897838       -1.355416       6.170000 
      12.913370       -1.371625       6.240000 
      12.929475       -1.228109       6.190000 
      12.944986       -1.110365       6.110000 
      12.960097       -1.110735       6.120000 
      12.976926       -1.170366       6.060000 
      12.992049       -1.165400       6.120000 
      13.007888       -1.149773       6.090000 
      13.024286       -1.217408       6.130000 
      13.039251       -1.283754       6.200000 
      13.055707       -1.317876       6.180000 
      13.071143       -1.335723       6.150000 
      13.085481       -1.329561       6.120000 
      13.100464       -1.343833       6.170000 
      13.117293       -1.356402       6.140000 
      13.132254       -1.326806       6.120000 
      13.146576       -1.310236       6.110000 
      13.162246       -1.260444       6.140000 
      13.178681       -1.190593       6.190000 
      13.192806       -1.182900       6.260000 
      13.209523       -1.218750       6.200000 
      13.224724       -1.246986       6.170000 
      13.240363       -1.200325       6.090000 
      13.256858       -1.101835       6.160000 
      13.271464       -1.097725       6.150000 
      13.286088       -1.186496       6.230000 
      13.303030       -1.250114       6.180000 
      13.317492       -1.250990       6.120000 
      13.333888       -1.195482       6.190000 
      13.348297       -1.209351       6.130000 
      13.365002       -1.267198       6.110000 
      13.379799       -1.247001       6.170000 
      13.395841       -1.238548       6.200000 
      13.411686       -1.279258       6.150000 
      13.428653       -1.346986       6.080000 
      13.444599       -1.339749       6.210000 
      13.460558       -1.243917       6.310000 
      13.475826       -1.212523       6.100000 
      13.491425       -1.236233       6.090000 
      13.505593       -1.242557       6.110000 
      13.520641       -1.235320       6.310000 
      13.536593       -1.200824       6.160000 
      13.552606       -1.184254       5.990000 
      13.568979       -1.205267       6.250000 
      13.584113       -1.183311       6.460000 
      13.600047       -1.124606       5.830000 
      13.614036       -1.077125       5.910000 
      13.630649       -1.056914       6.460000 
      13.645936       -1.087440       6.060000 
      13.661082       -1.167184       5.840000 
      13.676046       -1.234363       6.230000 
      13.692999       -1.199495       6.260000 
      13.709973       -1.169014       6.140000 
      13.723265       -1.209365       6.120000 
      13.738546       -1.228176       6.100000 
      13.755505       -1.274855       6.240000 
      13.785901       -1.324508       5.930000 
      13.801514       -1.318789       6.150000 
      13.818435       -1.306667       6.080000 
      13.833669       -1.330850       6.120000 
      13.847866       -1.387810       6.190000 
      13.863141       -1.412366       5.970000 
      13.878463       -1.339806       6.050000 
      13.893642       -1.243917       6.270000 
      13.909310       -1.212533       6.020000 
      13.924801       -1.173041       6.080000 
      13.940048       -1.160115       6.180000 
      13.955248       -1.253258       6.200000 
      13.970518       -1.293968       6.100000 
      13.986901       -1.194153       6.000000 
      14.002866       -1.150176       6.170000 
      14.017733       -1.192737       6.220000 
      14.034569       -1.168098       6.150000 
      14.048769       -1.140830       6.080000 
      14.065000       -1.167146       6.110000 
      14.081237       -1.199992       6.160000 
      14.097263       -1.243417       6.110000 
      14.113523       -1.281513       6.100000 
      14.129723       -1.284254       6.180000 
      14.144240       -1.324565       6.170000 
      14.159271       -1.374758       6.150000 
      14.175439       -1.361355       6.070000 
      14.191436       -1.317381       6.100000 
      14.206756       -1.271285       6.190000 
      14.220866       -1.297680       6.210000 
      14.237909       -1.331719       6.050000 
      14.253865       -1.257316       6.040000 
      14.269005       -1.216606       6.090000 
      14.283966       -1.231747       6.200000 
      14.298999       -1.225505       6.170000 
      14.314151       -1.239890       6.070000 
      14.330294       -1.297099       6.110000 
      14.345386       -1.289595       6.220000 
      14.360804       -1.181970       6.110000 
      14.376217       -1.109892       6.120000 
      14.392131       -1.086954       6.330000 
      14.408800       -1.130072       6.330000 
      14.424654       -1.200311       6.150000 
      14.439844       -1.218280       6.110000 
      14.455702       -1.223262       6.210000 
      14.469607       -1.225408       6.150000 
      14.485478       -1.181610       6.140000 
      14.500726       -1.169014       6.120000 
      14.516393       -1.227263       6.170000 
      14.532574       -1.237601       6.220000 
      14.548278       -1.225022       6.190000 
      14.578485       -1.227320       6.110000 
      14.593537       -1.246947       6.190000 
      14.610139       -1.276626       6.190000 
      14.626312       -1.241092       6.270000 
      14.642071       -1.196891       6.180000 
      14.658126       -1.151919       6.160000 
      14.673686       -1.147168       6.170000 
      14.689037       -1.220482       6.120000 
      14.704297       -1.303037       6.060000 
      14.719680       -1.319510       6.130000 
      14.735740       -1.249674       6.170000 
      14.750313       -1.110251       6.160000 
      14.765862       -1.024288       6.080000 
      14.780945       -1.032745       6.120000 
      14.796537       -1.095949       6.110000 
      14.811593       -1.170329       6.120000 
      14.827737       -1.242463       6.130000 
      14.843262       -1.298095       6.120000 
      14.858698       -1.278757       6.180000 
      14.873945       -1.216565       6.180000 
      14.889301       -1.208881       6.190000 
      14.905256       -1.239802       6.170000 
      14.921470       -1.183741       6.220000 
      14.951794       -1.095093       6.090000 
      14.967569       -1.073015       6.040000 
      14.982760       -1.076722       6.130000 
      14.998620       -1.104423       6.240000 
      15.013868       -1.167684       6.170000 
      15.027830       -1.222253       6.050000 
      15.044109       -1.283810       6.090000 
      15.058686       -1.292170       6.050000 
      15.074665       -1.227360       6.150000 
      15.091075       -1.181115       6.250000 
      15.106314       -1.246158       6.210000 
      15.121489       -1.312823       6.160000 
      15.138659       -1.287354       6.080000 
      15.153539       -1.224552       6.080000 
      15.168322       -1.171268       6.130000 
      15.184422       -1.126432       6.120000 
      15.200040       -1.112576       6.190000 
      15.214363       -1.155518       6.160000 
      15.231564       -1.233587       6.170000 
      15.246436       -1.267516       6.200000 
      15.262699       -1.226420       6.110000 
      15.277702       -1.193197       6.160000 
      15.291952       -1.227276       6.170000 
      15.308315       -1.213808       6.130000 
      15.339390       -1.183852       6.030000 
      15.355513       -1.188242       6.160000 
      15.369649       -1.184724       6.160000 
      15.386503       -1.224149       6.140000 
      15.400745       -1.269815       6.130000 
      15.417299       -1.242933       6.120000 
      15.433566       -1.204881       6.140000 
      15.449564       -1.184627       6.160000 
      15.464733       -1.140759       6.190000 
      15.481405       -1.084738       6.230000 
      15.496691       -1.072142       6.170000 
      15.512687       -1.076682       6.130000 
      15.526660       -1.103979       6.190000 
      15.542576       -1.162272       6.100000 
      15.558050       -1.197667       6.140000 
      15.574741       -1.240289       6.160000 
      15.589240       -1.265332       6.130000 
      15.604709       -1.277525       6.160000 
      15.620289       -1.299855       6.150000 
      15.635278       -1.264969       6.130000 
      15.650320       -1.215194       6.160000 
      15.665812       -1.227777       6.170000 
      15.682199       -1.262658       6.100000 
      15.696779       -1.279780       6.100000 
      15.712308       -1.244693       6.110000 
      15.727919       -1.216189       6.170000 
      15.743637       -1.239777       6.190000 
      15.759008       -1.261842       6.080000 
      15.774377       -1.256833       6.060000 
      15.790780       -1.279753       6.170000 
      15.807173       -1.249618       6.200000 
      15.821338       -1.170882       6.130000 
      15.836665       -1.161374       6.110000 
      15.852218       -1.205750       6.120000 
      15.867871       -1.212921       6.080000 
      15.883153       -1.194539       6.120000 
      15.897756       -1.171202       6.220000 
      15.914091       -1.154241       6.190000 
      15.929831       -1.160417       6.070000 
      15.945002       -1.145716       6.150000 
      15.961107       -1.128190       6.220000 
      15.976826       -1.138975       6.200000 
      15.992001       -1.139404       6.150000 
      16.008592       -1.199495       6.150000 
      16.023552       -1.263986       6.130000 
      16.037514       -1.237977       6.160000 
      16.052774       -1.191495       6.170000 
      16.068293       -1.194013       6.190000 
      16.083807       -1.207162       6.210000 
      16.100865       -1.176544       6.250000 
      16.115175       -1.166825       6.200000 
      16.131840       -1.140221       6.240000 
      16.146984       -1.116659       6.210000 
      16.163094       -1.150576       6.270000 
      16.178162       -1.210733       6.160000 
      16.194086       -1.243820       6.090000 
      16.209082       -1.274855       6.110000 
      16.224023       -1.308810       6.140000 
      16.240415       -1.315608       6.140000 
      16.255417       -1.302113       6.150000 
      16.286620       -1.298565       6.190000 
      16.303281       -1.225435       6.200000 
      16.318698       -1.107235       6.170000 
      16.332639       -1.097323       6.260000 
      16.349298       -1.177041       6.240000 
      16.364816       -1.217877       6.130000 
      16.379745       -1.242464       6.110000 
      16.394805       -1.250560       6.110000 
      16.410907       -1.198110       6.180000 
      16.426162       -1.157413       6.180000 
      16.441549       -1.151019       6.160000 
      16.456374       -1.175352       6.080000 
      16.471739       -1.208838       6.080000 
      16.487683       -1.216078       6.040000 
      16.503658       -1.208425       6.040000 
      16.519013       -1.234447       6.140000 
      16.534455       -1.224561       6.200000 
      16.549672       -1.160917       6.170000 
      16.566966       -1.146216       6.190000 
      16.581229       -1.198496       6.160000 
      16.596982       -1.201737       6.090000 
      16.612149       -1.146561       6.120000 
      16.627031       -1.162285       6.230000 
      16.641702       -1.155461       6.130000 
      16.656977       -1.118404       6.110000 
      16.672437       -1.135737       6.090000 
      16.687321       -1.129544       6.090000 
      16.703141       -1.079782       6.110000 
      16.717113       -1.064128       6.100000 
      16.733724       -1.109781       6.070000 
      16.749281       -1.203508       6.130000 
      16.763654       -1.236578       6.130000 
      16.779854       -1.169899       6.170000 
      16.794693       -1.096839       6.130000 
      16.826074       -1.107580       6.150000 
      16.842656       -1.164526       6.180000 
      16.857744       -1.202083       6.070000 
      16.873366       -1.185153       6.100000 
      16.888955       -1.129036       6.040000 
      16.904425       -1.109019       6.090000 
      16.920167       -1.129466       6.150000 
      16.936393       -1.190149       6.100000 
      16.952221       -1.222210       6.150000 
      16.967623       -1.196394       6.170000 
      16.983213       -1.163561       6.180000 
      16.998246       -1.186052       6.110000 
      17.014201       -1.178772       6.050000 
      17.028533       -1.129158       6.140000 
      17.043591       -1.096756       6.130000 
      17.058771       -1.082080       6.110000 
      17.074170       -1.103953       6.260000 
      17.089831       -1.156000       6.240000 
      17.105494       -1.162644       6.020000 
      17.121714       -1.151088       6.090000 
      17.137294       -1.149702       6.060000 
      17.152725       -1.165842       6.130000 
      17.168788       -1.175728       6.070000 
      17.183814       -1.197210       6.090000 
      17.198713       -1.220977       6.080000 
      17.213386       -1.173873       6.090000 
      17.228467       -1.140373       6.080000 
      17.244640       -1.155474       6.120000 
      17.259230       -1.140786       6.130000 
      17.274411       -1.114751       6.210000 
      17.290879       -1.146601       6.230000 
      17.306217       -1.184614       6.190000 
      17.336139       -1.198622       6.130000 
      17.351831       -1.208341       6.130000 
      17.367542       -1.185609       6.130000 
      17.382123       -1.128593       6.120000 
      17.398187       -1.103177       6.230000 
      17.413423       -1.099883       6.260000 
      17.429031       -1.126488       6.080000 
      17.444306       -1.163088       6.130000 
      17.458375       -1.186066       6.110000 
      17.474640       -1.179715       6.210000 
      17.490445       -1.205350       6.250000 
      17.505601       -1.254091       6.190000 
      17.521520       -1.257771       6.130000 
      17.536324       -1.213767       6.180000 
      17.551262       -1.152000       6.210000 
      17.565622       -1.110252       6.170000 
      17.581842       -1.121988       6.130000 
      17.597663       -1.139348       6.230000 
      17.612209       -1.151114       6.210000 
      17.628364       -1.173859       6.100000 
      17.645620       -1.209806       6.160000 
      17.660913       -1.208354       6.200000 
      17.675689       -1.174855       6.140000 
      17.691162       -1.144290       6.130000 
      17.706279       -1.117019       6.080000 
      17.721586       -1.085598       6.180000 
      17.737122       -1.105794       6.200000 
      17.753828       -1.153701       6.220000 
      17.769377       -1.153688       6.200000 
      17.783647       -1.105324       6.100000 
      17.798997       -1.079298       6.050000 
      17.815838       -1.081553       6.210000 
      17.831529       -1.049716       6.250000 
      17.846970       -1.035860       6.220000 
      17.862778       -1.065816       6.200000 
      17.878820       -1.088737       6.260000 
      17.893103       -1.089584       6.200000 
      17.908720       -1.076198       6.090000 
      17.925434       -1.079742       6.200000 
      17.939594       -1.116132       6.140000 
      17.956207       -1.139320       6.190000 
      17.971678       -1.156043       6.240000 
      17.987145       -1.192214       6.250000 
      18.003426       -1.220078       6.100000 
      18.019144       -1.167600       6.140000 
      18.034302       -1.106251       6.070000 
      18.048575       -1.077541       6.170000 
      18.065113       -1.079782       6.100000 
      18.080984       -1.116079       6.060000 
      18.095218       -1.137547       6.100000 
      18.110416       -1.134433       6.130000 
      18.127462       -1.094969       6.170000 
      18.143119       -1.054698       6.210000 
      18.158395       -1.042519       6.190000 
      18.173761       -1.035860       6.210000 
      18.188655       -1.073000       6.160000 
      18.204444       -1.115122       6.170000 
      18.219710       -1.067601       6.190000 
      18.235425       -1.011220       6.120000 
      18.252341       -0.997239       6.100000 
      18.266665       -1.006747       6.180000 
      18.282081       -1.055088       6.250000 
      18.297601       -1.134433       6.230000 
      18.314179       -1.177442       6.150000 
      18.329861       -1.164473       6.180000 
      18.345927       -1.130434       6.200000 
      18.376274       -1.125492       6.180000 
      18.392684       -1.140759       6.160000 
      18.408778       -1.143860       6.200000 
      18.424188       -1.146131       6.160000 
      18.438529       -1.149219       6.060000 
      18.453577       -1.164056       6.120000 
      18.470685       -1.154131       6.160000 
      18.484858       -1.100408       6.240000 
      18.501164       -1.060957       6.150000 
      18.516658       -1.071685       6.180000 
      18.531872       -1.094566       6.230000 
      18.547876       -1.113377       6.190000 
      18.563398       -1.111566       6.200000 
      18.579062       -1.090097       6.080000 
      18.594165       -1.124605       6.130000 
      18.609866       -1.170271       6.100000 
      18.625390       -1.148359       6.170000 
      18.640324       -1.129978       6.010000 
      18.655679       -1.135790       6.150000 
      18.671597       -1.119663       6.220000 
      18.686675       -1.105834       6.270000 
      18.702526       -1.120966       6.220000 
      18.717577       -1.151114       6.140000 
      18.732987       -1.192214       6.230000 
      18.748935       -1.225020       6.260000 
      18.764412       -1.186398       6.180000 
      18.779832       -1.121948       6.140000 
      18.795381       -1.061817       6.160000 
      18.811555       -1.060084       6.220000 
      18.825928       -1.099882       6.100000 
      18.840934       -1.083325       6.030000 
      18.856503       -1.030448       6.070000 
      18.872370       -1.007137       6.140000 
      18.888327       -1.025532       6.150000 
      18.903590       -1.065387       6.230000 
      18.918478       -1.094136       6.170000 
      18.933571       -1.114667       6.200000 
      18.950532       -1.126877       6.190000 
      18.966388       -1.151916       6.190000 
      18.980519       -1.196767       6.140000 
      18.997309       -1.173416       6.130000 
      19.013126       -1.158714       6.150000 
      19.029446       -1.170701       6.220000 
      19.058336       -1.119220       6.150000 
      19.074394       -1.065470       6.130000 
      19.089243       -1.066729       6.080000 
      19.104345       -1.070812       6.160000 
      19.121003       -1.078412       6.170000 
      19.136731       -1.105267       6.170000 
      19.151718       -1.089153       6.150000 
      19.167349       -1.054672       6.120000 
      19.181614       -1.047461       6.160000 
      19.198340       -1.054672       6.120000 
      19.213371       -1.089153       6.190000 
      19.229212       -1.105267       6.280000 
      19.246628       -1.078412       6.240000 
      19.261990       -1.070772       6.180000 
      19.277050       -1.065413       6.200000 
      19.292418       -1.049702       6.110000 
      19.307729       -1.051544       6.110000 
      19.323085       -1.068500       6.180000 
      19.339228       -1.086026       6.230000 
      19.353132       -1.072986       6.120000 
      19.369829       -1.064500       6.110000 
      19.385982       -1.035803       6.100000 
      19.400172       -0.985624       6.140000 
      19.416836       -0.987883       6.180000 
      19.432071       -1.043847       6.210000 
      19.448977       -1.098565       6.200000 
      19.463391       -1.083714       6.150000 
      19.478466       -1.035403       6.180000 
      19.494389       -1.025935       6.260000 
      19.510062       -1.041216       6.260000 
      19.524485       -1.049286       6.180000 
      19.541402       -1.071255       6.110000 
      19.557337       -1.101281       6.070000 
      19.572751       -1.154201       6.090000 
      19.586870       -1.229007       6.110000 
      19.603402       -1.252774       6.150000 
      19.618405       -1.218280       6.150000 
      19.633799       -1.170785       6.100000 
      19.648032       -1.125961       6.190000 
      19.664550       -1.106694       6.130000 
      19.679821       -1.124632       6.080000 
      19.695336       -1.154574       6.180000 
      19.711377       -1.145245       6.180000 
      19.726794       -1.127679       6.190000 
      19.742455       -1.131789       5.960000 
      19.757690       -1.093154       6.060000 
      19.772594       -1.056957       6.180000 
      19.789299       -1.050146       6.190000 
      19.804338       -1.065426       6.170000 
      19.818562       -1.070772       6.240000 
      19.835467       -1.078425       6.200000 
      19.850382       -1.105710       6.160000 
      19.866535       -1.094539       6.170000 
      19.881463       -1.078413       6.260000 
      19.896742       -1.081553       6.240000 
      19.912248       -1.050588       6.180000 
      19.927320       -1.046203       6.100000 
      19.958579       -1.108421       6.150000 
      19.975816       -1.140675       6.220000 
      19.991712       -1.094596       6.150000 
      20.007949       -1.108881       6.140000 
      20.023887       -1.161758       6.090000 
      20.038382       -1.121447       6.160000 
      20.055358       -1.081584       6.170000 
      20.069997       -1.072115       6.210000 
      20.086127       -1.078922       6.210000 
      20.102601       -1.111566       6.130000 
      20.116766       -1.124592       6.190000 
      20.132261       -1.148359       6.220000 
      20.149108       -1.175657       6.250000 
      20.164374       -1.148789       6.150000 
      20.179507       -1.129575       6.100000 
      20.193589       -1.131263       6.210000 
      20.208889       -1.105807       6.200000 
      20.225534       -1.108452       6.220000 
      20.240553       -1.145658       6.270000 
      20.255741       -1.114693       6.240000 
      20.270883       -1.076255       6.130000 
      20.286536       -1.120066       6.190000 
      20.302135       -1.169425       6.140000 
      20.318044       -1.143403       6.170000 
      20.333020       -1.111610       6.200000 
      20.349225       -1.125048       6.150000 
      20.364134       -1.154145       6.180000 
      20.380025       -1.139860       6.170000 
      20.394502       -1.103939       6.150000 
      20.410682       -1.097751       6.180000 
      20.427602       -1.098997       6.230000 
      20.442726       -1.121088       6.150000 
      20.457116       -1.139307       6.160000 
      20.474063       -1.150671       6.210000 
      20.489515       -1.168473       6.130000 
      20.504473       -1.186039       6.220000 
      20.519992       -1.173416       6.170000 
      20.536229       -1.169442       6.200000 
      20.551612       -1.154131       6.210000 
      20.566703       -1.095036       6.200000 
      20.581894       -1.037177       6.230000 
      20.597866       -1.036304       6.200000 
      20.613505       -1.083795       6.240000 
      20.628747       -1.100338       6.230000 
      20.644282       -1.065430       6.150000 
      20.659862       -1.084227       6.180000 
      20.674487       -1.139776       6.290000 
      20.690654       -1.107535       6.230000 
      20.706559       -1.036290       6.140000 
      20.721659       -1.012993       6.170000 
      20.736236       -1.050172       6.150000 
      20.752634       -1.110250       6.200000 
      20.768140       -1.137534       6.180000 
      20.782710       -1.139832       6.120000 
      20.798506       -1.119622       6.150000 
      20.815701       -1.100408       6.210000 
      20.831617       -1.095439       6.180000 
      20.847628       -1.095010       6.110000 
      20.863127       -1.095036       6.160000 
      20.879035       -1.096325       6.140000 
      20.894054       -1.111179       6.170000 
      20.910140       -1.167130       6.190000 
      20.925543       -1.208823       6.170000 
      20.939611       -1.137534       6.320000 
      20.955620       -1.041259       6.220000 
      20.971102       -1.002625       6.210000 
      20.986953       -1.000918       6.180000 
      21.002030       -1.020093       6.180000 
