

 time    ||    gripping force   ||   raspberry measurement 

      0       0.020000       -794.104651 
      0       0.070000       -794.104651 
      0       0.010000       -794.104651 
      0       0.020000       -794.104651 
      0       0.050000       -794.104651 
      0       0.060000       -794.104651 
      1       0.010000       -786.163605 
      1       0.010000       -778.301969 
      1       0.020000       -770.518949 
      1       0.010000       -762.813755 
      1       0.040000       -755.184449 
      1       0.020000       -747.527419 
      1       0.290000       -744.008961 
      1       0.090000       -701.145103 
      2       0.270000       -509.039575 
      2       0.250000       -192.300044 
      2       0.130000       -0.177960 
      2       0.090000       42.698938 
      4       0.260000       46.257706 
      4       0.290000       46.403835 
      4       0.260000       46.412655 
      4       0.150000       46.405047 
      4       0.080000       46.366039 
      4       0.470000       46.336056 
      5       34.110000       46.365153 
      5       51.030000       46.394249 
      5       64.860000       46.364266 
      5       78.030000       46.325258 
      5       83.460000       46.317644 
      5       90.430000       46.325258 
      5       90.890000       46.364266 
      5       91.110000       46.394222 
      5       90.730000       46.364266 
      5       90.110000       46.325232 
      5       89.850000       46.316759 
      5       89.600000       46.314582 
      6       89.470000       46.319983 
      6       89.290000       46.367163 
      6       89.150000       46.587289 
      6       88.970000       46.956637 
      6       88.790000       47.236814 
      6       88.610000       47.433787 
      6       88.130000       47.665514 
      6       86.130000       47.899149 
      6       85.090000       48.081210 
      6       80.980000       48.216551 
      7       79.010000       48.267741 
      7       78.160000       48.237286 
      7       76.700000       48.192507 
      7       69.360000       48.155311 
      7       69.320000       48.165166 
      7       68.800000       48.175451 
      8       64.390000       48.143640 
      8       64.360000       48.122587 
      8       57.160000       48.125661 
      8       57.000000       48.163339 
      8       56.960000       48.181570 
      8       56.420000       48.091535 
      9       55.720000       47.913520 
      9       54.900000       47.728443 
      9       54.030000       47.586304 
      9       49.980000       47.517686 
      9       47.280000       47.465637 
      9       47.170000       47.419430 
      9       47.010000       47.386706 
      9       46.950000       47.344513 
      9       46.870000       47.321728 
      9       46.850000       47.314890 
      9       46.790000       47.315885 
      10       46.740000       47.314420 
      10       46.720000       47.315415 
      10       46.730000       47.308604 
      10       46.650000       47.286705 
      10       32.690000       47.255311 
      10       28.160000       47.271008 
      10       28.300000       47.305476 
      10       28.420000       47.312620 
      10       28.520000       47.303261 
      10       28.640000       47.243986 
      10       28.660000       47.133439 
      11       28.690000       47.076409 
      11       28.800000       47.138271 
      11       28.780000       47.195617 
      11       28.810000       47.188419 
      11       28.860000       47.104098 
      11       28.920000       47.061141 
      12       28.940000       47.126390 
      12       28.920000       46.996847 
      12       29.010000       46.663439 
      12       28.930000       46.463538 
      12       28.980000       46.418113 
      12       28.930000       46.415980 
      12       28.940000       46.414434 
      12       28.950000       46.415845 
      12       28.930000       46.413560 
      12       28.960000       46.405503 
      12       29.020000       46.371009 
      12       29.000000       46.355338 
      12       28.960000       46.387579 
      13       28.970000       46.418986 
      13       29.010000       46.459297 
      13       28.990000       46.480850 
      13       29.070000       46.474109 
      13       29.000000       46.497463 
      13       29.030000       46.537743 
      13       28.980000       46.568695 
      13       29.010000       46.529231 
      13       29.000000       46.454881 
      13       29.040000       46.423487 
      14       29.030000       46.425715 
      14       29.040000       46.464280 
      14       29.020000       46.494249 
      14       29.050000       46.465152 
      14       29.080000       46.436030 
      14       29.030000       46.465166 
      14       29.060000       46.494692 
      14       29.040000       46.469679 
      14       29.090000       46.449885 
      14       29.020000       46.462481 
      14       29.000000       46.467823 
      14       29.060000       46.480393 
      14       29.030000       46.459740 
      15       29.040000       46.424815 
      15       29.060000       46.416745 
      15       29.080000       46.414460 
      15       29.070000       46.415872 
      15       29.090000       46.414433 
      15       29.050000       46.415872 
      15       29.060000       46.414434 
      15       29.030000       46.415899 
      15       29.070000       46.415333 
      15       29.010000       46.427140 
      15       29.060000       46.469113 
      15       29.060000       46.530655 
      15       28.990000       46.551116 
      15       29.110000       46.530655 
      16       29.040000       46.469113 
      16       29.060000       46.427140 
      16       29.040000       46.415333 
      16       29.060000       46.415899 
      16       29.040000       46.414460 
      16       29.020000       46.416745 
      16       29.070000       46.424802 
      16       29.050000       46.459337 
      16       29.060000       46.476324 
      16       29.020000       46.459824 
      16       29.010000       46.495205 
      16       29.060000       46.546257 
      17       29.120000       46.547683 
      17       29.070000       46.559297 
      17       28.990000       46.552126 
      17       29.130000       46.514517 
      17       29.020000       46.545911 
      17       29.040000       46.589709 
      17       29.010000       46.568779 
      17       29.090000       46.543560 
      17       29.060000       46.526600 
      17       29.030000       46.468750 
      18       29.040000       46.428457 
      18       29.040000       46.431557 
      18       29.100000       46.489363 
      18       29.060000       46.544485 
      18       29.050000       46.531915 
      18       29.080000       46.492078 
      18       29.060000       46.455754 
      18       29.050000       46.471048 
      18       29.070000       46.506376 
      18       29.080000       46.523902 
      18       29.050000       46.558397 
      19       29.080000       46.564612 
      19       29.040000       46.499718 
      19       29.060000       46.455311 
      19       29.050000       46.457996 
      19       29.000000       46.449509 
      19       29.030000       46.470995 
      19       29.010000       46.510889 
      19       29.050000       46.537744 
      19       29.040000       46.555296 
      20       29.030000       46.533217 
      20       29.000000       46.496617 
      20       29.090000       46.469126 
      20       29.050000       46.461636 
      20       29.050000       46.439128 
      20       28.970000       46.422627 
      20       29.060000       46.431531 
      20       29.050000       46.494332 
      21       29.070000       46.564169 
      21       29.030000       46.558410 
      21       29.060000       46.524761 
      21       29.050000       46.516301 
      21       28.960000       46.509061 
      21       29.010000       46.491675 
      21       29.010000       46.474579 
      21       29.000000       46.492977 
      21       29.060000       46.524345 
      21       29.070000       46.577235 
      21       29.040000       46.586165 
      21       29.000000       46.514503 
      21       29.060000       46.511376 
      22       28.990000       46.564639 
      22       29.030000       46.547626 
      22       28.990000       46.475495 
      22       29.070000       46.426158 
      22       29.040000       46.417698 
      22       29.040000       46.426172 
      22       29.070000       46.475937 
      22       29.000000       46.552985 
      22       29.060000       46.587519 
      22       29.020000       46.535503 
      22       29.040000       46.471065 
      22       29.080000       46.490692 
      22       29.090000       46.521201 
      23       29.070000       46.497004 
      23       29.080000       46.487135 
      23       29.010000       46.471881 
      23       29.040000       46.484074 
      23       29.020000       46.546701 
      23       29.040000       46.564266 
      23       29.040000       46.572726 
      23       29.060000       46.596090 
      23       29.000000       46.557885 
      23       29.110000       46.507456 
      23       29.030000       46.495110 
      24       29.030000       46.518170 
      24       29.080000       46.540872 
      24       29.120000       46.566481 
      24       29.010000       46.519402 
      24       29.070000       46.484921 
      24       29.100000       46.508675 
      24       29.120000       46.517131 
      24       29.010000       46.536512 
      24       29.070000       46.533661 
      24       29.090000       46.520868 
      24       29.070000       46.515763 
      25       29.060000       46.527100 
      25       29.090000       46.567367 
      25       29.050000       46.609932 
      25       29.110000       46.564709 
      25       29.090000       46.514946 
      25       29.070000       46.538258 
      25       29.050000       46.556635 
      25       29.090000       46.551670 
      25       29.060000       46.511389 
      25       29.070000       46.527902 
      25       29.040000       46.582191 
      25       29.040000       46.535902 
      25       29.050000       46.482789 
      26       29.020000       46.465513 
      26       29.110000       46.472903 
      26       29.040000       46.498293 
      26       29.110000       46.550354 
      26       29.120000       46.553898 
      26       29.040000       46.524801 
      26       29.090000       46.522130 
      26       29.040000       46.538643 
      26       29.070000       46.555310 
      26       29.060000       46.532801 
      26       29.090000       46.492091 
      26       29.090000       46.455311 
      26       29.100000       46.465623 
      27       29.150000       46.481334 
      27       29.090000       46.474606 
      27       29.170000       46.504232 
      27       29.180000       46.579454 
      27       29.230000       46.696975 
      27       29.290000       46.741633 
      27       29.270000       46.644594 
      27       29.310000       46.546745 
      27       29.350000       46.554938 
      27       29.610000       46.605446 
      27       29.660000       46.630143 
      28       29.920000       46.543573 
      28       30.050000       46.465719 
      28       30.120000       46.459742 
      28       30.100000       46.459877 
      28       30.240000       46.513547 
      28       30.380000       46.561081 
      28       30.400000       46.522060 
      28       30.330000       46.502486 
      28       30.410000       46.511250 
      28       30.370000       46.531679 
      28       30.360000       46.587911 
      28       30.370000       46.646783 
      28       30.300000       46.640402 
      29       30.370000       46.631569 
      29       30.350000       46.591565 
      29       30.330000       46.571078 
      29       30.400000       46.635046 
      29       30.340000       46.681664 
      29       30.380000       46.622986 
      29       30.350000       46.507790 
      29       30.360000       46.454497 
      29       30.350000       46.525286 
      30       30.320000       46.628341 
      30       30.340000       46.623831 
      30       30.370000       46.570568 
      30       30.360000       46.595179 
      30       30.380000       46.634653 
      30       30.350000       46.590236 
      30       30.270000       46.551811 
      30       30.360000       46.609504 
      30       30.370000       46.661551 
      30       30.320000       46.632415 
      31       30.370000       46.645858 
      31       30.300000       46.670051 
      31       30.370000       46.638200 
      31       30.320000       46.602003 
      31       30.310000       46.588381 
      31       30.350000       46.582758 
      31       30.330000       46.548474 
      31       30.320000       46.553179 
      31       30.350000       46.582552 
      31       30.350000       46.601986 
      31       30.350000       46.579898 
      31       30.340000       46.604687 
      31       30.340000       46.659656 
      31       30.280000       46.634240 
      31       30.340000       46.584881 
      32       30.330000       46.592561 
      32       30.310000       46.609491 
      32       30.330000       46.620372 
      32       30.340000       46.632801 
      32       30.380000       46.627043 
      32       30.340000       46.584921 
      32       30.330000       46.601061 
      32       30.350000       46.651643 
      32       30.360000       46.666050 
      32       30.310000       46.669541 
      32       30.350000       46.610446 
      32       30.340000       46.533772 
      33       30.280000       46.514115 
      33       30.370000       46.494304 
      33       30.370000       46.503387 
      33       30.350000       46.550342 
      33       30.330000       46.634643 
      33       30.370000       46.698265 
      33       30.360000       46.701405 
      33       30.330000       46.656599 
      33       30.380000       46.584907 
      33       30.350000       46.571062 
      33       30.320000       46.577694 
      33       30.330000       46.565706 
      33       30.310000       46.625218 
      33       30.340000       46.714861 
      33       30.310000       46.725199 
      33       30.370000       46.681239 
      34       30.320000       46.611845 
      34       30.350000       46.604162 
      34       30.310000       46.642337 
      34       30.290000       46.612605 
      34       30.290000       46.588591 
      34       30.340000       46.617494 
      34       30.300000       46.659335 
      34       30.340000       46.597363 
      34       30.340000       46.488132 
      34       30.300000       46.449554 
      35       30.320000       46.526185 
      35       30.370000       46.644512 
      35       30.300000       46.696006 
      35       30.300000       46.685738 
      35       30.350000       46.654371 
      35       30.330000       46.659350 
      35       30.320000       46.647197 
      35       30.300000       46.596136 
      35       30.340000       46.634727 
      35       30.320000       46.718832 
      35       30.270000       46.679990 
      35       30.300000       46.604635 
      35       30.370000       46.644113 
      35       30.300000       46.697403 
      36       30.320000       46.704617 
      36       30.380000       46.676340 
      36       30.290000       46.678595 
      36       30.310000       46.714929 
      36       30.330000       46.674065 
      36       30.320000       46.598434 
      36       30.270000       46.614960 
      36       30.310000       46.704990 
      36       30.310000       46.698319 
      36       30.320000       46.632871 
      36       30.320000       46.614920 
      37       30.360000       46.603275 
      37       30.310000       46.628385 
      37       30.330000       46.610832 
      37       30.280000       46.514987 
      37       30.280000       46.493505 
      37       30.290000       46.555697 
      37       30.350000       46.604214 
      37       30.310000       46.613964 
      37       30.320000       46.621257 
      37       30.370000       46.639087 
      37       30.280000       46.661595 
      37       30.320000       46.667770 
      37       30.300000       46.679520 
      38       30.270000       46.649358 
      38       30.320000       46.580947 
      38       30.360000       46.550812 
      38       30.310000       46.563395 
      38       30.310000       46.578635 
      38       30.310000       46.629244 
      38       30.320000       46.645384 
      38       30.310000       46.603289 
      38       30.270000       46.598363 
      38       30.290000       46.619859 
      38       30.300000       46.658894 
      38       30.350000       46.675854 
      39       30.330000       46.653981 
      39       30.310000       46.665583 
      39       30.280000       46.681320 
      39       30.280000       46.674122 
      39       30.320000       46.697450 
      39       30.270000       46.737287 
      39       30.330000       46.762907 
      39       30.330000       46.701461 
      39       30.390000       46.614132 
      39       30.330000       46.676908 
      39       30.300000       46.842142 
      39       30.300000       46.872224 
      39       30.340000       46.761071 
      39       30.310000       46.692494 
      40       30.220000       46.631083 
      40       30.330000       46.555352 
      40       30.340000       46.528028 
      40       30.300000       46.540054 
      40       30.280000       46.568364 
      40       30.280000       46.609051 
      40       30.290000       46.702804 
      40       30.310000       46.741699 
      40       30.310000       46.640942 
      40       30.310000       46.542843 
      40       30.340000       46.596575 
      41       30.310000       46.680806 
      41       30.350000       46.671893 
      41       30.300000       46.670498 
      41       30.340000       46.681252 
      41       30.290000       46.666964 
      41       30.340000       46.651671 
      41       30.330000       46.601088 
      41       30.310000       46.585794 
      41       30.280000       46.637398 
      41       30.290000       46.675783 
      41       30.330000       46.675520 
      42       30.310000       46.612564 
      42       30.260000       46.554065 
      42       30.320000       46.529245 
      42       30.300000       46.556223 
      42       30.290000       46.553911 
      42       30.270000       46.519416 
      42       30.340000       46.497934 
      42       30.270000       46.498790 
      42       30.300000       46.532496 
      42       30.300000       46.545373 
      42       30.280000       46.585876 
      43       30.280000       46.673098 
      43       30.290000       46.713988 
      43       30.280000       46.666857 
      43       30.380000       46.615388 
      43       30.280000       46.555254 
      43       30.230000       46.476891 
      43       30.320000       46.436970 
      43       30.330000       46.466066 
      43       30.320000       46.505074 
      43       30.250000       46.513547 
      43       30.290000       46.515818 
      44       30.250000       46.513547 
      44       30.310000       46.505074 
      44       30.220000       46.466079 
      44       30.290000       46.437386 
      44       30.270000       46.481377 
      44       30.310000       46.567726 
      44       30.310000       46.594761 
      44       30.300000       46.546674 
      44       30.280000       46.518600 
      44       30.310000       46.494277 
      45       30.310000       46.497987 
      45       30.350000       46.525661 
      45       30.310000       46.588007 
      45       30.250000       46.633256 
      45       30.320000       46.578981 
      45       30.300000       46.497977 
      45       30.310000       46.504162 
      45       30.280000       46.556152 
      45       30.280000       46.513131 
      45       30.320000       46.460254 
      46       30.320000       46.463381 
      46       30.270000       46.468723 
      46       30.290000       46.490789 
      46       30.310000       46.504078 
      46       30.300000       46.497060 
      46       30.270000       46.503692 
      46       30.310000       46.550784 
      46       30.280000       46.553481 
      46       30.270000       46.519846 
      47       30.310000       46.503332 
      47       30.280000       46.522946 
      47       30.290000       46.571007 
      47       30.310000       46.551599 
      47       30.300000       46.497047 
      47       30.260000       46.455728 
      47       30.320000       46.465206 
      47       30.290000       46.476338 
      47       30.240000       46.454438 
      47       30.290000       46.470968 
      48       30.310000       46.505046 
      48       30.330000       46.507704 
      48       30.310000       46.485792 
      48       30.230000       46.444486 
      48       30.320000       46.421755 
      48       30.290000       46.415803 
      48       30.290000       46.427570 
      48       30.230000       46.473666 
      49       30.340000       46.545371 
      49       30.280000       46.558397 
      49       30.340000       46.543143 
      49       30.250000       46.532428 
      49       30.300000       46.498762 
      49       30.340000       46.497047 
      49       30.300000       46.508591 
      49       30.300000       46.504617 
      49       30.260000       46.465153 
      50       30.310000       46.425741 
      50       30.300000       46.423487 
      50       30.270000       46.454881 
      50       30.270000       46.529231 
      50       30.320000       46.568695 
      50       30.240000       46.537743 
      50       30.310000       46.497464 
      50       30.300000       46.474122 
      50       30.330000       46.481320 
      50       30.340000       46.465609 
      51       30.360000       46.454854 
      51       30.280000       46.486235 
      51       30.300000       46.502748 
      51       30.310000       46.485363 
      51       30.360000       46.444513 
      51       30.310000       46.423057 
      51       30.290000       46.431087 
      51       30.290000       46.488490 
      51       30.330000       46.534573 
      51       30.340000       46.494292 
      51       30.310000       46.459797 
      52       30.270000       46.476351 
      52       30.280000       46.460264 
      52       30.280000       46.436957 
      52       30.250000       46.482223 
      52       30.310000       46.577665 
      52       30.320000       46.633229 
      52       30.320000       46.588409 
      52       30.280000       46.529744 
      52       30.280000       46.506376 
      52       30.280000       46.465193 
      53       30.270000       46.425259 
      53       30.250000       46.416758 
      53       30.300000       46.414460 
      53       30.330000       46.415886 
      53       30.270000       46.414890 
      53       30.340000       46.421728 
      53       30.290000       46.444486 
      53       30.290000       46.485792 
      53       30.250000       46.507718 
      54       30.320000       46.505477 
      54       30.250000       46.475951 
      54       30.230000       46.474109 
      54       30.270000       46.502376 
      54       30.240000       46.492021 
      54       30.290000       46.485819 
      55       30.310000       46.461070 
      55       30.310000       46.435653 
      55       30.290000       46.466026 
      55       30.280000       46.505087 
      55       30.290000       46.513990 
      55       30.240000       46.521244 
      55       30.280000       46.538630 
      55       30.290000       46.555739 
      55       30.260000       46.537744 
      55       30.260000       46.510446 
      55       30.340000       46.465569 
      55       30.290000       46.424412 
      56       30.260000       46.406834 
      56       30.250000       46.376461 
      56       30.250000       46.380422 
      56       30.250000       46.438271 
      56       30.310000       46.491577 
      56       30.270000       46.544485 
      56       30.260000       46.529673 
      56       30.250000       46.484464 
      56       30.270000       46.492548 
      56       30.290000       46.509504 
      56       30.260000       46.520842 
      57       30.290000       46.539100 
      57       30.240000       46.562495 
      57       30.240000       46.579065 
      57       30.170000       46.635059 
      57       30.250000       46.674080 
      57       30.270000       46.656099 
      57       30.290000       46.607345 
      57       30.320000       46.529702 
      57       30.230000       46.508772 
      57       30.230000       46.539127 
      57       30.260000       46.575464 
      57       30.230000       46.570082 
      57       30.290000       46.573182 
      57       30.280000       46.596090 
      57       30.290000       46.557482 
      58       30.240000       46.503360 
      58       30.220000       46.486250 
      58       30.300000       46.540942 
      58       30.280000       46.598332 
      58       30.290000       46.597349 
      58       30.230000       46.548613 
      58       30.240000       46.518060 
      58       30.300000       46.572336 
      58       30.290000       46.572696 
      58       30.310000       46.523472 
      58       30.310000       46.487122 
      59       30.300000       46.445009 
      59       30.270000       46.428457 
      59       30.270000       46.455325 
      59       30.270000       46.529741 
      59       30.270000       46.575854 
      59       30.320000       46.583107 
      59       30.290000       46.629204 
      59       30.300000       46.639555 
      59       30.300000       46.573652 
      60       30.250000       46.532942 
      60       30.230000       46.539543 
      60       30.220000       46.555793 
      60       30.310000       46.538631 
      60       30.270000       46.521271 
      60       30.260000       46.514877 
      60       30.260000       46.515885 
      60       30.280000       46.514433 
      60       30.280000       46.515872 
      60       30.240000       46.514473 
      60       30.270000       46.517201 
      60       30.220000       46.530631 
      61       30.300000       46.588476 
