Human trial picking the raspberry twin 

 time    ||     output compensated 

      0       -799.676923 
      0       -799.676923 
      0       -799.676923 
      0       -799.676923 
      0       -799.676923 
      0       -799.676923 
      0       -799.676923 
      0       -799.676923 
      0       -799.676923 
      0       -799.676918 
      0       -799.675729 
      0       -799.568692 
      0       -796.024113 
      0       -752.842554 
      0       -559.318895 
      0       -240.258728 
      0       -46.728341 
      0       -3.526186 
      0       -0.031374 
      0       -0.030519 
      0       -0.064268 
      0       0.012780 
      0       0.068318 
      0       0.041050 
      0       0.053093 
      0       0.079546 
      0       0.054945 
      0       0.045051 
      0       0.029407 
      0       0.037880 
      0       0.094857 
      0       0.133308 
      0       0.129808 
      0       0.067436 
      0       0.063059 
      0       0.093375 
      0       0.045989 
      0       -0.016812 
      0       -0.048154 
      0       -0.055821 
      0       0.008353 
      0       0.089773 
      0       0.078229 
      0       0.002418 
      0       0.008822 
      0       0.037753 
      0       -0.015790 
      0       -0.047308 
      0       0.018625 
      0       0.079089 
      0       0.149491 
      0       0.132798 
      0       0.001598 
      1       -0.054462 
      1       -0.046883 
      1       -0.087636 
      1       -0.153522 
      1       -0.144983 
      1       -0.035668 
      1       0.056650 
      1       0.093470 
      1       0.098746 
      1       0.039251 
      1       0.020424 
      1       0.060731 
      1       0.002898 
      1       -0.030611 
      1       0.058436 
      1       0.110480 
      1       0.052248 
      1       0.000700 
      1       0.035209 
      1       0.110967 
      1       0.145865 
      1       0.097984 
      1       0.043722 
      1       0.056306 
      1       0.095739 
      1       0.127940 
      1       0.102940 
      1       0.080862 
      1       0.086827 
      1       0.054420 
      1       0.052318 
      1       0.056651 
      1       0.091738 
      1       0.098747 
      1       0.041077 
      1       0.023538 
      1       0.010981 
      1       -0.021712 
      1       0.032967 
      1       0.105470 
      1       0.056717 
      1       -0.045493 
      1       -0.053537 
      1       0.012283 
      1       0.050404 
      1       0.011343 
      1       -0.066094 
      1       -0.115014 
      1       -0.113601 
      1       -0.068365 
      1       0.003756 
      1       0.022168 
      1       0.030667 
      1       0.054422 
      2       0.019923 
      2       -0.025327 
      2       -0.064818 
      2       -0.063852 
      2       -0.031212 
      2       -0.076019 
      2       -0.111343 
      2       -0.035655 
      2       0.023440 
      2       0.020909 
      2       0.060651 
      2       0.065700 
      2       -0.017711 
      2       0.007082 
      2       0.119931 
      2       0.168187 
      2       0.121973 
      2       0.085449 
      2       0.092420 
      2       0.117847 
      2       0.142217 
      2       0.177779 
      2       0.167834 
      2       0.111285 
      2       0.047968 
      2       0.025765 
      2       -0.014465 
      2       -0.047116 
      2       -0.032929 
      2       -0.063281 
      2       -0.078475 
      2       -0.009980 
      2       0.002204 
      2       -0.083479 
      2       -0.083039 
      2       -0.002866 
      2       0.035355 
      2       -0.012027 
      2       -0.066000 
      2       -0.056486 
      2       -0.019974 
      2       0.060532 
      2       0.115769 
      2       0.030771 
      2       -0.075482 
      2       -0.083680 
      2       -0.067728 
      2       -0.059948 
      2       0.014257 
      2       0.077122 
      2       0.027099 
      2       -0.057381 
      2       -0.063099 
      2       0.006792 
      3       0.051056 
      3       0.048327 
      3       -0.004039 
      3       -0.035026 
      3       0.012783 
      3       0.062371 
      3       0.106960 
      3       0.131643 
      3       0.130323 
      3       0.105504 
      3       -0.000238 
      3       -0.053022 
      3       0.007381 
      3       0.064943 
      3       0.068766 
      3       0.021922 
      3       0.014218 
      3       0.030853 
      3       0.054608 
      3       0.128515 
      3       0.120131 
      3       0.018754 
      3       0.027407 
      3       0.108698 
      3       0.141817 
      3       0.127051 
      3       0.029918 
      3       -0.115383 
      3       -0.153724 
      3       -0.055056 
      3       0.031996 
      3       0.060541 
      3       0.100255 
      3       0.127233 
      3       0.075829 
      3       -0.047800 
      3       -0.154254 
      3       -0.114545 
      3       0.024968 
      3       0.082412 
      3       0.007069 
      3       -0.049761 
      3       0.036835 
      3       0.152170 
      3       0.130791 
      3       0.042425 
      3       0.011959 
      3       0.021006 
      3       0.038720 
      3       0.020383 
      3       0.010201 
      3       0.031644 
      3       0.097148 
      3       0.155077 
      4       0.166474 
      4       0.098212 
      4       0.056966 
      4       0.130837 
      4       0.186370 
      4       0.164077 
      4       0.146926 
      4       0.161431 
      4       0.185965 
      4       0.154410 
      4       0.116467 
      4       0.115328 
      4       0.086138 
      4       0.095584 
      4       0.145535 
      4       0.112600 
      4       -0.014902 
      4       -0.034774 
      4       0.074711 
      4       0.120501 
      4       0.084312 
      4       0.001765 
      4       -0.051399 
      4       -0.016773 
      4       0.058846 
      4       0.098565 
      4       0.078612 
      4       0.077253 
      4       0.108121 
      4       0.100692 
      4       0.053656 
      4       -0.029462 
      4       -0.016684 
      4       0.052170 
      4       0.089879 
      4       0.119092 
      4       0.092205 
      4       0.080636 
      4       0.121092 
      4       0.114945 
      4       0.054882 
      4       -0.019885 
      4       -0.019539 
      4       0.037269 
      4       0.042801 
      4       -0.002984 
      4       -0.003723 
      4       0.032110 
      5       0.076339 
      5       0.089131 
      5       0.062722 
      5       0.049064 
      5       0.101511 
      5       0.138511 
      5       0.135454 
      5       0.075009 
      5       0.015780 
      5       0.003127 
      5       0.009808 
      5       0.044259 
      5       0.064702 
      5       0.056929 
      5       0.074149 
      5       0.089782 
      5       0.085801 
      5       0.050780 
      5       0.029426 
      5       0.037135 
      5       0.029638 
      5       0.060013 
      5       0.131196 
      5       0.168129 
      5       0.128654 
      5       0.060891 
      5       0.052275 
      5       0.083189 
      5       0.036283 
      5       -0.018290 
      5       -0.014039 
      5       -0.015353 
      5       -0.015034 
      5       -0.032821 
      5       -0.024286 
      5       0.013029 
      5       0.063218 
      5       0.104127 
      5       0.124969 
      5       0.101822 
      5       0.058812 
      5       0.002173 
      5       -0.062519 
      5       -0.113872 
      5       -0.082066 
      6       -0.027647 
      6       -0.004689 
      6       0.034840 
      6       0.059254 
      6       0.009532 
      6       -0.054960 
      6       -0.088534 
      6       -0.111165 
      6       -0.050137 
      6       0.043058 
      6       0.079917 
      6       0.092469 
      6       0.113702 
      6       0.143646 
      6       0.126230 
      6       0.085460 
      6       0.052235 
      6       0.004636 
      6       -0.041097 
      6       -0.077950 
      6       -0.071443 
      6       -0.068493 
      6       -0.067808 
      6       -0.004091 
      6       0.018945 
      6       0.009576 
      6       0.063530 
      6       0.131209 
      6       0.123331 
      6       0.079359 
      6       0.036613 
      6       0.002315 
      6       -0.019223 
      6       -0.042300 
      6       0.029302 
      6       0.092268 
      6       0.131457 
      6       0.166381 
      6       0.171469 
      6       0.156859 
      6       0.092744 
      7       0.023516 
      7       0.038822 
      7       0.109830 
      7       0.158453 
      7       0.175999 
      7       0.215928 
      7       0.269340 
      7       0.347446 
      7       0.472738 
      7       0.595461 
      7       0.803528 
      7       1.148213 
      7       1.530643 
      7       1.874000 
      7       2.073986 
      7       2.130160 
      7       2.141498 
      7       2.163563 
      7       2.279788 
      7       2.532597 
      7       2.854024 
      7       3.146826 
      7       3.378221 
      7       3.577849 
      7       3.827173 
      7       4.193921 
      7       4.564169 
      7       4.774953 
      7       4.853543 
      7       4.961185 
      7       5.135239 
      7       5.297946 
      7       5.422255 
      7       5.569590 
      7       5.805479 
      7       5.970965 
      7       5.829366 
      8       5.370771 
      8       4.789441 
      8       3.942326 
      8       2.557752 
      8       0.993522 
      8       0.337138 
      8       0.642166 
      8       0.819708 
      8       0.568275 
      8       0.242986 
      8       -0.082733 
      8       -0.459374 
      8       -0.747646 
      8       -0.932120 
      8       -1.171076 
      8       -1.508639 
      8       -1.760147 
      8       -1.844923 
      8       -1.860262 
      9       -1.859804 
      9       -1.861270 
      9       -1.859832 
      9       -1.861270 
      9       -1.859832 
      9       -1.861270 
      9       -1.859832 
      9       -1.861270 
      9       -1.841234 
      9       -1.824245 
      10       -1.804579 
      10       -1.787957 
      10       -1.768654 
      10       -1.752391 
      10       -1.733443 
      10       -1.717533 
      10       -1.698933 
      10       -1.683368 
      10       -1.665110 
      10       -1.649857 
      10       -1.631083 
      10       -1.606384 
      10       -1.551676 
      10       -1.506503 
      11       -1.521094 
      11       -1.544527 
      11       -1.537471 
      11       -1.524371 
      11       -1.507729 
      11       -1.494076 
      11       -1.477711 
      11       -1.464332 
      11       -1.447414 
      11       -1.424551 
      11       -1.385516 
      11       -1.355561 
      12       -1.385516 
      12       -1.424551 
      12       -1.433024 
      12       -1.435322 
      12       -1.433910 
      12       -1.435349 
      12       -1.433911 
      12       -1.435349 
      12       -1.433911 
      12       -1.435349 
      12       -1.433911 
      12       -1.435349 
      12       -1.433911 
      12       -1.435349 
      12       -1.433910 
      12       -1.435322 
      12       -1.433024 
      12       -1.424551 
      13       -1.385516 
      13       -1.355561 
      13       -1.385516 
      13       -1.424551 
      13       -1.433024 
      13       -1.435322 
      13       -1.433910 
      13       -1.435349 
      13       -1.419572 
      13       -1.406800 
      13       -1.391308 
      13       -1.378819 
      13       -1.363607 
      13       -1.351394 
      13       -1.336457 
      13       -1.324516 
      13       -1.309847 
      14       -1.298172 
      14       -1.283767 
      14       -1.272353 
      14       -1.258205 
      14       -1.247047 
      14       -1.233153 
      14       -1.222245 
      14       -1.208585 
      14       -1.197485 
      14       -1.178781 
      14       -1.145752 
      14       -1.108532 
      14       -1.136065 
      15       -1.187659 
      15       -1.159804 
      15       -1.076823 
      15       -1.017211 
      15       -0.998638 
      15       -0.996189 
      15       -1.025696 
      15       -1.054907 
      15       -1.051922 
      15       -1.033866 
      15       -0.984909 
      15       -0.945378 
      15       -0.964742 
      15       -0.984339 
      15       -0.950158 
      16       -0.925967 
      16       -0.947787 
      16       -0.959139 
      16       -0.946477 
      16       -0.898807 
      16       -0.860176 
      16       -0.881231 
      16       -0.911062 
      16       -0.910341 
      17       -0.903512 
      17       -0.893079 
      17       -0.885573 
      17       -0.875293 
      17       -0.867938 
      17       -0.856983 
      17       -0.840025 
      17       -0.792980 
      17       -0.755394 
      17       -0.777483 
      17       -0.807914 
      17       -0.802878 
      17       -0.773170 
      17       -0.724571 
      17       -0.695645 
      17       -0.691733 
      18       -0.723021 
      18       -0.745460 
      18       -0.709200 
      18       -0.673303 
      18       -0.696253 
      18       -0.727935 
      18       -0.729070 
      18       -0.724892 
      18       -0.725646 
      18       -0.752540 
      18       -0.760555 
      18       -0.721869 
      18       -0.692970 
      18       -0.679298 
      18       -0.673490 
      18       -0.665318 
      18       -0.660089 
      18       -0.652064 
      18       -0.646967 
      18       -0.639074 
      18       -0.634107 
      19       -0.626342 
      19       -0.621502 
      19       -0.613863 
      19       -0.609149 
      19       -0.601633 
      19       -0.597041 
      19       -0.589646 
      19       -0.585174 
      19       -0.577898 
      19       -0.573517 
      19       -0.565506 
      19       -0.551436 
      19       -0.506427 
      19       -0.461894 
      19       -0.449711 
      19       -0.452778 
      19       -0.487719 
      19       -0.522310 
      20       -0.524651 
      20       -0.511867 
      20       -0.468131 
      20       -0.433793 
      20       -0.459112 
      20       -0.493165 
      20       -0.496621 
      20       -0.493904 
      20       -0.486716 
      20       -0.473460 
      20       -0.430082 
      20       -0.396125 
      20       -0.421820 
      20       -0.456246 
      20       -0.460072 
