

 time    ||    gripping force   ||   raspberry measurement 

      0       99.800000       -794.948387 
      0       99.770000       -794.948387 
      0       79.280000       -794.948387 
      0       48.630000       -794.948387 
      0       43.000000       -794.948387 
      0       36.960000       -794.948387 
      0       30.780000       -794.948387 
      0       27.110000       -794.948387 
      0       23.820000       -794.948387 
      0       21.190000       -794.948382 
      0       19.220000       -794.947200 
      0       18.200000       -794.840805 
      0       17.190000       -791.317500 
      1       14.600000       -748.395206 
      1       13.260000       -556.036578 
      1       12.600000       -238.935400 
      1       11.880000       -46.770404 
      1       11.420000       -4.189555 
      1       11.090000       -0.965224 
      1       10.940000       -1.018047 
      1       10.910000       -1.058591 
      1       10.740000       -1.055181 
      1       10.360000       -1.144800 
      1       16.690000       -1.303545 
      1       26.320000       -1.398519 
      1       40.770000       -1.420642 
      1       50.720000       -1.429989 
      2       68.120000       -1.545768 
      2       82.450000       -1.719561 
      2       92.410000       -1.804359 
      2       91.640000       -1.748329 
      2       91.110000       -1.690607 
      2       89.630000       -1.754681 
      2       89.450000       -1.842040 
      2       89.290000       -1.841170 
      3       89.170000       -1.807011 
      3       88.850000       -1.785979 
      3       88.610000       -1.708291 
      3       88.570000       -1.508445 
      3       88.570000       -1.252332 
      3       88.520000       -1.078907 
      4       88.490000       -0.903847 
      4       88.450000       -0.604042 
      4       88.460000       -0.246725 
      4       88.440000       -0.045007 
      4       90.020000       -0.002770 
      4       92.480000       0.002228 
      4       95.610000       0.000897 
      4       96.940000       0.002336 
      5       96.810000       0.000898 
      5       96.670000       0.002336 
      5       96.670000       0.000898 
      6       96.540000       0.002336 
      6       96.470000       0.000898 
      6       96.350000       0.002336 
      6       96.370000       0.000898 
      6       101.300000       0.002336 
      6       101.290000       0.000884 
      7       101.210000       0.001880 
      7       101.200000       -0.004931 
      7       101.120000       -0.026830 
      7       101.060000       -0.058251 
      8       100.920000       -0.043400 
      8       100.920000       -0.018400 
      8       100.930000       -0.043400 
      8       100.950000       -0.058251 
      8       100.880000       -0.026830 
      8       100.850000       -0.004931 
      8       100.820000       0.001880 
      8       100.870000       0.000911 
      8       100.800000       0.003223 
      8       100.860000       0.011696 
      8       100.840000       0.050731 
      9       100.840000       0.080713 
      9       100.860000       0.051604 
      9       100.810000       0.022064 
      9       100.760000       0.046648 
      9       100.760000       0.061485 
      9       100.700000       0.030064 
      10       100.670000       0.008165 
      10       100.740000       0.001354 
      10       100.680000       0.002350 
      10       100.710000       0.000898 
      10       100.650000       0.002336 
      10       100.690000       0.000898 
      11       100.560000       0.002336 
      11       100.530000       0.000898 
      12       100.560000       0.002336 
      12       100.520000       0.000898 
      12       100.510000       0.002337 
      12       100.520000       0.000925 
      12       100.560000       0.003223 
      12       100.500000       0.011696 
      12       100.470000       0.050730 
      13       100.450000       0.080686 
      14       100.410000       0.050730 
      14       100.430000       0.011696 
      14       100.380000       0.003223 
      14       100.460000       0.000925 
      14       100.400000       0.002336 
      14       100.390000       0.000885 
      15       100.370000       0.001893 
      15       100.350000       -0.004501 
      15       100.360000       -0.021860 
      16       100.330000       -0.038969 
      16       100.370000       -0.020974 
      16       100.320000       0.006297 
      16       100.330000       0.050287 
      16       100.350000       0.080673 
      16       100.320000       0.050730 
      16       100.340000       0.011696 
      16       100.360000       0.003223 
      17       100.290000       0.000925 
      17       100.280000       0.002337 
      17       100.290000       0.000925 
      18       100.280000       0.003223 
      18       100.250000       0.011683 
      18       100.280000       0.049771 
      18       100.260000       0.073611 
      18       100.290000       0.020115 
      18       100.260000       -0.048387 
      18       100.260000       -0.042175 
      18       100.280000       -0.008454 
      19       100.270000       -0.000420 
      19       100.300000       0.001846 
      19       100.330000       0.000456 
      19       100.210000       0.002727 
      20       100.280000       0.011088 
      20       100.230000       0.049621 
      20       100.230000       0.078782 
      20       100.250000       0.048337 
      20       100.200000       0.009210 
      21       100.240000       0.000743 
      21       100.240000       -0.001101 
      21       100.230000       0.005626 
      22       100.200000       0.027250 
      22       100.210000       0.058057 
      23       100.140000       0.041937 
      23       100.200000       0.007367 
      24       100.110000       -0.000683 
      24       100.090000       -0.002938 
      25       100.160000       -0.001510 
      25       100.160000       -0.002893 
      25       100.200000       -0.000589 
      25       100.210000       0.007805 
      25       100.130000       0.046371 
      25       100.150000       0.075590 
      25       100.120000       0.046029 
      26       100.170000       0.016738 
      26       100.100000       0.045401 
      26       100.120000       0.073753 
      26       100.130000       0.043333 
      27       100.120000       0.004255 
      27       100.110000       -0.004176 
      27       100.140000       -0.006383 
      27       100.090000       -0.004083 
      27       100.040000       0.003933 
      28       100.100000       0.038044 
      28       100.110000       0.053204 
      28       100.040000       0.021591 
      28       100.100000       -0.000304 
      29       100.060000       -0.007044 
      29       100.030000       -0.005988 
      29       100.050000       -0.007365 
      29       100.090000       -0.005868 
      29       100.090000       -0.007207 
      29       100.090000       -0.004873 
      29       100.080000       0.003152 
      29       100.080000       0.037297 
      29       100.060000       0.053315 
      29       100.060000       0.031515 
      29       100.100000       0.046740 
      30       100.080000       0.070610 
      30       100.050000       0.039809 
      30       100.060000       0.000753 
      30       99.990000       -0.007643 
      30       100.040000       -0.009841 
      30       100.060000       -0.008345 
      30       100.120000       -0.009660 
      31       100.050000       -0.007288 
      31       100.120000       0.001200 
      31       100.020000       0.040683 
      31       100.040000       0.079745 
      32       100.100000       0.086511 
      32       100.020000       0.078069 
      33       100.060000       0.037381 
      33       100.050000       -0.007807 
      33       100.030000       -0.039248 
      33       100.080000       -0.070813 
      34       100.090000       -0.055429 
      34       100.040000       -0.030125 
      34       100.020000       -0.054574 
      34       100.020000       -0.068730 
      34       100.040000       -0.036936 
      35       100.110000       -0.014887 
      35       99.960000       -0.007995 
      35       100.060000       -0.008901 
      35       100.060000       -0.007374 
      35       100.060000       -0.008724 
      35       100.030000       -0.007213 
      35       100.010000       -0.008565 
      35       100.060000       -0.007042 
      36       99.960000       -0.007957 
      36       100.050000       -0.001135 
      36       99.990000       0.020557 
      36       99.940000       0.051458 
      36       100.020000       0.036254 
      37       99.950000       0.011554 
      37       100.030000       0.040682 
      37       99.950000       0.069094 
      37       100.000000       0.038721 
      37       99.970000       -0.000285 
      37       99.980000       -0.007819 
      38       99.990000       -0.000204 
      38       99.930000       0.038390 
      38       99.970000       0.066824 
      38       100.030000       0.027099 
      39       99.950000       -0.044542 
      39       100.000000       -0.069449 
      39       99.980000       -0.038525 
      39       99.940000       -0.016460 
      40       99.990000       -0.008702 
      40       99.980000       0.000212 
      40       99.940000       0.038867 
      40       99.960000       0.068135 
      40       99.970000       0.037798 
      40       99.950000       -0.001224 
      40       99.910000       -0.009601 
      40       99.970000       -0.011780 
      41       99.940000       -0.010264 
      41       99.960000       -0.011559 
      41       99.900000       -0.009169 
      41       99.940000       -0.000702 
      41       99.910000       0.037524 
      41       99.890000       0.061899 
      42       99.950000       0.013013 
      42       99.980000       -0.041301 
      42       99.990000       -0.033737 
      42       99.930000       -0.017064 
      42       99.970000       -0.010589 
      42       99.970000       -0.011482 
      43       99.980000       -0.009930 
      43       99.970000       -0.011255 
      43       99.890000       -0.009718 
      43       99.940000       -0.011019 
      44       99.940000       -0.008633 
      44       99.930000       -0.000132 
      44       99.810000       0.039364 
      44       99.820000       0.078440 
      44       100.010000       0.085219 
      44       99.840000       0.076830 
      44       100.000000       0.037444 
      44       99.940000       0.007413 
      45       99.880000       0.036995 
      45       99.860000       0.075243 
      45       99.850000       0.082028 
      45       99.930000       0.073644 
      45       99.880000       0.033438 
      45       99.900000       -0.006365 
      45       99.930000       -0.013878 
      45       99.880000       -0.006614 
      46       99.910000       0.027576 
      46       99.960000       0.042840 
      46       99.880000       0.011331 
      46       99.910000       -0.010462 
      46       99.940000       -0.017100 
      47       99.890000       -0.015944 
      47       99.870000       -0.017195 
      48       99.930000       -0.014748 
      48       99.870000       -0.006212 
      48       99.890000       0.032494 
      48       99.950000       0.061825 
      48       99.860000       0.031551 
      48       99.900000       -0.007382 
      49       99.860000       -0.014846 
      49       99.920000       -0.007133 
      49       99.870000       0.032407 
      49       99.830000       0.071551 
      49       99.890000       0.078400 
      50       99.870000       0.070078 
      50       99.890000       0.030760 
      50       99.960000       0.000796 
      50       99.920000       0.030431 
      50       99.900000       0.068332 
      50       99.850000       0.070692 
      51       99.870000       0.048305 
      51       99.840000       0.006929 
      52       99.870000       -0.015671 
      52       99.890000       -0.022283 
      52       99.850000       -0.021075 
      52       99.830000       -0.022262 
      52       99.880000       -0.019339 
      52       99.900000       -0.005851 
      52       99.910000       0.051462 
      53       99.860000       0.096144 
      53       99.900000       0.049986 
      53       99.840000       -0.007768 
      53       99.900000       -0.020985 
      53       99.850000       -0.023476 
      53       99.830000       -0.021857 
      54       99.840000       -0.023062 
      54       99.890000       -0.021407 
      54       99.870000       -0.022591 
      54       99.820000       -0.020090 
      55       99.870000       -0.011501 
      55       99.800000       0.027259 
      55       99.910000       0.056668 
      55       99.900000       0.027283 
      56       99.850000       -0.002233 
      56       99.800000       0.022153 
      58       99.880000       0.037472 
      58       99.780000       0.015830 
      59       99.800000       0.032062 
      59       99.820000       0.065892 
      59       99.750000       0.072358 
      59       99.810000       0.064058 
      59       99.830000       0.023948 
      59       99.820000       -0.015787 
      59       99.870000       -0.024044 
      60       99.850000       -0.026079 
      60       99.830000       -0.024420 
      60       99.940000       -0.025574 
      60       99.850000       -0.023043 
