Human trial picking the raspberry twin 

 time    ||     output     ||     loadcell

      0.000000       -798.684375       0.050000 
      0.015344       -798.684375       0.010000 
      0.029812       -798.684375       0.020000 
      0.045163       -798.684375       0.040000 
      0.061872       -798.684375       0.070000 
      0.077362       -798.684375       0.080000 
      0.092381       -798.684375       0.010000 
      0.108398       -798.684375       0.060000 
      0.124438       -798.684375       0.010000 
      0.139425       -798.684370       0.020000 
      0.154019       -798.683183       0.020000 
      0.170568       -798.576306       0.090000 
      0.185523       -795.037018       0.080000 
      0.200480       -751.919376       0.010000 
      0.215691       -558.675753       0.030000 
      0.229842       -240.052168       0.020000 
      0.245871       -46.765983       0.020000 
      0.261781       -3.651012       0.020000 
      0.276649       -0.166843       0.000000 
      0.291993       -0.038870       0.010000 
      0.307230       0.045163       0.020000 
      0.323045       0.073436       0.040000 
      0.337534       0.044353       0.050000 
      0.354409       0.017388       0.020000 
      0.368372       0.008086       0.020000 
      0.382876       0.048353       0.020000 
      0.400034       0.111585       0.010000 
      0.415263       0.089067       0.050000 
      0.430656       0.065035       0.030000 
      0.444647       0.088567       0.080000 
      0.460789       0.040778       0.060000 
      0.475918       -0.085269       0.120000 
      0.491834       -0.134479       0.090000 
      0.507761       -0.109939       0.020000 
      0.521924       -0.074462       0.050000 
      0.538320       -0.083927       0.020000 
      0.552660       -0.088827       0.070000 
      0.568156       -0.033222       0.000000 
      0.582473       0.023628       0.010000 
      0.597785       0.035799       0.030000 
      0.614311       0.023202       0.030000 
      0.628765       0.025457       0.010000 
      0.645719       -0.019849       0.070000 
      0.661834       -0.095528       0.050000 
      0.677579       -0.137277       0.020000 
      0.692698       -0.177575       0.080000 
      0.707089       -0.188343       0.000000 
      0.723847       -0.132791       0.020000 
      0.739535       -0.071831       0.010000 
      0.754618       -0.049875       0.040000 
      0.770321       -0.073143       0.040000 
      0.786336       -0.064603       0.000000 
      0.801579       0.002120       0.000000 
      0.817202       0.032668       0.080000 
      0.832580       0.028558       0.050000 
      0.848473       -0.011696       0.030000 
      0.863773       -0.061045       0.020000 
      0.879766       -0.035852       0.070000 
      0.895040       -0.015366       0.070000 
      0.910459       0.001344       0.020000 
      0.926313       0.039773       0.010000 
      0.941685       0.073462       0.040000 
      0.956796       0.050568       0.060000 
      0.972313       -0.013037       0.020000 
      0.987669       -0.013481       0.040000 
      1.003289       0.044671       0.040000 
      1.019291       0.042053       0.090000 
      1.033736       -0.047191       0.030000 
      1.050299       -0.173987       0.020000 
      1.063230       -0.256407       0.020000 
      1.078286       -0.171745       0.050000 
      1.095355       -0.039537       0.040000 
      1.111022       0.006589       0.020000 
      1.125274       0.022373       0.070000 
      1.140587       0.043343       0.000000 
      1.157233       0.076162       0.020000 
      1.172603       0.058114       0.060000 
      1.187781       0.013413       0.030000 
      1.203690       -0.053905       0.040000 
      1.218681       -0.165474       0.080000 
      1.234766       -0.207056       0.040000 
      1.252438       -0.099185       0.040000 
      1.267397       -0.017595       0.020000 
      1.282924       -0.028776       0.020000 
      1.298346       0.029916       0.060000 
      1.312800       0.044211       0.050000 
      1.328613       -0.070861       0.060000 
      1.344911       -0.149746       0.080000 
      1.359658       -0.122479       0.010000 
      1.374800       -0.045336       0.020000 
      1.391071       -0.007793       0.010000 
      1.405489       -0.045350       0.090000 
      1.421002       -0.122989       0.030000 
      1.437518       -0.157322       0.100000 
      1.451794       -0.120791       0.010000 
      1.467080       -0.102660       0.050000 
      1.483327       -0.147203       0.040000 
      1.498641       -0.143436       0.090000 
      1.514178       -0.096081       0.010000 
      1.530375       -0.000043       0.040000 
      1.545822       0.038816       0.030000 
      1.561437       -0.001855       0.030000 
      1.575397       -0.032818       0.020000 
      1.590437       -0.059247       0.010000 
      1.606657       -0.078488       0.000000 
      1.621684       -0.078098       0.010000 
      1.637100       -0.055178       0.020000 
      1.653570       -0.024819       0.070000 
      1.667615       -0.034578       0.080000 
      1.685590       -0.057529       0.060000 
      1.700397       -0.077173       0.060000 
      1.715018       -0.150277       0.110000 
      1.731905       -0.185588       0.010000 
      1.746989       -0.147159       0.070000 
      1.762208       -0.061490       0.040000 
      1.777190       0.007931       0.000000 
      1.793249       -0.025236       0.020000 
      1.809587       -0.102279       0.050000 
      1.824333       -0.089713       0.080000 
      1.838129       -0.025695       0.040000 
      1.853314       -0.074045       0.060000 
      1.870218       -0.163632       0.050000 
      1.885423       -0.119751       0.050000 
      1.901483       -0.019380       0.010000 
      1.917441       0.055952       0.010000 
      1.931415       0.083680       0.070000 
      1.946374       0.010229       0.080000 
      1.963329       -0.077155       0.070000 
      1.978835       -0.067703       0.020000 
      1.994829       -0.011326       0.110000 
      2.010558       -0.022937       0.030000 
      2.025540       -0.075827       0.050000 
      2.042271       -0.038634       0.050000 
      2.058227       -0.014481       0.020000 
      2.073557       -0.071317       0.040000 
      2.087518       -0.096883       0.020000 
      2.103551       -0.082598       0.090000 
      2.119548       -0.050195       0.060000 
      2.135257       -0.000205       0.060000 
      2.151600       0.010285       0.070000 
      2.166916       -0.014091       0.100000 
      2.181098       -0.050692       0.090000 
      2.195518       -0.141830       0.080000 
      2.210816       -0.171624       0.130000 
      2.226299       -0.172852       0.060000 
      2.242433       -0.183292       0.060000 
      2.257828       -0.137858       0.010000 
      2.273153       -0.097345       0.040000 
      2.287446       -0.171829       0.060000 
      2.302791       -0.199000       0.000000 
      2.320007       -0.122076       0.060000 
      2.335478       0.008040       0.050000 
      2.351539       0.102464       0.120000 
      2.367314       0.078324       0.000000 
      2.382279       0.003975       0.020000 
      2.399232       -0.042677       0.040000 
      2.414661       -0.101812       0.010000 
      2.430562       -0.129580       0.120000 
      2.446276       -0.073643       0.080000 
      2.462628       -0.055705       0.000000 
      2.477873       -0.100967       0.100000 
      2.492985       -0.127393       0.100000 
      2.508215       -0.134647       0.080000 
      2.524130       -0.134511       0.030000 
      2.539192       -0.145445       0.000000 
      2.554563       -0.176646       0.040000 
      2.569837       -0.190668       0.110000 
      2.586268       -0.141695       0.070000 
      2.601232       -0.115835       0.040000 
      2.616031       -0.099099       0.000000 
      2.631440       -0.065143       0.070000 
      2.646725       -0.044007       0.040000 
      2.662212       -0.048946       0.030000 
      2.691713       -0.025179       0.030000 
      2.707268       0.020032       0.020000 
      2.722602       0.003071       0.050000 
      2.740183       -0.059327       0.000000 
      2.755385       -0.117024       0.080000 
      2.770412       -0.131923       0.050000 
      2.785765       -0.130550       0.020000 
      2.801688       -0.186585       0.030000 
      2.817887       -0.178958       0.080000 
      2.833141       -0.157019       0.000000 
      2.848574       -0.191058       0.050000 
      2.864002       -0.165002       0.020000 
      2.878434       -0.086253       0.040000 
      2.909650       -0.006355       0.070000 
      2.925741       -0.007377       0.020000 
      2.941114       -0.079845       0.080000 
      2.956705       -0.147159       0.030000 
      2.972315       -0.167247       0.100000 
      2.987018       -0.135519       0.070000 
      3.003203       -0.104998       0.100000 
      3.018505       -0.140919       0.040000 
      3.034477       -0.191927       0.000000 
      3.049858       -0.193782       0.030000 
      3.063428       -0.144449       0.050000 
      3.079841       -0.125651       0.030000 
      3.095642       -0.154291       0.060000 
      3.109774       -0.166414       0.020000 
      3.126018       -0.119323       0.010000 
      3.140748       -0.031951       0.010000 
      3.156773       -0.015434       0.140000 
      3.172753       -0.091069       0.050000 
      3.186985       -0.129678       0.120000 
      3.203500       -0.151217       0.100000 
      3.219235       -0.211682       0.120000 
      3.234578       -0.214853       0.080000 
      3.250922       -0.237764       0.120000 
      3.266109       -0.328640       0.170000 
      3.281070       -0.325092       0.080000 
      3.296500       -0.213510       0.020000 
      3.311943       -0.107740       0.040000 
      3.326567       -0.075443       0.060000 
      3.342801       -0.100149       0.140000 
      3.357708       -0.099126       0.040000 
      3.373539       -0.081770       0.020000 
      3.388955       -0.122897       0.080000 
      3.403627       -0.204067       0.020000 
      3.419528       -0.191471       0.020000 
      3.435458       -0.124779       0.090000 
      3.451166       -0.096956       0.070000 
      3.466973       -0.115390       0.030000 
      3.482542       -0.161087       0.020000 
      3.497676       -0.219769       0.000000 
      3.514139       -0.306298       0.090000 
      3.529687       -0.365363       0.050000 
      3.545780       -0.287443       0.000000 
      3.561559       -0.133708       0.070000 
      3.576727       -0.048105       0.020000 
      3.592137       -0.009992       0.040000 
      3.608163       0.014675       0.000000 
      3.624118       0.028114       0.030000 
      3.640189       0.000804       0.020000 
      3.656046       -0.075844       0.040000 
      3.671712       -0.126492       0.080000 
      3.686058       -0.148435       0.010000 
      3.702973       -0.135036       0.020000 
      3.717647       -0.117094       0.020000 
      3.733221       -0.122051       0.010000 
      3.749495       -0.093341       0.000000 
      3.764002       -0.095183       0.050000 
      3.780180       -0.125152       0.050000 
      3.795824       -0.132818       0.070000 
      3.810955       -0.135950       0.010000 
      3.826095       -0.144463       0.050000 
      3.842161       -0.183914       0.010000 
      3.858388       -0.218396       0.010000 
      3.874436       -0.202309       0.050000 
      3.890001       -0.161060       0.010000 
      3.905496       -0.131937       0.000000 
      3.920512       -0.173186       0.000000 
      3.936564       -0.247505       0.050000 
      3.951857       -0.212581       0.050000 
      3.967548       -0.109551       0.000000 
      3.982977       -0.079017       0.010000 
      3.998130       -0.119836       0.020000 
      4.013743       -0.190585       0.050000 
      4.029836       -0.198212       0.010000 
      4.044940       -0.093381       0.020000 
      4.060298       -0.020378       0.020000 
      4.076802       -0.068772       0.030000 
      4.092573       -0.232348       0.030000 
      4.106725       -0.385976       0.040000 
      4.122017       -0.382445       0.060000 
      4.138738       -0.272162       0.000000 
      4.154826       -0.118078       0.020000 
      4.169574       0.003406       0.000000 
      4.185774       -0.005593       0.090000 
      4.200861       -0.087929       0.040000 
      4.216337       -0.186611       0.070000 
      4.232666       -0.202172       0.050000 
      4.248067       -0.124765       0.030000 
      4.263599       -0.085771       0.060000 
      4.279538       -0.126065       0.030000 
      4.293817       -0.153915       0.040000 
      4.309840       -0.162818       0.030000 
      4.325085       -0.181243       0.020000 
      4.340695       -0.187458       0.010000 
      4.356420       -0.204581       0.080000 
      4.371191       -0.198240       0.030000 
      4.400676       -0.166486       0.090000 
      4.416409       -0.161547       0.010000 
      4.432569       -0.238164       0.030000 
      4.447139       -0.322422       0.010000 
      4.463655       -0.291457       0.040000 
      4.478272       -0.205967       0.010000 
      4.495191       -0.175805       0.010000 
      4.510521       -0.204647       0.080000 
      4.525839       -0.212042       0.100000 
      4.541955       -0.166541       0.060000 
      4.556372       -0.126898       0.030000 
      4.571963       -0.148156       0.060000 
      4.588131       -0.132252       0.110000 
      4.603250       -0.126150       0.000000 
      4.618627       -0.151080       0.090000 
      4.634367       -0.147115       0.030000 
      4.648329       -0.031008       0.030000 
      4.664895       0.088579       0.000000 
      4.680751       0.050995       0.000000 
      4.696480       -0.043560       0.070000 
      4.711083       -0.096024       0.090000 
      4.727227       -0.100471       0.010000 
      4.743174       -0.079901       0.070000 
      4.759254       -0.119366       0.040000 
      4.774499       -0.183427       0.120000 
      4.790755       -0.173116       0.050000 
      4.805943       -0.130164       0.010000 
      4.821880       -0.139494       0.060000 
      4.837131       -0.170055       0.020000 
      4.852338       -0.157875       0.030000 
      4.866784       -0.146305       0.070000 
      4.883148       -0.163274       0.050000 
      4.898872       -0.194655       0.090000 
      4.914887       -0.183485       0.010000 
      4.929701       -0.163288       0.120000 
      4.945696       -0.157960       0.080000 
      4.961540       -0.153460       0.140000 
      4.977505       -0.211349       0.040000 
      4.994453       -0.274392       0.060000 
      5.009536       -0.316706       0.040000 
      5.025385       -0.356381       0.090000 
      5.042341       -0.314408       0.030000 
      5.057336       -0.201384       0.100000 
      5.073091       -0.139162       0.100000 
      5.089042       -0.094738       0.050000 
      5.105981       -0.096566       0.010000 
      5.120671       -0.141779       0.140000 
      5.135982       -0.210339       0.100000 
      5.151428       -0.273544       0.090000 
      5.166426       -0.221940       0.130000 
      5.181183       -0.135590       0.150000 
      5.197139       -0.116183       0.000000 
      5.213676       -0.130188       0.010000 
      5.228076       -0.133692       0.090000 
      5.243634       -0.141336       0.060000 
      5.260592       -0.167773       0.030000 
      5.276482       -0.212997       0.020000 
      5.291468       -0.193782       0.060000 
      5.307414       -0.123380       0.060000 
      5.324399       -0.098797       0.020000 
      5.339167       -0.117981       0.080000 
      5.355479       -0.169169       0.050000 
      5.370452       -0.168604       0.020000 
      5.387407       -0.130674       0.100000 
      5.403268       -0.151595       0.010000 
      5.418229       -0.234203       0.020000 
      5.434221       -0.304857       0.010000 
      5.449195       -0.290252       0.000000 
      5.464790       -0.208985       0.090000 
      5.480906       -0.214537       0.010000 
      5.495189       -0.300387       0.020000 
      5.512288       -0.361000       0.050000 
      5.527232       -0.261835       0.010000 
      5.542445       -0.096622       0.020000 
      5.557492       -0.040049       0.020000 
      5.572953       -0.096552       0.010000 
      5.589725       -0.196025       0.060000 
      5.604592       -0.247533       0.000000 
      5.635302       -0.190656       0.050000 
      5.653562       -0.156661       0.090000 
      5.667527       -0.260603       0.030000 
      5.681702       -0.371702       0.080000 
      5.698671       -0.370443       0.040000 
      5.712841       -0.308944       0.040000 
      5.727733       -0.246774       0.000000 
      5.744148       -0.218451       0.010000 
      5.759366       -0.227464       0.090000 
      5.773366       -0.217122       0.000000 
      5.789539       -0.230564       0.110000 
      5.804804       -0.235963       0.050000 
      5.820912       -0.247147       0.090000 
      5.835130       -0.296887       0.010000 
      5.851329       -0.304496       0.010000 
      5.867295       -0.288343       0.010000 
      5.882245       -0.205897       0.030000 
      5.899199       -0.113095       0.010000 
      5.914271       -0.108679       0.030000 
      5.929768       -0.102281       0.020000 
      5.944890       -0.092565       0.030000 
      5.961896       -0.105415       0.040000 
      5.977656       -0.188426       0.000000 
      5.992980       -0.271246       0.010000 
      6.007176       -0.236777       0.100000 
      6.022471       -0.131051       0.070000 
      6.038739       -0.086684       0.120000 
      6.055176       -0.131504       0.090000 
      6.069882       -0.179012       0.060000 
      6.084512       -0.213981       0.000000 
      6.101305       -0.260134       0.010000 
      6.116859       -0.308151       0.020000 
      6.132045       -0.349308       0.020000 
      6.147344       -0.363719       0.060000 
      6.162995       -0.374430       0.050000 
      6.178459       -0.345291       0.040000 
      6.194035       -0.204609       0.020000 
      6.209096       -0.127549       0.060000 
      6.225273       -0.183513       0.040000 
      6.239660       -0.251630       0.060000 
      6.255040       -0.298685       0.000000 
      6.271647       -0.302242       0.070000 
      6.286605       -0.278541       0.040000 
      6.300624       -0.236836       0.080000 
      6.317297       -0.209565       0.070000 
      6.332981       -0.255204       0.080000 
      6.347583       -0.294212       0.050000 
      6.364415       -0.286155       0.080000 
      6.379437       -0.276260       0.060000 
      6.394446       -0.244020       0.000000 
      6.410434       -0.238204       0.030000 
      6.425173       -0.241252       0.020000 
      6.440471       -0.196994       0.040000 
      6.456684       -0.179872       0.010000 
      6.471107       -0.158403       0.050000 
      6.486497       -0.142302       0.020000 
      6.502684       -0.222467       0.090000 
      6.518166       -0.272673       0.050000 
      6.532506       -0.285712       0.020000 
      6.548640       -0.292374       0.030000 
      6.563697       -0.252143       0.070000 
      6.579354       -0.261073       0.020000 
      6.594758       -0.282546       0.130000 
      6.611234       -0.304580       0.000000 
      6.626151       -0.369005       0.010000 
      6.641609       -0.313010       0.070000 
      6.657209       -0.192982       0.050000 
      6.673693       -0.165145       0.040000 
      6.688770       -0.170500       0.030000 
      6.703458       -0.223893       0.070000 
      6.719444       -0.307115       0.000000 
      6.734382       -0.306295       0.020000 
      6.749795       -0.214437       0.030000 
      6.764582       -0.138653       0.160000 
      6.780768       -0.160285       1.080000 
      6.795515       -0.252016       4.000000 
      6.810445       -0.261919       7.150000 
      6.826562       -0.205954       13.390000 
      6.841870       -0.270888       18.670000 
      6.858505       -0.300467       26.240000 
      6.873784       -0.241335       50.700000 
      6.889645       -0.266905       66.490000 
      6.904320       -0.300382       97.810000 
      6.919759       -0.244918       110.420000 
      6.934987       -0.139067       122.220000 
      6.951057       -0.113953       145.890000 
      6.967563       -0.099098       159.350000 
      6.982544       0.019244       185.920000 
      6.998537       0.153238       198.610000 
      7.013580       0.253724       210.320000 
      7.030011       0.303865       234.140000 
      7.046448       0.314837       245.740000 
      7.061408       0.319726       267.530000 
      7.075581       0.368788       276.520000 
      7.092503       0.591962       289.270000 
      7.107467       0.975248       293.200000 
      7.121490       1.234339       296.680000 
      7.137469       1.326427       304.650000 
      7.153006       1.446200       308.700000 
      7.168626       1.735826       319.460000 
      7.185511       2.087706       324.820000 
      7.200530       2.273807       326.530000 
      7.215520       2.321015       325.580000 
      7.231298       2.381649       325.050000 
      7.246334       2.578062       332.160000 
      7.262754       2.895499       338.520000 
      7.278538       3.152766       341.500000 
      7.293799       3.307630       339.090000 
      7.308590       3.507120       335.390000 
      7.323733       3.830842       335.510000 
      7.339332       4.120375       340.110000 
      7.355002       4.265269       352.430000 
      7.371928       4.308322       357.360000 
      7.386889       4.315131       358.600000 
      7.403843       4.315615       357.400000 
      7.420015       4.315629       357.180000 
      7.435511       4.315629       359.770000 
      7.449789       4.315629       360.470000 
      7.465759       4.315629       360.300000 
      7.481046       4.315629       361.240000 
      7.496570       4.315629       364.940000 
      7.512669       4.315629       369.840000 
      7.528316       4.315629       374.900000 
      7.542484       4.315629       268.800000 
      7.558775       4.315629       172.390000 
      7.575865       4.315629       6.620000 
      7.591757       4.315629       17.040000 
      7.606160       4.315629       7.350000 
      7.622168       4.315629       0.390000 
      7.638625       4.315629       5.720000 
      7.653769       4.315644       12.320000 
      7.669864       4.316154       4.340000 
      7.684577       4.323822       0.830000 
      7.701664       4.376696       8.340000 
      7.717547       4.555525       12.670000 
      7.732040       4.811062       3.180000 
      7.748756       4.561425       0.660000 
      7.762613       2.772040       9.510000 
      7.777574       0.282885       12.100000 
      7.794183       -0.305417       8.050000 
      7.810491       0.439957       2.200000 
      7.825633       0.891353       5.840000 
      7.839804       1.061012       11.750000 
      7.855095       1.141213       7.730000 
      7.870917       1.140183       4.340000 
      7.886083       1.031132       8.300000 
      7.901977       0.803808       12.280000 
      7.916857       0.535358       7.360000 
      7.932079       0.301190       4.520000 
      7.947628       0.022823       5.310000 
      7.963392       -0.372644       11.130000 
      7.978305       -0.643833       9.850000 
      7.993654       -0.724738       3.350000 
      8.009235       -0.843195       4.390000 
      8.024431       -1.128264       7.560000 
      8.040480       -1.402653       8.190000 
      8.057517       -1.503543       4.920000 
      8.072814       -1.569534       4.670000 
      8.087037       -1.649280       7.950000 
      8.102234       -1.701355       9.560000 
      8.117589       -1.717053       4.810000 
      8.134035       -1.668133       4.130000 
      8.149873       -1.576384       8.810000 
      8.164563       -1.529692       9.690000 
      8.179575       -1.552560       7.330000 
      8.195064       -1.562415       5.050000 
      8.210804       -1.578528       7.260000 
      8.224983       -1.576274       9.940000 
      8.241808       -1.552117       7.560000 
      8.258659       -1.576315       6.000000 
      8.273615       -1.579898       8.150000 
      8.289993       -1.579928       10.090000 
      8.305839       -1.640839       6.950000 
      8.321435       -1.714324       5.280000 
      8.336779       -1.716579       7.800000 
      8.352890       -1.585230       9.240000 
      8.368222       -1.462087       5.890000 
      8.383606       -1.491596       4.790000 
      8.399794       -1.554731       7.540000 
      8.415405       -1.542261       8.530000 
      8.431370       -1.538567       7.390000 
      8.445608       -1.545817       4.830000 
      8.461670       -1.512098       6.020000 
      8.478084       -1.490739       8.310000 
      8.493380       -1.472188       7.080000 
      8.507760       -1.433359       5.570000 
      8.524114       -1.395131       6.730000 
      8.539347       -1.469656       8.290000 
      8.555372       -1.561804       7.290000 
      8.571048       -1.523419       6.100000 
      8.586631       -1.445837       6.160000 
      8.601925       -1.477713       8.780000 
      8.617142       -1.568173       8.690000 
      8.632397       -1.617107       6.320000 
      8.647967       -1.603128       6.610000 
      8.663876       -1.570931       7.730000 
      8.678628       -1.568217       8.230000 
      8.694011       -1.588840       6.870000 
      8.709439       -1.549389       5.970000 
      8.725384       -1.485784       7.310000 
      8.740370       -1.501924       8.070000 
      8.757440       -1.574016       6.230000 
      8.771858       -1.622949       5.590000 
      8.787023       -1.627353       7.210000 
      8.802294       -1.611309       7.860000 
      8.819362       -1.599183       7.220000 
      8.834187       -1.635976       5.770000 
      8.849327       -1.678958       6.470000 
      8.865027       -1.707668       7.970000 
      8.880047       -1.723795       7.290000 
      8.895647       -1.703155       6.250000 
      8.911142       -1.665130       7.030000 
      8.926679       -1.639520       8.020000 
      8.940888       -1.635977       7.470000 
      8.956257       -1.638635       6.600000 
      8.971639       -1.654345       7.280000 
      8.987072       -1.655204       8.100000 
      9.002278       -1.649419       7.950000 
      9.018865       -1.683914       6.460000 
      9.033591       -1.713467       6.500000 
      9.049734       -1.683928       7.930000 
      9.065793       -1.649875       7.680000 
      9.082342       -1.661047       6.820000 
      9.097279       -1.683954       6.530000 
      9.113375       -1.703169       7.270000 
      9.129921       -1.705440       7.350000 
      9.146135       -1.692428       6.580000 
      9.160922       -1.700095       6.640000 
      9.176894       -1.680288       7.350000 
      9.192042       -1.659814       7.740000 
      9.207591       -1.704028       6.540000 
      9.222373       -1.739519       6.420000 
      9.237266       -1.710782       7.590000 
      9.252205       -1.681243       7.840000 
      9.268858       -1.639494       7.310000 
      9.283852       -1.618977       6.700000 
      9.299753       -1.620209       7.190000 
      9.316001       -1.590240       7.800000 
      9.331233       -1.579486       7.180000 
      9.348219       -1.625165       6.630000 
      9.362015       -1.648932       7.130000 
      9.378083       -1.643523       7.610000 
      9.393667       -1.658347       7.040000 
      9.410351       -1.656488       6.510000 
      9.426380       -1.576300       7.080000 
      9.442334       -1.475017       7.520000 
      9.457994       -1.490267       6.800000 
      9.472708       -1.525592       6.540000 
      9.489629       -1.479539       6.670000 
      9.504599       -1.491614       7.500000 
      9.521275       -1.601411       7.330000 
      9.535772       -1.696882       6.650000 
      9.550956       -1.752451       6.830000 
      9.565522       -1.771289       7.580000 
      9.581566       -1.737663       7.330000 
      9.597864       -1.641819       6.860000 
      9.612275       -1.570544       7.000000 
      9.627771       -1.612236       7.500000 
      9.642453       -1.668160       7.590000 
      9.657753       -1.682142       6.860000 
      9.674145       -1.673089       6.820000 
      9.689287       -1.630564       7.480000 
      9.703789       -1.579928       7.590000 
      9.720177       -1.590213       7.120000 
      9.736071       -1.618879       6.670000 
      9.751556       -1.602740       7.050000 
      9.767525       -1.565600       7.270000 
      9.783353       -1.546276       6.920000 
      9.798716       -1.577284       6.750000 
      9.813114       -1.662818       6.860000 
      9.829669       -1.757873       7.490000 
      9.845575       -1.767220       6.980000 
      9.861586       -1.723852       6.810000 
      9.877665       -1.708997       6.970000 
      9.892449       -1.695139       7.500000 
      9.908395       -1.644490       7.400000 
      9.924553       -1.625679       6.930000 
      9.939784       -1.655205       6.900000 
      9.955132       -1.678112       7.310000 
      9.969796       -1.678932       7.500000 
      9.986639       -1.664673       7.190000 
      10.001815       -1.657862       6.940000 
      10.017095       -1.651230       7.200000 
      10.031674       -1.617968       7.310000 
      10.048098       -1.616279       7.160000 
      10.062742       -1.628266       6.830000 
      10.078735       -1.629691       7.140000 
      10.094811       -1.614411       7.300000 
      10.109583       -1.614437       7.130000 
      10.126481       -1.630564       6.840000 
      10.141319       -1.638634       7.080000 
      10.157030       -1.659690       7.430000 
      10.173626       -1.678046       7.010000 
      10.189885       -1.672297       6.780000 
      10.205044       -1.626951       6.850000 
      10.220348       -1.578214       7.420000 
      10.235327       -1.657932       7.300000 
      10.251284       -1.803540       6.940000 
      10.266344       -1.784715       7.040000 
      10.282817       -1.683514       7.430000 
      10.298033       -1.637709       7.280000 
      10.312071       -1.614920       7.000000 
      10.327098       -1.614008       6.900000 
      10.343513       -1.625152       7.240000 
      10.359352       -1.613994       7.320000 
      10.375262       -1.614424       6.890000 
      10.390701       -1.630564       6.880000 
      10.405915       -1.638607       7.130000 
      10.421248       -1.658831       7.180000 
      10.437161       -1.668173       7.100000 
      10.452390       -1.635976       6.910000 
      10.468344       -1.609968       7.100000 
      10.482923       -1.660147       7.190000 
      10.499465       -1.712580       7.040000 
      10.513677       -1.696856       6.920000 
      10.528967       -1.640449       7.110000 
      10.544872       -1.593784       7.290000 
      10.560575       -1.582183       7.020000 
      10.576848       -1.569130       6.870000 
      10.591810       -1.589340       7.210000 
      10.606612       -1.619256       7.280000 
      10.622777       -1.606808       7.190000 
      10.638412       -1.573533       6.980000 
      10.654429       -1.511336       7.110000 
      10.670247       -1.453917       7.270000 
      10.685844       -1.463829       7.190000 
      10.701403       -1.493797       6.890000 
      10.716893       -1.559287       7.000000 
      10.732231       -1.618839       7.130000 
      10.747085       -1.632322       7.060000 
      10.762511       -1.635063       6.930000 
      10.778301       -1.634107       7.020000 
      10.793724       -1.640906       7.170000 
      10.810267       -1.662374       7.280000 
      10.827211       -1.688786       6.890000 
      10.841647       -1.653432       6.820000 
      10.856131       -1.593341       7.220000 
      10.871460       -1.563829       7.230000 
      10.887598       -1.554346       7.110000 
      10.902917       -1.616292       7.000000 
      10.918648       -1.692331       7.100000 
      10.934195       -1.722505       7.250000 
      10.950993       -1.703558       7.130000 
      10.965118       -1.670515       7.020000 
      10.980558       -1.663261       7.160000 
      10.995948       -1.670042       7.290000 
      11.012329       -1.633678       6.920000 
      11.027364       -1.601011       6.870000 
      11.043127       -1.614410       6.980000 
      11.058535       -1.643103       7.160000 
      11.074491       -1.624709       7.070000 
      11.088449       -1.579485       6.920000 
      11.105404       -1.590656       7.030000 
      11.120349       -1.624735       7.140000 
      11.137306       -1.632778       7.090000 
      11.151467       -1.635050       6.970000 
      11.167310       -1.633221       7.090000 
      11.182243       -1.630121       7.140000 
      11.198451       -1.614424       7.070000 
      11.213634       -1.614423       6.970000 
      11.228500       -1.630107       7.060000 
      11.243987       -1.632778       7.180000 
      11.260412       -1.629651       7.230000 
      11.276215       -1.608568       7.050000 
      11.291912       -1.584371       6.990000 
      11.306916       -1.560174       7.210000 
      11.323354       -1.539078       7.210000 
      11.338643       -1.535547       7.050000 
      11.353722       -1.534121       7.040000 
      11.369226       -1.540919       7.110000 
      11.385239       -1.562805       7.170000 
      11.400538       -1.593823       7.040000 
      11.415676       -1.574902       6.900000 
      11.431927       -1.541889       7.100000 
      11.447367       -1.599143       7.210000 
      11.463324       -1.704053       7.040000 
      11.493272       -1.714781       7.000000 
      11.509850       -1.659247       7.110000 
      11.524251       -1.596485       7.070000 
      11.539811       -1.574556       6.950000 
      11.556260       -1.600538       6.990000 
      11.571833       -1.603639       7.180000 
      11.586267       -1.595182       7.090000 
      11.602679       -1.614840       7.040000 
      11.618371       -1.653901       7.000000 
      11.634386       -1.673573       7.100000 
      11.649563       -1.665559       7.130000 
      11.665598       -1.674073       6.990000 
      11.680770       -1.724708       7.050000 
      11.697414       -1.748449       7.210000 
      11.713367       -1.737264       7.200000 
      11.727653       -1.724238       7.010000 
      11.742538       -1.678971       7.030000 
      11.759030       -1.619850       7.250000 
      11.774205       -1.591113       7.330000 
      11.789438       -1.590253       6.780000 
      11.804954       -1.609011       6.980000 
      11.819684       -1.629235       7.060000 
      11.834983       -1.627822       7.400000 
      11.850695       -1.611309       6.730000 
      11.865967       -1.598726       6.630000 
      11.882816       -1.630120       7.270000 
      11.898366       -1.648892       7.360000 
      11.912441       -1.637278       6.860000 
      11.928261       -1.624265       6.680000 
      11.942828       -1.579871       6.960000 
      11.959488       -1.531105       7.340000 
      11.974133       -1.545376       7.080000 
      11.990082       -1.600524       6.770000 
      12.005649       -1.632321       7.000000 
      12.022209       -1.653351       7.310000 
      12.038167       -1.647146       7.070000 
      12.053468       -1.593270       6.750000 
      12.069155       -1.504223       7.230000 
      12.084614       -1.473645       7.490000 
      12.098860       -1.567398       7.380000 
      12.115391       -1.611625       6.820000 
      12.130554       -1.599252       6.890000 
      12.146115       -1.615256       7.250000 
      12.161507       -1.654344       7.160000 
      12.177424       -1.678502       6.860000 
      12.192795       -1.683484       7.000000 
      12.208611       -1.679388       7.270000 
      12.224168       -1.665129       7.170000 
      12.239482       -1.663274       6.880000 
      12.255261       -1.675871       6.960000 
      12.270684       -1.663248       7.220000 
      12.286490       -1.664230       7.040000 
      12.302237       -1.668187       6.890000 
      12.317881       -1.631021       6.950000 
      12.333298       -1.590727       7.170000 
      12.348563       -1.639077       7.220000 
      12.362809       -1.704953       6.940000 
      12.378715       -1.686142       6.910000 
      12.393014       -1.665089       7.080000 
      12.409405       -1.655204       7.300000 
      12.424364       -1.638647       7.060000 
      12.439741       -1.635520       6.890000 
      12.454912       -1.633678       7.040000 
      12.469666       -1.635520       7.200000 
      12.484781       -1.638607       7.040000 
      12.501700       -1.653848       6.930000 
      12.516169       -1.648033       6.950000 
      12.532844       -1.603639       7.270000 
      12.547178       -1.547675       7.230000 
      12.562136       -1.535065       6.990000 
      12.578748       -1.605024       6.970000 
      12.593699       -1.656019       7.040000 
      12.609234       -1.623365       7.190000 
      12.625741       -1.549862       6.910000 
      12.640225       -1.521193       7.020000 
      12.655732       -1.536903       7.120000 
      12.672282       -1.569117       7.090000 
      12.687846       -1.634150       7.020000 
      12.703397       -1.685615       7.010000 
      12.719384       -1.664146       7.170000 
      12.734452       -1.579458       7.210000 
      12.750532       -1.550332       6.860000 
      12.766970       -1.571371       6.870000 
      12.781634       -1.562845       7.090000 
      12.796956       -1.564700       7.150000 
      12.813417       -1.574916       7.070000 
      12.829468       -1.571455       6.910000 
      12.843904       -1.604555       7.060000 
      12.859440       -1.699598       7.210000 
      12.875628       -1.760961       7.120000 
      12.890368       -1.747576       6.970000 
      12.905679       -1.690629       7.150000 
      12.921553       -1.655691       7.310000 
      12.938222       -1.683498       7.070000 
      12.954036       -1.702669       6.920000 
      12.969694       -1.635077       7.050000 
      12.984981       -1.564205       7.220000 
      13.000507       -1.581726       7.090000 
      13.015791       -1.592840       6.890000 
      13.031897       -1.564687       7.020000 
      13.047067       -1.544450       7.140000 
      13.062117       -1.554788       7.170000 
      13.077476       -1.554801       7.060000 
      13.092906       -1.544920       7.090000 
      13.108092       -1.570958       7.120000 
      13.138562       -1.627352       6.990000 
      13.155168       -1.663246       6.970000 
      13.170677       -1.626439       7.090000 
      13.186918       -1.559274       7.250000 
      13.201821       -1.485714       7.010000 
      13.216877       -1.426176       6.970000 
      13.232100       -1.421193       7.030000 
      13.247478       -1.460657       7.180000 
      13.263437       -1.508998       7.070000 
      13.278732       -1.558347       6.940000 
      13.294109       -1.591027       7.000000 
      13.308338       -1.565046       7.080000 
      13.324792       -1.485328       7.110000 
      13.340304       -1.480385       7.090000 
      13.355267       -1.541305       7.110000 
      13.370221       -1.556559       7.200000 
      13.386499       -1.559274       7.170000 
      13.400514       -1.555634       6.950000 
      13.417348       -1.549446       6.960000 
      13.432860       -1.584357       7.130000 
      13.448817       -1.618866       7.150000 
      13.464097       -1.608125       7.020000 
      13.478171       -1.589757       6.960000 
      13.494163       -1.584827       7.060000 
      13.509925       -1.584801       7.130000 
      13.526586       -1.588883       7.120000 
      13.542236       -1.597743       7.040000 
      13.556588       -1.574998       7.160000 
      13.573198       -1.518438       7.220000 
      13.588383       -1.498823       7.070000 
      13.603575       -1.523783       7.050000 
      13.617687       -1.597879       7.130000 
      13.634773       -1.621896       7.130000 
      13.649320       -1.546318       7.010000 
      13.665915       -1.499643       6.980000 
      13.680796       -1.570485       7.150000 
      13.695281       -1.602682       7.090000 
      13.711385       -1.548560       6.990000 
      13.726571       -1.526538       7.010000 
      13.742361       -1.561073       7.080000 
      13.757529       -1.608165       7.110000 
      13.773674       -1.648906       7.160000 
      13.789486       -1.659703       7.040000 
      13.803713       -1.668190       6.940000 
      13.820425       -1.699168       7.120000 
      13.835579       -1.692344       7.060000 
      13.851256       -1.640046       7.000000 
      13.866804       -1.594200       7.000000 
      13.881863       -1.587126       7.120000 
      13.898066       -1.587512       7.140000 
      13.913834       -1.600551       7.050000 
      13.929887       -1.591073       7.090000 
      13.945239       -1.608208       7.200000 
      13.960929       -1.683817       7.020000 
      13.977028       -1.687940       6.960000 
      13.992856       -1.622466       6.940000 
      14.008042       -1.592888       7.180000 
      14.023659       -1.586612       7.160000 
      14.039086       -1.583441       7.070000 
      14.054316       -1.506367       7.070000 
      14.069795       -1.424350       7.030000 
      14.086789       -1.463345       7.210000 
      14.102856       -1.516581       7.230000 
      14.117932       -1.522533       7.040000 
      14.133460       -1.480288       7.080000 
      14.148421       -1.437403       7.040000 
      14.164376       -1.480828       7.020000 
      14.181442       -1.594655       7.030000 
      14.197294       -1.665917       7.090000 
      14.213247       -1.671759       7.090000 
      14.227827       -1.630497       7.020000 
      14.243187       -1.579042       7.030000 
      14.259160       -1.579442       6.970000 
      14.274120       -1.571385       7.030000 
      14.290779       -1.534192       7.030000 
      14.306489       -1.570945       7.070000 
      14.321440       -1.637664       7.070000 
      14.337642       -1.642203       7.140000 
      14.353490       -1.590186       7.120000 
      14.367682       -1.555718       6.960000 
      14.384046       -1.584841       7.000000 
      14.399170       -1.619323       7.130000 
      14.415604       -1.613537       7.040000 
      14.430593       -1.614370       7.050000 
      14.447092       -1.629248       7.070000 
      14.461274       -1.622880       7.070000 
      14.477233       -1.592512       7.100000 
      14.491389       -1.583029       7.080000 
      14.508343       -1.645817       6.990000 
      14.523306       -1.667676       7.060000 
      14.538964       -1.641777       7.150000 
      14.554929       -1.618839       7.100000 
      14.570343       -1.549859       7.120000 
      14.586202       -1.462044       7.150000 
      14.600740       -1.462017       7.160000 
      14.617125       -1.548932       7.020000 
      14.632123       -1.606752       7.010000 
      14.647723       -1.578488       7.040000 
      14.663286       -1.530594       7.070000 
      14.678698       -1.539077       7.130000 
      14.694988       -1.565099       7.110000 
      14.712516       -1.539077       7.030000 
      14.725860       -1.530581       7.090000 
      14.742051       -1.578072       7.060000 
      14.757624       -1.602239       7.050000 
      14.773167       -1.535520       7.080000 
      14.788253       -1.470047       7.090000 
      14.803293       -1.511350       7.060000 
      14.819252       -1.557845       7.150000 
      14.833899       -1.540489       7.160000 
      14.849304       -1.534111       7.110000 
      14.865241       -1.599154       7.080000 
      14.880199       -1.625953       7.050000 
      14.893838       -1.553002       7.120000 
      14.909795       -1.451219       7.120000 
      14.924926       -1.408707       7.170000 
      14.940441       -1.451245       7.030000 
      14.956252       -1.553862       7.100000 
      14.972211       -1.635891       7.000000 
      14.988459       -1.637624       7.070000 
      15.003234       -1.575914       7.020000 
      15.019688       -1.553876       6.950000 
      15.034692       -1.597867       7.040000 
      15.051459       -1.611669       7.160000 
      15.066005       -1.633733       7.070000 
      15.082600       -1.638470       7.000000 
      15.096563       -1.587594       7.030000 
      15.113583       -1.529139       7.120000 
      15.129461       -1.468811       7.060000 
      15.144816       -1.438663       7.050000 
      15.158466       -1.508666       7.070000 
      15.173906       -1.576230       7.140000 
      15.190260       -1.622949       7.110000 
      15.204682       -1.625111       7.160000 
      15.221436       -1.603708       7.160000 
      15.236863       -1.636353       7.160000 
      15.251630       -1.677641       7.040000 
      15.267070       -1.691457       7.040000 
      15.282568       -1.650720       7.150000 
      15.297781       -1.576730       7.150000 
      15.311893       -1.551674       7.100000 
      15.328017       -1.504552       7.180000 
      15.342844       -1.455785       7.070000 
      15.358600       -1.472745       7.090000 
      15.374528       -1.538620       7.060000 
      15.390307       -1.617067       7.030000 
      15.404266       -1.631378       7.030000 
      15.421176       -1.560563       7.030000 
      15.437133       -1.495669       7.090000 
      15.467667       -1.528279       7.170000 
      15.483624       -1.550758       7.140000 
      15.499582       -1.477671       7.090000 
      15.515171       -1.464302       7.010000 
      15.530622       -1.539937       7.020000 
      15.546283       -1.641303       7.050000 
      15.562518       -1.676618       7.020000 
      15.577114       -1.607668       7.100000 
      15.593495       -1.526121       7.150000 
      15.607620       -1.497412       7.130000 
      15.624021       -1.519850       7.050000 
      15.638759       -1.572673       7.050000 
      15.655057       -1.588330       7.050000 
      15.670655       -1.537304       7.180000 
      15.686499       -1.485701       7.050000 
      15.702015       -1.447715       7.040000 
      15.716731       -1.454333       7.030000 
      15.732058       -1.531950       7.080000 
      15.746958       -1.594142       6.920000 
      15.762407       -1.609466       6.960000 
      15.778439       -1.544906       7.030000 
      15.793275       -1.515863       7.040000 
      15.810036       -1.583029       7.180000 
      15.827051       -1.656532       7.070000 
      15.840832       -1.716623       7.020000 
      15.856957       -1.708027       7.030000 
      15.872940       -1.625208       6.990000 
      15.888602       -1.585301       7.120000 
      15.906329       -1.619362       7.050000 
      15.920812       -1.614340       7.070000 
      15.935063       -1.558888       7.050000 
      15.950561       -1.557862       7.060000 
      15.966446       -1.557042       7.050000 
      15.981417       -1.483473       7.120000 
      15.997805       -1.486753       6.980000 
      16.012080       -1.558691       6.940000 
      16.027562       -1.574568       6.970000 
      16.042992       -1.552493       7.100000 
      16.059568       -1.581229       7.080000 
      16.074448       -1.597313       7.030000 
      16.090449       -1.577656       7.070000 
      16.105183       -1.531008       7.100000 
      16.121557       -1.480855       7.020000 
      16.136521       -1.501925       7.050000 
      16.151854       -1.578985       7.140000 
      16.167615       -1.642633       7.090000 
      16.182688       -1.653848       6.960000 
      16.197674       -1.644006       7.050000 
      16.212781       -1.660160       7.040000 
      16.228786       -1.678958       7.020000 
      16.242575       -1.683471       6.990000 
      16.258613       -1.678515       7.040000 
      16.275411       -1.654761       7.090000 
      16.289792       -1.619823       7.000000 
      16.306072       -1.614410       7.100000 
      16.320519       -1.624292       7.090000 
      16.337608       -1.603639       7.070000 
      16.353783       -1.571428       7.070000 
      16.369926       -1.574946       7.120000 
      16.400013       -1.629221       7.070000 
      16.415998       -1.661404       7.150000 
      16.432214       -1.623379       7.120000 
      16.447643       -1.544933       7.070000 
      16.463261       -1.502811       7.080000 
      16.479208       -1.525692       7.090000 
      16.495962       -1.597326       7.080000 
      16.511936       -1.633650       7.150000 
      16.526259       -1.586572       7.000000 
      16.541548       -1.541349       6.970000 
      16.556784       -1.515337       6.940000 
      16.572287       -1.514920       6.960000 
      16.588132       -1.536393       6.980000 
      16.602856       -1.567773       7.070000 
      16.619545       -1.617939       7.030000 
      16.635723       -1.612527       7.110000 
      16.665006       -1.537318       7.080000 
      16.680991       -1.461947       7.070000 
      16.696525       -1.407820       7.170000 
      16.712483       -1.429693       7.070000 
      16.727684       -1.521178       7.090000 
      16.743281       -1.570388       7.070000 
      16.758444       -1.580343       7.180000 
      16.774583       -1.568647       7.140000 
      16.789058       -1.584397       7.060000 
      16.804272       -1.600954       7.120000 
      16.819657       -1.598269       7.190000 
      16.835586       -1.634593       7.100000 
      16.850619       -1.661821       7.040000 
      16.866214       -1.622519       7.050000 
      16.881682       -1.534578       7.140000 
      16.896920       -1.459816       7.100000 
      16.912491       -1.470141       7.010000 
      16.927942       -1.590182       7.040000 
      16.942858       -1.664093       7.160000 
      16.958060       -1.673158       7.170000 
      16.972421       -1.694101       7.130000 
      16.989271       -1.600981       7.160000 
      17.002964       -1.489426       7.150000 
      17.019585       -1.540048       7.000000 
      17.034893       -1.617507       7.100000 
      17.050800       -1.657958       7.120000 
      17.065822       -1.678878       7.080000 
      17.081897       -1.683000       7.070000 
      17.097885       -1.672216       7.120000 
      17.113720       -1.619309       7.080000 
      17.128216       -1.525692       7.060000 
      17.144202       -1.480828       7.070000 
      17.158736       -1.506354       7.110000 
      17.172926       -1.526520       7.120000 
      17.188859       -1.518866       7.120000 
      17.204816       -1.466003       7.040000 
      17.220084       -1.434218       7.010000 
      17.235733       -1.477174       7.020000 
      17.252494       -1.507708       7.080000 
      17.269364       -1.526936       7.090000 
      17.284492       -1.521997       7.030000 
      17.299261       -1.481699       7.150000 
      17.314377       -1.500082       7.090000 
      17.330390       -1.490626       7.040000 
      17.345544       -1.439618       7.020000 
      17.360721       -1.477271       7.120000 
      17.375994       -1.569073       7.160000 
      17.392152       -1.628778       7.080000 
      17.407187       -1.661878       7.030000 
      17.422343       -1.693755       7.070000 
      17.437479       -1.673559       7.060000 
      17.453535       -1.625208       7.120000 
      17.469500       -1.619809       7.090000 
      17.484540       -1.643520       7.060000 
      17.499832       -1.623836       7.070000 
      17.514805       -1.568687       7.120000 
      17.530923       -1.542275       7.160000 
      17.547656       -1.545376       7.130000 
      17.563316       -1.589340       7.090000 
      17.577820       -1.643036       7.080000 
      17.594017       -1.647589       7.050000 
      17.609883       -1.608998       7.010000 
      17.624274       -1.571415       7.010000 
      17.640571       -1.569130       7.070000 
      17.656492       -1.600041       7.020000 
      17.672920       -1.601839       7.050000 
      17.687634       -1.573142       6.980000 
      17.703568       -1.512626       7.020000 
      17.719792       -1.469201       7.120000 
      17.735480       -1.524735       7.100000 
      17.750666       -1.554275       6.980000 
      17.764840       -1.503266       7.090000 
      17.781096       -1.501884       7.100000 
      17.795438       -1.555204       7.110000 
      17.812013       -1.601865       7.120000 
      17.826976       -1.618786       7.030000 
      17.842789       -1.587983       7.040000 
      17.857798       -1.552476       7.190000 
      17.872934       -1.503710       7.130000 
      17.888699       -1.443175       7.070000 
      17.904363       -1.487569       7.130000 
      17.919581       -1.543923       7.100000 
      17.935704       -1.560185       7.030000 
      17.951795       -1.559620       7.180000 
      17.967833       -1.490696       7.090000 
      17.982152       -1.445903       7.010000 
      17.998513       -1.512625       6.970000 
      18.013616       -1.596426       7.160000 
      18.029803       -1.635421       7.240000 
      18.045482       -1.588759       6.890000 
      18.060849       -1.479498       6.970000 
      18.075866       -1.427009       7.090000 
      18.090610       -1.436474       7.150000 
      18.105885       -1.458372       7.040000 
      18.121784       -1.487099       6.870000 
      18.136923       -1.522426       7.130000 
      18.151997       -1.592399       7.170000 
      18.168352       -1.595900       7.040000 
      18.182703       -1.483954       7.000000 
      18.198155       -1.368289       7.080000 
      18.213452       -1.362071       7.280000 
      18.228638       -1.444473       7.160000 
      18.244031       -1.494669       7.100000 
      18.260133       -1.502756       7.140000 
      18.276135       -1.553875       7.110000 
      18.290521       -1.584757       7.170000 
      18.306468       -1.554831       7.110000 
      18.321941       -1.579445       7.210000 
      18.338139       -1.659189       7.090000 
      18.352746       -1.666373       7.060000 
      18.368199       -1.613027       7.110000 
      18.383089       -1.559730       7.110000 
      18.398781       -1.505009       7.050000 
      18.414068       -1.453544       7.080000 
      18.430253       -1.464688       7.180000 
      18.444520       -1.570015       7.140000 
      18.461167       -1.631352       7.100000 
      18.475554       -1.606782       7.030000 
      18.491528       -1.560590       7.020000 
      18.507465       -1.521192       7.080000 
      18.523406       -1.526135       7.150000 
      18.539377       -1.584358       7.100000 
      18.555445       -1.642177       7.140000 
      18.586036       -1.642620       7.080000 
      18.601328       -1.590186       7.110000 
      18.616539       -1.555275       7.160000 
      18.632653       -1.579442       7.120000 
      18.646954       -1.595139       7.160000 
      18.662134       -1.574073       7.130000 
      18.678446       -1.595142       7.090000 
      18.694140       -1.643062       7.040000 
      18.709416       -1.642566       7.160000 
      18.724622       -1.587541       7.200000 
      18.740430       -1.523336       7.030000 
      18.755521       -1.440061       7.010000 
      18.771578       -1.384027       7.040000 
      18.786656       -1.476341       7.090000 
      18.803494       -1.548848       7.140000 
      18.817975       -1.526107       7.110000 
      18.834193       -1.535480       7.110000 
      18.849571       -1.544835       7.130000 
      18.863750       -1.523932       7.050000 
      18.879261       -1.534081       7.050000 
      18.895441       -1.551190       7.120000 
      18.911395       -1.540405       7.170000 
      18.925397       -1.540366       7.190000 
      18.940400       -1.483954       6.940000 
      18.956745       -1.423863       6.910000 
      18.971557       -1.415381       7.220000 
      18.986673       -1.431463       7.060000 
      19.001822       -1.514865       6.980000 
      19.017155       -1.532212       7.030000 
      19.032564       -1.471897       7.200000 
      19.047089       -1.432310       7.100000 
      19.062656       -1.401951       6.940000 
      19.077607       -1.428350       6.880000 
      19.094190       -1.510366       7.160000 
      19.109700       -1.521993       7.150000 
      19.124920       -1.500555       7.070000 
      19.140658       -1.520239       6.910000 
      19.156540       -1.573156       7.050000 
      19.172309       -1.594642       7.250000 
      19.188107       -1.573159       7.110000 
      19.203925       -1.583901       7.060000 
      19.219725       -1.589283       7.280000 
      19.235548       -1.539077       7.210000 
      19.250449       -1.506424       7.070000 
      19.266508       -1.534108       6.990000 
      19.281926       -1.569585       7.200000 
      19.297388       -1.556976       7.330000 
      19.313128       -1.535506       6.920000 
      19.327613       -1.514840       6.860000 
      19.343729       -1.513550       7.220000 
      19.358566       -1.519309       7.310000 
      19.374872       -1.484384       7.140000 
      19.390072       -1.449903       6.950000 
      19.405164       -1.461516       7.050000 
      19.420721       -1.490213       7.210000 
      19.436735       -1.537278       7.070000 
      19.453740       -1.582957       7.010000 
      19.469873       -1.548879       7.170000 
      19.484417       -1.484012       7.150000 
      19.501298       -1.480771       7.090000 
      19.516606       -1.482626       7.000000 
      19.532567       -1.487556       7.140000 
      19.546716       -1.570015       7.140000 
      19.563386       -1.608497       7.020000 
      19.577543       -1.578115       7.000000 
      19.593152       -1.589286       7.130000 
      19.609384       -1.608497       7.230000 
      19.625361       -1.558831       7.110000 
      19.639997       -1.498270       6.900000 
      19.656545       -1.476784       7.130000 
      19.670388       -1.440004       7.430000 
      19.685171       -1.431118       7.070000 
      19.701344       -1.485687       6.830000 
      19.717653       -1.553458       7.010000 
      19.732620       -1.597273       7.200000 
      19.747165       -1.604110       7.100000 
      19.763138       -1.582058       6.980000 
      19.778590       -1.557046       7.440000 
      19.794501       -1.522950       7.290000 
      19.810526       -1.530564       6.740000 
      19.826333       -1.530148       7.000000 
      19.842300       -1.517967       7.370000 
      19.857831       -1.537348       7.040000 
      19.873323       -1.555120       7.080000 
      19.888758       -1.566055       7.240000 
      19.903815       -1.513428       7.030000 
      19.920630       -1.486766       6.860000 
      19.935464       -1.529139       7.200000 
      19.950671       -1.569599       7.600000 
      19.967550       -1.562388       7.050000 
      19.981790       -1.560563       6.500000 
      19.996411       -1.564660       7.330000 
      20.012967       -1.575827       7.450000 
      20.028136       -1.562872       6.840000 
      20.043266       -1.495184       6.970000 
      20.057729       -1.541849       7.200000 
      20.074159       -1.677531       7.090000 
      20.089338       -1.718780       6.670000 
      20.105708       -1.628241       7.110000 
      20.121119       -1.503669       7.340000 
      20.136078       -1.431947       7.130000 
      20.151704       -1.367440       6.970000 
      20.167044       -1.340948       6.920000 
      20.182439       -1.416722       7.070000 
      20.198175       -1.510712       7.140000 
      20.212166       -1.538190       7.190000 
      20.228798       -1.487888       6.960000 
      20.243065       -1.452617       7.040000 
      20.258331       -1.469560       7.400000 
      20.274712       -1.523835       7.150000 
      20.290653       -1.542620       6.840000 
      20.306677       -1.508594       6.990000 
      20.322192       -1.472248       7.420000 
      20.337652       -1.478598       7.150000 
      20.353735       -1.532252       6.860000 
      20.368924       -1.509493       7.230000 
      20.383157       -1.407710       7.350000 
      20.400543       -1.380899       6.740000 
      20.414724       -1.424306       6.810000 
      20.430548       -1.523835       7.200000 
      20.446741       -1.587874       7.230000 
      20.462315       -1.580313       7.060000 
      20.478338       -1.552520       6.950000 
      20.493959       -1.510437       6.980000 
      20.510758       -1.549835       7.050000 
      20.524312       -1.633193       7.140000 
      20.538076       -1.628180       7.060000 
      20.554168       -1.526121       7.110000 
      20.569600       -1.390671       7.110000 
      20.585024       -1.364826       7.130000 
      20.601595       -1.435048       6.910000 
      20.617738       -1.523822       6.880000 
      20.633133       -1.576716       7.240000 
      20.647606       -1.591887       7.240000 
      20.663814       -1.556602       7.060000 
      20.680160       -1.507656       6.970000 
      20.695939       -1.531989       7.090000 
      20.712035       -1.542121       7.070000 
      20.727343       -1.515862       7.050000 
      20.741688       -1.499546       6.990000 
      20.757467       -1.534190       7.010000 
      20.773389       -1.556462       7.090000 
      20.788768       -1.499638       7.120000 
      20.804882       -1.410384       6.990000 
      20.819583       -1.401038       7.110000 
      20.835793       -1.438617       7.280000 
      20.850746       -1.425178       7.280000 
      20.866418       -1.390217       7.100000 
      20.883018       -1.437278       7.110000 
      20.898738       -1.482927       7.130000 
      20.914627       -1.384384       7.040000 
      20.929168       -1.286284       7.010000 
      20.945228       -1.337736       7.070000 
      20.961257       -1.413078       7.200000 
      20.975688       -1.426533       7.190000 
      20.992024       -1.412585       7.060000 
      21.006572       -1.414480       7.130000 
