Human trial picking the raspberry twin 

 time    ||     output     ||     loadcell

      0.000000       -796.969231       0.030000 
      0.030979       -796.969231       0.010000 
      0.062263       -796.969231       0.170000 
      0.093478       -796.969231       0.110000 
      0.123516       -796.969231       0.240000 
      0.155440       -796.969231       0.250000 
      0.186120       -796.969231       0.080000 
      0.217331       -796.969231       0.050000 
      0.248389       -796.969231       0.020000 
      0.279742       -796.969226       0.020000 
      0.309691       -796.968041       0.040000 
      0.340657       -796.861379       0.000000 
      0.372134       -793.329222       0.000000 
      0.403087       -750.299281       0.130000 
      0.433665       -557.458526       0.100000 
      0.465184       -239.539138       0.140000 
      0.496151       -46.720307       0.140000 
      0.528363       -3.663499       0.070000 
      0.559173       -0.117473       0.080000 
      0.589339       -0.035394       0.070000 
      0.619944       -0.033349       0.050000 
      0.650392       0.001177       0.030000 
      0.681702       0.024918       0.110000 
      0.713605       0.029874       0.110000 
      0.759053       0.025361       0.080000 
      0.789967       0.006576       0.170000 
      0.820885       -0.009134       0.030000 
      0.851808       0.006133       0.130000 
      0.883723       0.019975       0.040000 
      0.929633       0.006133       0.040000 
      0.961518       -0.009134       0.070000 
      0.993433       0.006576       0.050000 
      1.023355       0.025361       0.050000 
      1.054306       0.029887       0.010000 
      1.084192       0.025361       0.060000 
      1.115110       0.006576       0.020000 
      1.146087       -0.009121       0.140000 
      1.177051       0.006576       0.010000 
      1.208612       0.025374       0.110000 
      1.240309       0.030317       0.010000 
      1.272067       0.030317       0.050000 
      1.303226       0.025374       0.100000 
      1.334045       0.006576       0.120000 
      1.365027       -0.009121       0.090000 
      1.395933       0.006576       0.050000 
      1.426950       0.025374       0.090000 
      1.456712       0.030330       0.150000 
      1.487258       0.030760       0.220000 
      1.517916       0.030773       0.280000 
      1.548911       0.030773       0.240000 
      1.579646       0.030773       0.020000 
      1.610783       0.030773       0.070000 
      1.641893       0.030773       0.240000 
      1.672797       0.030773       0.120000 
      1.703397       0.030773       0.000000 
      1.734807       0.030773       0.360000 
      1.766933       0.030773       0.260000 
      1.798113       0.030760       0.170000 
      1.829642       0.030330       0.080000 
      1.860942       0.025374       0.000000 
      1.891907       0.006576       0.110000 
      1.922928       -0.009121       0.080000 
      1.952938       0.006576       0.080000 
      1.983789       0.025374       0.040000 
      2.014740       0.030330       0.100000 
      2.045922       0.030760       0.180000 
      2.078075       0.030773       0.050000 
      2.108862       0.030773       0.060000 
      2.140899       0.030773       0.020000 
      2.172118       0.030773       0.090000 
      2.203101       0.030773       0.070000 
      2.234007       0.030773       0.090000 
      2.265007       0.030773       0.010000 
      2.297150       0.030773       0.080000 
      2.328422       0.030773       0.310000 
      2.359684       0.030773       0.210000 
      2.390939       0.030773       0.060000 
      2.422852       0.030773       0.100000 
      2.453768       0.030760       0.130000 
      2.484686       0.030330       0.050000 
      2.516601       0.025374       0.040000 
      2.547518       0.006576       0.210000 
      2.578434       -0.009121       0.110000 
      2.610344       0.006576       0.050000 
      2.641263       0.025374       0.140000 
      2.672182       0.030330       0.220000 
      2.704100       0.030760       0.220000 
      2.735018       0.030773       0.170000 
      2.765935       0.030773       0.140000 
      2.795821       0.030773       0.240000 
      2.825770       0.030773       0.060000 
      2.855693       0.030773       0.130000 
      2.887018       0.030773       0.040000 
      2.917902       0.030773       0.130000 
      2.949454       0.030773       0.020000 
      2.980585       0.030773       0.060000 
      3.011570       0.030773       0.060000 
      3.042489       0.030773       0.040000 
      3.073174       0.030773       0.050000 
      3.104800       0.030773       0.010000 
      3.135389       0.030773       0.070000 
      3.166750       0.030773       0.120000 
      3.197286       0.030773       0.020000 
      3.228475       0.030773       0.140000 
      3.259218       0.030773       0.080000 
      3.289013       0.030773       0.010000 
      3.319670       0.030773       0.280000 
      3.350783       0.030773       0.370000 
      3.381975       0.030773       0.060000 
      3.412969       0.030773       0.160000 
      3.443949       0.030773       0.190000 
      3.475184       0.030773       0.120000 
      3.506695       0.030773       0.120000 
      3.537903       0.030773       0.040000 
      3.569699       0.030773       0.010000 
      3.601163       0.030773       0.080000 
      3.633078       0.030773       0.090000 
      3.664371       0.030773       0.080000 
      3.695788       0.030773       0.200000 
      3.726046       0.030773       0.080000 
      3.757289       0.030773       0.040000 
      3.788300       0.030773       0.140000 
      3.819155       0.030773       0.010000 
      3.850501       0.030773       0.180000 
      3.881773       0.030773       0.080000 
      3.912140       0.030773       0.140000 
      3.944053       0.030773       0.030000 
      3.975253       0.030773       0.060000 
      4.005726       0.030773       0.070000 
      4.037669       0.030773       0.190000 
      4.068830       0.030773       0.110000 
      4.099336       0.030773       0.110000 
      4.130698       0.030773       0.310000 
      4.161967       0.030773       0.060000 
      4.194184       0.030773       0.050000 
      4.225261       0.030773       0.100000 
      4.257178       0.030773       0.080000 
      4.286922       0.030773       0.050000 
      4.332900       0.030773       0.010000 
      4.364205       0.030773       0.070000 
      4.395923       0.030773       0.210000 
      4.425968       0.030773       0.340000 
      4.457906       0.030773       0.020000 
      4.489717       0.030773       0.080000 
      4.519957       0.030773       0.060000 
      4.551104       0.030773       0.190000 
      4.581948       0.030773       0.040000 
      4.613983       0.030773       0.100000 
      4.645591       0.030773       0.240000 
      4.676137       0.030773       0.070000 
      4.706426       0.030773       0.100000 
      4.737451       0.030773       0.060000 
      4.769299       0.030773       0.070000 
      4.800573       0.030773       0.140000 
      4.832128       0.030773       0.130000 
      4.863723       0.030773       0.050000 
      4.895131       0.030773       0.050000 
      4.926550       0.030773       0.060000 
      4.957903       0.030773       0.250000 
      4.988664       0.030773       0.040000 
      5.019753       0.030773       0.050000 
      5.049709       0.030773       0.010000 
      5.079631       0.030773       0.190000 
      5.110942       0.030773       0.050000 
      5.140862       0.030773       0.030000 
      5.171811       0.030773       0.070000 
      5.202876       0.030773       0.010000 
      5.233879       0.030773       0.420000 
      5.264905       0.030773       0.020000 
      5.295970       0.030773       0.070000 
      5.327038       0.030773       0.110000 
      5.358018       0.030773       0.030000 
      5.388488       0.030773       0.040000 
      5.419278       0.030773       0.070000 
      5.449633       0.030773       0.050000 
      5.480710       0.030773       0.190000 
      5.511770       0.030773       0.110000 
      5.543246       0.030773       0.090000 
      5.574365       0.030773       0.140000 
      5.605578       0.030773       0.030000 
      5.636633       0.030773       0.010000 
      5.667951       0.030773       0.080000 
      5.698748       0.030773       0.260000 
      5.729919       0.030773       0.130000 
      5.761751       0.030773       0.120000 
      5.793312       0.030773       0.260000 
      5.825129       0.030773       0.260000 
      5.856319       0.030773       0.040000 
      5.888239       0.030773       0.040000 
      5.918620       0.030773       0.080000 
      5.949067       0.030773       0.210000 
      5.980985       0.030773       0.010000 
      6.010936       0.030773       0.100000 
      6.042859       0.030773       0.140000 
      6.074390       0.030773       0.010000 
      6.104959       0.030773       0.070000 
      6.136105       0.030773       0.030000 
      6.168215       0.030773       0.080000 
      6.199370       0.030773       0.150000 
      6.230693       0.030773       0.130000 
      6.262049       0.030773       0.180000 
      6.293099       0.030773       0.030000 
      6.323563       0.030773       0.010000 
      6.354305       0.030773       0.190000 
      6.384941       0.030773       0.100000 
      6.416360       0.030773       0.110000 
      6.447752       0.030773       0.180000 
      6.479842       0.030773       0.050000 
      6.510908       0.030773       0.060000 
      6.541875       0.030773       0.310000 
      6.573304       0.030773       0.020000 
      6.604710       0.030773       0.110000 
      6.635635       0.030773       0.310000 
      6.666217       0.030773       0.040000 
      6.697739       0.030773       0.160000 
      6.728429       0.030773       0.220000 
      6.759871       0.030773       0.180000 
      6.790930       0.030773       0.200000 
      6.820912       0.030773       0.100000 
      6.852312       0.030773       0.420000 
      6.883554       0.030773       0.590000 
      6.914606       0.030773       0.590000 
      6.945429       0.030773       0.950000 
      6.977081       0.030773       2.450000 
      7.008343       0.030773       4.350000 
      7.039759       0.030773       4.790000 
      7.071679       0.030773       5.610000 
      7.102865       0.030773       7.090000 
      7.134321       0.030773       8.130000 
      7.165010       0.030773       8.400000 
      7.196212       0.030773       9.800000 
      7.227726       0.030773       14.320000 
      7.259190       0.030773       24.560000 
      7.290469       0.030773       42.090000 
      7.322078       0.030773       62.900000 
      7.353069       0.030774       78.180000 
      7.384760       0.030787       84.880000 
      7.414659       0.031230       100.900000 
      7.445969       0.036630       119.930000 
      7.477621       0.060894       130.750000 
      7.508627       0.103005       142.410000 
      7.539874       0.154237       153.770000 
      7.571133       0.281965       169.610000 
      7.601943       0.498520       180.170000 
      7.633075       0.697509       202.130000 
      7.664258       0.868398       220.160000 
      7.695944       0.983584       226.140000 
      7.726486       1.030854       243.580000 
      7.757593       1.080637       258.630000 
      7.788250       1.226000       262.270000 
      7.820189       1.515076       273.040000 
      7.851936       1.832432       279.150000 
      7.883025       1.994255       281.060000 
      7.914456       2.028020       286.400000 
      7.944964       2.031647       303.250000 
      7.976109       2.043922       288.230000 
      8.007723       2.110731       317.100000 
      8.039102       2.290134       323.400000 
      8.069905       2.580189       298.100000 
      8.099922       2.877394       320.800000 
      8.131831       3.107077       342.420000 
      8.163113       3.409761       328.400000 
      8.193853       3.793050       336.440000 
      8.224695       4.079167       325.420000 
      8.255131       4.359016       317.550000 
      8.286931       4.698742       332.170000 
      8.317756       4.934620       338.210000 
      8.348938       5.016416       365.210000 
      8.380381       5.033902       368.460000 
      8.410914       5.083878       364.430000 
      8.441885       5.306220       367.460000 
      8.472770       5.679674       361.150000 
      8.503945       5.903721       352.110000 
      8.534916       5.993291       350.760000 
      8.566213       6.247320       346.790000 
      8.597508       6.630605       361.980000 
      8.628454       6.858720       364.810000 
      8.659898       6.906285       368.290000 
      8.690790       6.757407       377.670000 
      8.721901       6.455483       286.430000 
      8.753759       6.220588       19.680000 
      8.784362       6.115199       24.090000 
      8.814972       6.062264       25.240000 
      8.846408       6.042057       10.040000 
      8.878221       6.055482       8.230000 
      8.909796       6.072548       24.640000 
      8.940847       6.079669       9.570000 
      8.970876       6.170755       15.270000 
      9.003147       6.360174       17.580000 
      9.033694       6.406891       10.790000 
      9.064519       6.223022       1.810000 
      9.094476       6.065743       5.020000 
      9.125979       5.757686       3.790000 
      9.156518       4.286811       10.850000 
      9.187193       2.045528       10.810000 
      9.219152       1.127078       7.070000 
      9.249019       0.836229       3.840000 
      9.279687       0.304606       4.370000 
      9.311301       -0.249386       10.660000 
      9.341988       -0.881193       8.470000 
      9.373172       -1.442813       3.080000 
      9.404333       -1.764518       3.930000 
      9.434944       -1.948300       6.050000 
      9.466910       -2.035864       7.740000 
      9.496977       -2.005894       7.790000 
      9.527308       -1.931590       4.870000 
      9.558035       -1.889881       4.690000 
      9.589202       -1.915460       6.050000 
      9.620710       -1.934218       7.970000 
      9.651135       -1.928002       5.410000 
      9.682054       -1.939577       4.990000 
      9.713075       -1.938730       4.560000 
      9.744610       -1.917648       6.380000 
      9.774943       -1.891223       5.950000 
      9.806821       -1.859842       6.760000 
      9.837571       -1.880495       5.430000 
      9.868192       -1.934204       5.620000 
      9.900023       -1.962497       5.810000 
      9.929970       -1.963331       6.270000 
      9.960852       -1.944129       5.660000 
      9.991907       -1.918534       6.010000 
      10.021881       -1.896635       5.610000 
      10.053822       -1.884039       5.400000 
      10.085732       -1.920389       5.530000 
      10.115705       -1.958375       5.600000 
      10.146275       -1.967010       5.360000 
      10.178261       -1.953002       5.280000 
      10.209280       -1.896635       5.280000 
      10.241738       -1.849544       5.330000 
      10.272077       -1.896622       5.920000 
      10.303844       -1.952573       5.380000 
      10.334986       -1.962041       5.740000 
      10.365791       -1.939120       5.280000 
      10.397501       -1.898836       5.880000 
      10.428682       -1.869697       5.560000 
      10.459292       -1.845943       6.150000 
      10.490758       -1.835201       5.570000 
      10.537895       -1.875069       6.140000 
      10.568599       -1.933318       5.640000 
      10.599274       -1.957085       6.040000 
      10.630943       -1.939160       5.910000 
      10.661097       -1.905108       5.940000 
      10.691400       -1.904678       5.590000 
      10.722681       -1.933788       5.900000 
      10.753609       -1.933761       5.660000 
      10.783535       -1.903765       5.870000 
      10.814411       -1.893424       5.570000 
      10.845326       -1.879981       5.500000 
      10.876263       -1.829319       5.490000 
      10.908192       -1.809648       5.740000 
      10.938078       -1.829262       5.300000 
      10.970026       -1.814573       5.480000 
      10.999947       -1.783999       5.380000 
      11.031828       -1.801148       5.420000 
      11.063777       -1.832349       5.540000 
      11.093694       -1.840129       5.180000 
      11.123610       -1.820735       5.750000 
      11.155498       -1.806919       5.640000 
      11.185152       -1.759802       5.660000 
      11.216437       -1.763468       5.780000 
      11.246791       -1.814866       5.830000 
      11.278074       -1.786721       5.910000 
      11.308809       -1.728863       6.000000 
      11.339687       -1.697078       5.950000 
      11.371215       -1.679109       6.140000 
      11.418152       -1.701564       5.920000 
      11.448519       -1.741792       5.810000 
      11.479703       -1.771936       5.920000 
      11.510947       -1.724266       5.620000 
      11.542084       -1.631688       5.530000 
      11.572914       -1.638302       5.610000 
      11.604286       -1.706863       5.410000 
      11.635727       -1.676854       5.450000 
      11.666912       -1.663441       5.710000 
      11.698898       -1.696981       5.540000 
      11.730446       -1.677766       5.630000 
      11.761558       -1.684967       5.520000 
      11.792797       -1.728738       5.540000 
      11.823970       -1.731088       5.600000 
      11.854782       -1.675857       5.640000 
      11.886137       -1.561170       5.630000 
      11.917383       -1.425803       5.660000 
      11.949299       -1.392663       5.440000 
      11.980494       -1.435158       5.470000 
      12.011155       -1.463371       5.480000 
      12.041937       -1.472813       5.420000 
      12.073871       -1.476756       5.760000 
      12.104730       -1.430687       5.640000 
      12.134697       -1.344118       6.000000 
      12.164968       -1.337056       6.030000 
      12.196193       -1.378543       6.040000 
      12.226141       -1.388577       6.130000 
      12.258061       -1.366875       5.950000 
      12.289140       -1.341028       5.660000 
      12.319527       -1.297410       6.070000 
      12.349933       -1.271068       6.200000 
      12.380955       -1.242248       5.950000 
      12.411790       -1.208248       5.780000 
      12.441708       -1.134218       5.670000 
      12.472625       -1.035202       5.570000 
      12.504540       -0.986808       5.380000 
      12.534460       -0.995250       5.550000 
      12.564380       -1.020389       5.920000 
      12.596297       -1.047217       5.940000 
      12.626253       -1.078625       5.800000 
      12.658130       -1.058415       5.770000 
      12.690082       -1.010091       5.840000 
      12.719966       -1.005578       5.590000 
      12.751881       -1.040074       5.770000 
      12.783794       -1.068367       5.990000 
      12.813716       -1.088481       5.930000 
      12.845616       -1.096608       6.070000 
      12.877353       -1.113165       6.080000 
      12.908205       -1.184010       5.950000 
      12.940166       -1.216637       6.100000 
      12.972119       -1.167440       5.960000 
      13.003523       -1.099696       6.340000 
      13.034122       -1.051341       6.260000 
      13.064953       -1.029789       6.280000 
      13.095957       -1.044600       6.460000 
      13.127872       -1.058429       6.330000 
      13.157859       -1.044613       6.310000 
      13.188938       -1.030219       6.420000 
      13.219557       -1.056284       5.990000 
      13.250527       -1.118050       6.010000 
      13.281926       -1.177725       6.190000 
      13.314022       -1.176313       6.070000 
      13.345102       -1.120375       5.850000 
      13.376662       -1.065657       5.730000 
      13.407425       -1.080481       5.840000 
      13.439290       -1.127919       5.690000 
      13.469423       -1.127073       5.720000 
      13.500959       -1.070100       5.840000 
      13.532439       -1.021789       5.620000 
      13.563780       -1.054429       5.980000 
      13.593426       -1.124831       5.970000 
      13.624126       -1.135975       5.840000 
      13.654913       -1.119449       6.020000 
      13.686546       -1.093840       5.930000 
      13.717920       -1.068796       6.060000 
      13.748980       -1.039617       6.040000 
      13.779748       -0.999320       5.910000 
      13.810795       -0.975996       6.150000 
      13.842229       -0.981368       6.140000 
      13.873287       -1.028459       6.040000 
      13.904854       -1.098296       6.180000 
      13.935338       -1.108207       6.030000 
      13.967257       -1.076813       6.180000 
      13.998682       -1.060700       6.260000 
      14.029712       -1.018534       5.820000 
      14.061164       -0.980052       6.060000 
      14.090864       -0.970113       6.070000 
      14.122329       -0.969253       6.060000 
      14.153446       -0.969227       5.820000 
      14.183909       -0.969253       5.850000 
      14.214800       -0.970113       5.550000 
      14.245595       -0.980025       5.510000 
      14.276401       -1.017621       5.520000 
      14.306200       -1.049015       5.690000 
      14.338213       -1.017621       5.640000 
      14.368522       -0.980038       5.710000 
      14.398223       -0.970569       5.720000 
      14.429749       -0.975096       5.780000 
      14.461831       -0.998823       5.600000 
      14.493154       -1.033318       5.910000 
      14.523583       -1.033318       5.930000 
      14.555164       -0.998836       6.130000 
      14.586430       -0.975512       5.820000 
      14.617532       -0.975082       5.830000 
      14.648355       -0.993437       6.030000 
      14.679327       -1.009121       5.970000 
      14.709253       -0.993424       5.920000 
      14.739919       -0.974626       5.920000 
      14.770644       -0.969670       5.970000 
      14.801964       -0.969240       5.940000 
      14.833264       -0.969227       5.860000 
      14.864213       -0.969227       5.900000 
      14.894770       -0.969227       6.240000 
      14.925709       -0.969227       5.880000 
      14.956933       -0.969227       5.790000 
      14.988252       -0.969227       5.710000 
      15.019494       -0.969227       5.840000 
      15.050961       -0.969227       5.900000 
      15.083022       -0.969227       5.750000 
      15.115145       -0.969227       5.680000 
      15.146899       -0.969227       5.990000 
      15.177411       -0.969227       5.760000 
      15.209025       -0.969227       5.440000 
      15.240502       -0.969227       5.600000 
      15.272120       -0.969227       5.810000 
      15.303165       -0.969227       5.750000 
      15.333952       -0.969227       5.940000 
      15.363930       -0.969227       5.770000 
      15.395346       -0.969227       5.790000 
      15.426109       -0.969227       6.070000 
      15.457763       -0.969227       5.980000 
      15.488964       -0.969227       5.930000 
      15.519916       -0.969240       5.930000 
      15.551071       -0.969670       5.940000 
      15.581416       -0.974626       5.660000 
      15.611502       -0.993424       6.080000 
      15.642990       -1.009121       5.930000 
      15.673743       -0.993424       6.000000 
      15.705138       -0.974626       5.990000 
      15.736104       -0.969670       5.940000 
      15.766834       -0.969240       5.870000 
      15.797298       -0.969227       5.980000 
      15.828364       -0.969227       5.680000 
      15.859240       -0.969227       5.740000 
      15.889891       -0.969227       5.840000 
      15.920863       -0.969227       5.790000 
      15.951975       -0.969227       5.800000 
      15.983859       -0.969227       6.030000 
      16.014906       -0.969227       5.740000 
      16.046955       -0.969227       5.870000 
      16.078061       -0.969227       5.730000 
      16.110297       -0.969227       5.850000 
      16.141812       -0.969227       5.770000 
      16.171696       -0.969227       5.750000 
      16.203646       -0.969227       5.590000 
      16.234540       -0.969227       5.880000 
      16.265825       -0.969227       5.970000 
      16.296378       -0.969227       6.000000 
      16.326841       -0.969227       5.820000 
      16.358010       -0.969227       5.920000 
      16.389685       -0.969227       6.020000 
      16.420929       -0.969227       6.030000 
      16.450922       -0.969227       5.990000 
      16.483083       -0.969227       6.120000 
      16.514577       -0.969227       6.020000 
      16.545341       -0.969227       6.010000 
      16.576936       -0.969227       6.000000 
      16.608504       -0.969227       5.930000 
      16.639151       -0.969227       5.700000 
      16.670482       -0.969227       5.880000 
      16.700973       -0.969227       5.780000 
      16.731896       -0.969227       5.660000 
      16.763190       -0.969227       5.870000 
      16.794178       -0.969227       5.560000 
      16.824630       -0.969227       5.890000 
      16.855919       -0.969227       5.930000 
      16.887320       -0.969227       5.860000 
      16.919059       -0.969227       5.770000 
      16.949587       -0.969227       6.000000 
      16.981079       -0.969227       6.060000 
      17.012959       -0.969227       5.780000 
      17.059148       -0.969227       5.810000 
      17.089945       -0.969226       5.990000 
      17.121103       -0.969213       5.850000 
      17.152914       -0.968783       6.010000 
      17.182769       -0.963827       5.830000 
      17.214055       -0.945029       5.860000 
      17.244963       -0.929332       5.820000 
      17.277030       -0.945029       5.980000 
      17.309087       -0.963827       5.970000 
      17.339597       -0.968783       5.990000 
      17.372247       -0.969213       5.920000 
      17.401938       -0.969226       5.990000 
      17.433186       -0.969227       5.960000 
      17.464930       -0.969227       5.890000 
      17.496020       -0.969227       5.630000 
      17.526421       -0.969227       5.970000 
      17.557563       -0.969227       5.820000 
      17.588949       -0.969227       5.780000 
      17.620351       -0.969227       6.060000 
      17.651067       -0.969227       5.870000 
      17.681777       -0.969227       5.910000 
      17.713195       -0.969227       5.980000 
      17.744241       -0.969227       5.870000 
      17.775473       -0.969227       5.870000 
      17.806371       -0.969227       5.860000 
      17.837733       -0.969227       5.990000 
      17.869089       -0.969227       5.970000 
      17.899971       -0.969227       5.640000 
      17.930842       -0.969227       5.680000 
      17.961479       -0.969226       6.030000 
      17.992403       -0.969213       6.030000 
      18.023566       -0.968783       5.880000 
      18.054740       -0.963827       5.850000 
      18.084954       -0.945029       5.770000 
      18.116162       -0.929332       5.700000 
      18.148033       -0.945016       5.800000 
      18.177824       -0.963371       6.030000 
      18.208939       -0.962941       5.680000 
      18.239017       -0.939617       5.730000 
      18.271114       -0.905135       5.680000 
      18.302392       -0.905135       6.120000 
      18.333899       -0.939630       5.920000 
      18.364917       -0.963384       5.780000 
      18.396391       -0.968770       5.660000 
      18.426065       -0.969213       5.820000 
      18.457136       -0.969226       6.000000 
      18.488916       -0.969227       5.720000 
      18.519723       -0.969227       6.050000 
      18.550974       -0.969226       5.820000 
      18.581990       -0.969213       5.820000 
      18.612917       -0.968783       5.960000 
      18.644527       -0.963827       5.950000 
      18.675220       -0.945029       5.980000 
      18.705885       -0.929332       5.790000 
      18.737943       -0.945029       5.880000 
      18.769371       -0.963827       5.900000 
      18.801232       -0.968783       5.850000 
      18.830920       -0.969213       6.080000 
      18.861894       -0.969226       5.850000 
      18.893882       -0.969213       6.160000 
      18.924029       -0.968770       6.050000 
      18.954653       -0.963384       5.920000 
      18.985180       -0.939630       6.120000 
      19.015105       -0.905135       5.850000 
      19.045538       -0.905135       5.830000 
      19.076019       -0.939630       5.850000 
      19.107129       -0.963384       5.960000 
      19.139095       -0.968770       5.750000 
      19.170983       -0.969213       5.780000 
      19.216818       -0.969213       5.670000 
      19.248699       -0.968770       5.940000 
      19.279924       -0.963384       5.930000 
      19.310883       -0.939630       5.900000 
      19.341954       -0.905135       5.800000 
      19.373227       -0.905108       5.790000 
      19.403833       -0.938744       6.030000 
      19.434886       -0.952586       5.870000 
      19.466362       -0.920376       5.820000 
      19.497403       -0.889398       5.980000 
      19.528957       -0.919946       6.080000 
      19.559814       -0.947617       6.230000 
      19.591987       -0.919503       5.880000 
      19.622938       -0.884012       5.830000 
      19.653527       -0.896622       5.940000 
      19.684734       -0.918091       6.020000 
      19.714986       -0.938730       6.040000 
      19.746278       -0.939147       5.850000 
      19.777419       -0.923047       5.840000 
      19.808543       -0.915420       5.830000 
      19.840285       -0.899736       6.070000 
      19.872279       -0.904692       5.910000 
      19.902586       -0.939603       5.910000 
      19.933532       -0.962928       5.860000 
      19.964975       -0.962928       5.800000 
      19.996934       -0.939617       5.770000 
      20.027811       -0.905135       5.700000 
      20.058006       -0.905135       5.780000 
      20.089583       -0.939630       5.780000 
      20.120845       -0.963384       5.800000 
      20.151852       -0.968756       5.980000 
      20.183133       -0.968756       5.790000 
      20.214051       -0.963357       6.040000 
      20.244752       -0.938744       5.930000 
      20.276782       -0.894323       5.970000 
      20.308049       -0.856284       5.860000 
      20.340040       -0.854000       5.770000 
      20.369979       -0.885394       5.950000 
      20.401294       -0.893854       5.840000 
      20.432876       -0.903336       6.020000 
      20.462865       -0.928362       5.870000 
      20.493762       -0.909590       5.810000 
      20.524554       -0.864757       5.860000 
      20.554871       -0.880024       5.860000 
      20.585746       -0.922950       5.650000 
      20.616603       -0.907818       5.910000 
      20.647918       -0.848574       5.730000 
      20.678720       -0.808333       6.190000 
      20.709870       -0.814548       5.970000 
      20.741822       -0.890323       5.870000 
      20.772705       -0.951659       5.830000 
      20.803656       -0.956629       5.900000 
      20.834573       -0.914950       5.820000 
      20.865491       -0.859828       5.820000 
      20.895377       -0.856297       5.710000 
      20.927320       -0.888898       5.740000 
      20.958237       -0.913204       5.890000 
      20.988863       -0.906822       5.910000 
      21.020751       -0.866542       5.730000 
