

 time    ||    gripping force   ||   raspberry measurement 

      0       0.010000       -794.788000 
      0       0.010000       -794.788000 
      0       0.010000       -794.788000 
      0       0.080000       -794.788000 
      0       0.060000       -794.788000 
      0       0.220000       -794.788000 
      0       0.160000       -794.788000 
      0       0.080000       -794.788000 
      0       0.070000       -794.788000 
      0       0.090000       -794.787995 
      1       0.150000       -786.838947 
      1       0.070000       -778.865359 
      1       0.080000       -775.346484 
      1       0.050000       -732.478086 
      1       0.040000       -540.358274 
      2       0.240000       -223.616471 
      2       0.260000       -31.502444 
      2       0.280000       11.401308 
      2       0.380000       14.959660 
      3       0.210000       15.074408 
      3       0.300000       15.077887 
      3       0.460000       15.076480 
      3       0.580000       15.077918 
      3       0.420000       15.076480 
      3       2.760000       15.077892 
      3       21.010000       15.075594 
      3       41.670000       15.067120 
      3       51.920000       15.028086 
      3       68.480000       14.998103 
      3       79.810000       15.027200 
      3       91.720000       15.056322 
      4       107.300000       15.027200 
      5       105.050000       14.998103 
      5       104.880000       15.028086 
      5       102.350000       15.067120 
      5       101.200000       15.075594 
      5       100.460000       15.077906 
      6       92.160000       15.077045 
      6       90.870000       15.087428 
      6       88.810000       15.153407 
      6       86.520000       15.389270 
      6       85.050000       15.744237 
      6       83.910000       16.021370 
      6       81.110000       16.280539 
      6       79.070000       16.605993 
      6       77.420000       16.856154 
      6       76.320000       16.958913 
      6       75.890000       16.985410 
      6       75.850000       17.021302 
      6       75.740000       17.037013 
      7       75.690000       17.004733 
      7       75.700000       16.972009 
      7       74.980000       16.915917 
      7       74.310000       16.826326 
      7       73.090000       16.728086 
      7       69.080000       16.638897 
      7       68.810000       16.586848 
      7       67.660000       16.561224 
      7       67.070000       16.485005 
      8       66.860000       16.351424 
      9       58.280000       16.215627 
      9       58.180000       16.130426 
      9       58.070000       16.144324 
      9       57.930000       16.210129 
      9       57.860000       16.225799 
      10       57.580000       16.162168 
      10       57.260000       16.122273 
      10       50.720000       16.137497 
      10       51.030000       16.110559 
      10       51.030000       16.037581 
      10       51.080000       15.988635 
      10       51.090000       15.984661 
      10       51.160000       16.005673 
      10       51.180000       16.037041 
      10       51.220000       16.021343 
      10       51.250000       15.986848 
      11       51.180000       15.978792 
      11       51.230000       15.976507 
      11       51.240000       15.977919 
      11       51.250000       15.976480 
      11       51.250000       15.977918 
      11       51.280000       15.976480 
      11       51.230000       15.977918 
      12       51.270000       15.976480 
      12       51.260000       15.977918 
      12       51.330000       15.976480 
      12       51.300000       15.977918 
      12       51.250000       15.976480 
      12       51.250000       15.977918 
      12       51.270000       15.976467 
      12       51.270000       15.977462 
      12       51.270000       15.970651 
      12       51.240000       15.948752 
      13       51.220000       15.917358 
      13       51.300000       15.933055 
      13       51.280000       15.967524 
      13       51.260000       15.974734 
      13       51.190000       15.967510 
      13       51.240000       15.932612 
      14       51.230000       15.911959 
      14       51.170000       15.924555 
      14       51.240000       15.930757 
      14       51.220000       15.953265 
      14       51.190000       15.971067 
      14       51.250000       15.977475 
      14       51.170000       15.976466 
      14       51.250000       15.977892 
      14       51.220000       15.975607 
      14       51.170000       15.967550 
      14       51.180000       15.933028 
      14       51.230000       15.916485 
      15       51.240000       15.938370 
      15       51.210000       15.926770 
      15       51.210000       15.911072 
      15       51.260000       15.919572 
      15       51.180000       15.911529 
      15       51.240000       15.932585 
      15       51.180000       15.967080 
      15       51.110000       15.969778 
      15       51.180000       15.948726 
      15       51.180000       15.917357 
      15       51.150000       15.933042 
      15       51.200000       15.967107 
      16       51.210000       15.970208 
      16       51.200000       15.953695 
      16       51.170000       15.936572 
      16       51.200000       15.953278 
      16       51.210000       15.965668 
      16       51.170000       15.952835 
      16       51.180000       15.931173 
      16       51.230000       15.929497 
      16       51.110000       15.930300 
      16       51.160000       15.942480 
      16       51.120000       15.922673 
      17       51.120000       15.897687 
      17       51.230000       15.928059 
      17       51.140000       15.966677 
      17       51.150000       15.970195 
      17       51.150000       15.953694 
      17       51.160000       15.936572 
      17       51.160000       15.953265 
      17       51.100000       15.965252 
      17       51.060000       15.948309 
      17       51.100000       15.917345 
      18       51.110000       15.933055 
      18       51.120000       15.967550 
      18       51.110000       15.975607 
      18       51.090000       15.977892 
      18       51.090000       15.976480 
      18       51.110000       15.977918 
      18       51.150000       15.976480 
      18       51.100000       15.977918 
      18       51.090000       15.976480 
      18       51.090000       15.977892 
      19       51.120000       15.975607 
      19       51.090000       15.967537 
      19       51.110000       15.932599 
      19       51.110000       15.911529 
      19       51.140000       15.919572 
      19       51.070000       15.911072 
      19       51.130000       15.926770 
      19       51.010000       15.938370 
      19       51.030000       15.916484 
      19       51.000000       15.933015 
      19       50.890000       15.967093 
      20       50.930000       15.969778 
      20       50.900000       15.948725 
      20       50.870000       15.917304 
      20       50.770000       15.931295 
      20       50.880000       15.946370 
      20       50.820000       15.883331 
      20       50.850000       15.831714 
      20       50.820000       15.871191 
      20       50.810000       15.900704 
      20       50.790000       15.930826 
      21       50.770000       15.956712 
      21       50.840000       15.927212 
      21       50.740000       15.898103 
      21       50.820000       15.928086 
      21       50.780000       15.967120 
      21       50.720000       15.975594 
      21       50.800000       15.977892 
      21       50.760000       15.976480 
      21       50.730000       15.977918 
      21       50.760000       15.976467 
      21       50.810000       15.977475 
      21       50.750000       15.971068 
      22       50.840000       15.953278 
      22       50.730000       15.931187 
      22       50.790000       15.929524 
      22       50.710000       15.931187 
      22       50.820000       15.953278 
      22       50.760000       15.971068 
      22       50.710000       15.977489 
      22       50.700000       15.976923 
      22       50.770000       15.983747 
      22       50.770000       16.005646 
      22       50.700000       16.037040 
      23       50.740000       16.021303 
      23       50.720000       15.985505 
      23       50.720000       15.962138 
      23       50.770000       15.898086 
      23       50.690000       15.829070 
      23       50.730000       15.844767 
      23       50.710000       15.916857 
      23       50.720000       15.966194 
      23       50.690000       15.974694 
      24       50.720000       15.967523 
      24       50.700000       15.933054 
      24       50.700000       15.917331 
      24       50.720000       15.947866 
      24       50.690000       15.959853 
      24       50.720000       15.929068 
      24       50.710000       15.896678 
      24       50.730000       15.929524 
      24       50.650000       15.965668 
      24       50.690000       15.976576 
      25       50.720000       15.970624 
      25       50.750000       15.948752 
      25       50.740000       15.917331 
      25       50.610000       15.932169 
      25       50.690000       15.956752 
      25       50.720000       15.927212 
      25       50.670000       15.898077 
      25       50.660000       15.927199 
      26       50.640000       15.956322 
      26       50.740000       15.927200 
      26       50.690000       15.898103 
      26       50.700000       15.928072 
      26       50.680000       15.966677 
      26       50.630000       15.970195 
      26       50.680000       15.953695 
      26       50.630000       15.936586 
      27       50.680000       15.953721 
      27       50.590000       15.971081 
      27       50.700000       15.977475 
      27       50.580000       15.976467 
      27       50.720000       15.977918 
      27       50.630000       15.976480 
      27       50.640000       15.977918 
      27       50.670000       15.976480 
      27       50.600000       15.977892 
      27       50.640000       15.975594 
      28       50.620000       15.967120 
      28       50.610000       15.928072 
      28       50.670000       15.897674 
      28       50.580000       15.922257 
      28       50.630000       15.937954 
      28       50.570000       15.916472 
      28       50.560000       15.933028 
      28       50.690000       15.967550 
      28       50.600000       15.975607 
      29       50.660000       15.977865 
      29       50.620000       15.975607 
      29       50.640000       15.967550 
      29       50.590000       15.933028 
      29       50.650000       15.916485 
      29       50.580000       15.938384 
      29       50.490000       15.927226 
      29       50.550000       15.916901 
      30       50.370000       15.948712 
      30       50.230000       15.969778 
      30       50.040000       15.967093 
      30       50.000000       15.933015 
      30       49.960000       15.916485 
      30       49.950000       15.938384 
      30       49.840000       15.927226 
      31       48.280000       15.916901 
      31       48.330000       15.948739 
      31       48.210000       15.970637 
      31       48.300000       15.977019 
      31       48.330000       15.971067 
      31       48.390000       15.953721 
      31       48.300000       15.936572 
      31       48.150000       15.953278 
      31       48.260000       15.965682 
      31       48.220000       15.953278 
      32       48.120000       15.936572 
      32       48.170000       15.953721 
      32       48.140000       15.971081 
      32       48.120000       15.977475 
      32       48.150000       15.976467 
      32       48.120000       15.977918 
      32       48.160000       15.976466 
      32       48.170000       15.977435 
      32       48.190000       15.969738 
      32       48.140000       15.937068 
      32       48.180000       15.858165 
      32       48.110000       15.804859 
      33       48.110000       15.838911 
      33       48.180000       15.910586 
      33       48.150000       15.937041 
      33       48.120000       15.916418 
      33       48.160000       15.932155 
      33       48.140000       15.957168 
      33       48.220000       15.931739 
      33       48.170000       15.911932 
      33       48.170000       15.924555 
      33       48.160000       15.930757 
      33       48.180000       15.953265 
      34       48.140000       15.971067 
      34       48.120000       15.977435 
      34       48.160000       15.975137 
      34       48.160000       15.961681 
      34       48.150000       15.902546 
      34       48.130000       15.841595 
      34       48.160000       15.825898 
      34       48.100000       15.817815 
      34       48.210000       15.861778 
      34       48.130000       15.926659 
      35       48.190000       15.920444 
      35       48.200000       15.885949 
      35       48.160000       15.868450 
      35       48.170000       15.833968 
      35       48.180000       15.828157 
      35       48.180000       15.897160 
      35       48.150000       15.950883 
      35       48.150000       15.931269 
      35       48.200000       15.911919 
      35       48.120000       15.924555 
      35       48.150000       15.930757 
      35       48.140000       15.953265 
      36       48.220000       15.971054 
      36       48.100000       15.977032 
      36       48.180000       15.971054 
      36       48.180000       15.953278 
      36       48.140000       15.931186 
      36       48.150000       15.929498 
      36       48.190000       15.930314 
      37       48.170000       15.942910 
      37       48.140000       15.927616 
      37       48.110000       15.916041 
      37       48.140000       15.938371 
      37       48.150000       15.927226 
      37       48.220000       15.916901 
      37       48.130000       15.948739 
      37       48.190000       15.970637 
      37       48.240000       15.976979 
      38       48.170000       15.969738 
      38       48.180000       15.937524 
      38       48.250000       15.863995 
      38       48.140000       15.834039 
      38       48.220000       15.898490 
      38       48.120000       15.961278 
      38       48.210000       15.975124 
      38       48.180000       15.977435 
      39       48.150000       15.971081 
      39       48.150000       15.953721 
      39       48.160000       15.936586 
      39       48.160000       15.953721 
      39       48.240000       15.971068 
      39       48.160000       15.977032 
      39       48.120000       15.971068 
      40       48.110000       15.953721 
      40       48.150000       15.936586 
      40       48.140000       15.953695 
      40       48.160000       15.970194 
      40       48.130000       15.966650 
      40       48.160000       15.927186 
      40       48.220000       15.887305 
      40       48.120000       15.878805 
      40       48.130000       15.876507 
      40       48.140000       15.877919 
      41       48.180000       15.876507 
      41       48.170000       15.878805 
      41       48.180000       15.887305 
      41       48.140000       15.927199 
      41       48.160000       15.967093 
      41       48.080000       15.975593 
      41       48.160000       15.977892 
      41       48.190000       15.976480 
      41       48.140000       15.977918 
      42       48.150000       15.976480 
      42       48.160000       15.977918 
      42       48.160000       15.976480 
      42       48.160000       15.977892 
      42       48.130000       15.975593 
      42       48.180000       15.967094 
      42       48.150000       15.927213 
      42       48.150000       15.887762 
      42       48.140000       15.884661 
      42       48.130000       15.906560 
      43       48.150000       15.947866 
      43       48.150000       15.970624 
      43       48.170000       15.977462 
      43       48.150000       15.976466 
      43       48.170000       15.977892 
      43       48.190000       15.975607 
      43       48.140000       15.967550 
      44       48.180000       15.933028 
      44       48.130000       15.916471 
      44       48.160000       15.937927 
      44       48.130000       15.921384 
      44       48.160000       15.887305 
      44       48.130000       15.884647 
      44       48.150000       15.906559 
      45       48.140000       15.947839 
      45       48.110000       15.969751 
      45       48.100000       15.967080 
      45       48.130000       15.932585 
      45       48.170000       15.911529 
      45       48.180000       15.919586 
      45       48.160000       15.911529 
      45       48.180000       15.932599 
      45       48.130000       15.967537 
      45       48.140000       15.975607 
      46       48.060000       15.977892 
      46       48.170000       15.976466 
      46       48.120000       15.977462 
      46       48.100000       15.970651 
      46       48.140000       15.948752 
      46       48.110000       15.917358 
      46       48.170000       15.933055 
      47       48.120000       15.967550 
      47       48.140000       15.975607 
      47       48.190000       15.977892 
      47       48.100000       15.976480 
      47       48.120000       15.977918 
      47       48.090000       15.976480 
      47       48.180000       15.977918 
      48       48.110000       15.976480 
      48       48.150000       15.977918 
      48       48.060000       15.976467 
      48       48.060000       15.977462 
      48       48.120000       15.970624 
      48       48.100000       15.947866 
      48       48.080000       15.906533 
      48       48.150000       15.883775 
      48       48.130000       15.876964 
      48       48.210000       15.878818 
      48       48.160000       15.887279 
      49       48.150000       15.926326 
      49       48.130000       15.956725 
      49       48.100000       15.932168 
      49       48.110000       15.917331 
      49       48.170000       15.948752 
      49       48.070000       15.970638 
      49       48.140000       15.977019 
      50       48.160000       15.971054 
      50       48.120000       15.953265 
      50       48.100000       15.930757 
      50       48.190000       15.924555 
      50       48.130000       15.911959 
      50       48.110000       15.932612 
      50       48.120000       15.967510 
      50       48.150000       15.974720 
      51       48.150000       15.967094 
      51       48.120000       15.928086 
      51       48.120000       15.898130 
      51       48.150000       15.928086 
      51       48.160000       15.967120 
      51       48.170000       15.975594 
      51       48.130000       15.977892 
      52       48.130000       15.976466 
      52       48.150000       15.977475 
      52       48.150000       15.971081 
      52       48.140000       15.953721 
      52       48.150000       15.936586 
      52       48.180000       15.953721 
      52       48.150000       15.971081 
      53       48.200000       15.977475 
      53       48.160000       15.976467 
      53       48.200000       15.977918 
      54       48.160000       15.976480 
      54       48.140000       15.977918 
      54       48.260000       15.976480 
      54       48.150000       15.977892 
      54       48.300000       15.975594 
      54       48.440000       15.967120 
      54       48.530000       15.928086 
      54       48.570000       15.898130 
      54       48.550000       15.928086 
      54       48.550000       15.967120 
      55       48.670000       15.975594 
      55       48.930000       15.977892 
      55       49.060000       15.976480 
      55       49.150000       15.977918 
      55       49.170000       15.976480 
      55       49.540000       15.977918 
      55       49.590000       15.976480 
      56       49.600000       15.977918 
      56       49.560000       15.976480 
      56       49.540000       15.977918 
      56       49.530000       15.976480 
      56       49.570000       15.977918 
      56       49.520000       15.976480 
      56       49.550000       15.977918 
      56       49.600000       15.976480 
      57       49.790000       15.977918 
      57       50.010000       15.976467 
      57       50.330000       15.977475 
      57       50.390000       15.971067 
      57       50.480000       15.953265 
      57       50.720000       15.930757 
      57       51.010000       15.924542 
      58       51.210000       15.911502 
      58       51.280000       15.926783 
      58       51.340000       15.938357 
      58       51.340000       15.916041 
      58       51.360000       15.927629 
      58       51.350000       15.943353 
      58       51.370000       15.935699 
      58       51.320000       15.953252 
      58       51.330000       15.965682 
      59       51.300000       15.953278 
      59       51.300000       15.936572 
      59       51.380000       15.953721 
      59       51.330000       15.971081 
      59       51.360000       15.977475 
      59       51.330000       15.976466 
      59       51.320000       15.977892 
      59       51.320000       15.975594 
      60       51.300000       15.967120 
      60       51.320000       15.928086 
      60       51.320000       15.898130 
      60       51.360000       15.928073 
      60       51.320000       15.966677 
      60       51.330000       15.970195 
