

 time    ||    gripping force   ||   raspberry measurement 

      0       0.110000       -802.894000 
      0       0.010000       -802.894000 
      0       0.000000       -802.894000 
      0       0.070000       -802.894000 
      0       0.040000       -802.894000 
      0       0.030000       -802.894000 
      0       0.050000       -802.894000 
      0       0.030000       -802.894000 
      0       0.050000       -802.894000 
      0       0.040000       -802.894000 
      0       0.070000       -802.894000 
      0       0.010000       -802.894000 
      0       0.090000       -802.894000 
      0       0.080000       -802.893995 
      0       0.030000       -802.892801 
      0       0.010000       -802.785349 
      0       0.040000       -799.227031 
      0       0.030000       -755.878114 
      0       0.020000       -561.604789 
      0       0.050000       -561.604789 
      0       1.040000       -241.313260 
      0       0.040000       -241.313260 
      0       0.200000       -47.055645 
      0       0.320000       -47.055645 
      0       0.080000       -47.055645 
      1       0.250000       -3.710258 
      1       0.150000       -3.710258 
      1       0.220000       -3.710258 
      1       0.120000       -0.158751 
      1       0.020000       -0.068672 
      1       0.040000       -0.068672 
      1       0.090000       -0.084614 
      1       0.030000       -0.067460 
      1       0.110000       -0.049658 
      1       0.320000       -0.049658 
      1       0.210000       -0.049658 
      1       0.460000       -0.037891 
      1       0.260000       -0.037891 
      1       0.130000       -0.015602 
      1       0.220000       0.014529 
      2       0.240000       -0.015619 
      2       0.050000       -0.101955 
      2       0.690000       -0.142401 
      2       0.870000       -0.090757 
      2       0.680000       -0.090757 
      2       4.480000       -0.090757 
      2       16.510000       -0.025890 
      2       38.000000       -0.025890 
      2       53.790000       0.025731 
      2       79.480000       0.048086 
      2       92.030000       0.048086 
      2       112.190000       0.048086 
      2       115.130000       0.040499 
      2       114.900000       -0.012351 
      2       114.670000       -0.012351 
      2       111.870000       -0.043758 
      2       102.000000       -0.043758 
      3       88.290000       0.002474 
      3       64.640000       0.033259 
      3       47.000000       0.007430 
      3       30.980000       -0.024544 
      3       22.890000       0.007873 
      3       18.470000       0.038659 
      3       18.690000       0.026806 
      3       19.110000       0.026806 
      3       19.200000       0.026806 
      3       19.200000       0.000704 
      3       19.440000       0.070445 
      3       19.340000       0.070445 
      3       19.450000       0.070445 
      3       19.620000       0.070445 
      3       19.530000       0.347811 
      4       19.830000       0.766024 
      4       19.990000       0.766024 
      4       20.190000       0.766024 
      4       20.220000       0.766024 
      4       20.400000       1.063159 
      4       20.560000       1.063159 
      4       20.540000       1.063159 
      4       20.560000       1.207958 
      4       20.470000       1.207958 
      4       20.450000       1.207958 
      4       20.460000       1.207958 
      4       20.520000       1.207958 
      4       20.680000       1.207958 
      4       20.870000       1.207958 
      4       21.060000       1.207958 
      4       21.040000       1.240226 
      5       21.240000       1.112036 
      5       21.330000       1.112036 
      5       21.600000       0.831059 
      5       21.930000       0.468853 
      5       22.220000       0.468853 
      5       22.330000       0.468853 
      5       22.280000       0.468853 
      5       22.270000       0.468853 
      5       22.100000       0.468853 
      5       22.090000       0.468853 
      5       21.910000       0.468853 
      5       21.530000       0.231352 
      5       21.350000       0.155409 
      5       21.100000       0.106569 
      5       21.000000       0.106569 
      6       20.750000       0.106569 
      6       20.580000       0.106569 
      6       20.500000       0.106569 
      6       20.210000       0.106569 
      6       20.100000       0.066125 
      6       19.950000       0.057610 
      6       19.890000       0.057610 
      6       19.800000       0.055312 
      6       19.810000       0.056724 
      6       19.760000       0.055285 
      6       19.680000       0.055285 
      6       19.680000       0.056723 
      6       19.700000       0.056723 
      6       19.700000       0.055285 
      6       19.770000       0.056723 
      7       19.660000       0.055285 
      7       19.700000       0.055285 
      7       19.740000       0.056683 
      7       19.690000       0.056683 
      7       19.720000       0.053969 
      7       19.680000       0.040956 
      7       19.710000       -0.012337 
      7       19.690000       -0.012337 
      7       19.720000       -0.012337 
      7       19.690000       -0.012337 
      7       19.700000       -0.012337 
      7       19.750000       -0.012337 
      7       19.610000       -0.043732 
      7       19.670000       0.003320 
      7       19.660000       0.042741 
      8       19.670000       0.040057 
      8       19.630000       0.040057 
      8       19.650000       0.040057 
      8       19.680000       0.040057 
      8       19.710000       0.040057 
      8       19.610000       0.040057 
      8       19.680000       0.040057 
      8       19.630000       0.040057 
      8       19.700000       0.040057 
      8       19.650000       0.040057 
      8       19.710000       0.040057 
      8       19.700000       0.040057 
      8       19.720000       0.040057 
      8       19.740000       0.040057 
      8       19.770000       0.040057 
      9       19.810000       0.040057 
      9       19.830000       0.040057 
      9       19.870000       0.040057 
      9       19.920000       0.040057 
      9       19.960000       0.040057 
      9       20.050000       0.040057 
      9       20.080000       0.040057 
      9       20.120000       0.040057 
      9       20.200000       -0.012364 
      9       20.230000       -0.043732 
      9       20.380000       -0.043732 
      9       20.340000       -0.043732 
      9       20.440000       -0.043732 
      9       20.400000       -0.043732 
      9       20.530000       -0.043732 
      10       20.390000       0.003360 
      10       20.490000       0.044057 
      10       20.420000       0.044057 
      10       20.420000       0.044057 
      10       20.410000       0.044057 
      10       20.380000       0.044057 
      10       20.440000       0.044057 
      10       20.370000       0.055824 
      10       20.340000       0.055258 
      10       20.370000       0.055258 
      10       20.360000       0.055258 
      10       20.310000       0.055258 
      10       20.160000       0.055258 
      10       20.230000       0.056723 
      10       20.130000       0.055285 
      10       20.010000       0.056723 
      11       19.980000       0.055285 
      11       19.830000       0.056723 
      11       19.790000       0.055285 
      11       19.790000       0.056723 
      11       19.810000       0.055285 
      11       19.800000       0.055285 
      11       19.820000       0.055285 
      11       19.790000       0.056723 
      11       19.830000       0.055285 
      11       19.810000       0.055285 
      11       19.870000       0.055285 
      11       19.790000       0.056723 
      11       19.860000       0.055285 
      11       19.790000       0.055285 
      11       19.890000       0.055285 
      12       19.790000       0.055285 
      12       19.800000       0.056723 
      12       19.860000       0.055285 
      12       19.730000       0.055285 
      12       19.760000       0.055285 
      12       19.790000       0.056723 
      12       19.800000       0.055285 
      12       19.760000       0.055285 
      12       19.810000       0.056723 
      12       19.800000       0.055285 
      12       19.820000       0.055285 
      12       19.840000       0.055285 
      12       19.730000       0.055285 
      12       19.880000       0.055285 
      12       19.820000       0.055285 
      13       19.830000       0.056723 
      13       19.920000       0.056723 
      13       19.950000       0.055285 
      13       19.970000       0.055285 
      13       20.040000       0.055285 
      13       20.100000       0.055285 
      13       20.210000       0.055285 
      13       20.220000       0.055285 
      13       20.260000       0.055285 
      13       20.200000       0.056723 
      13       20.180000       0.055285 
      13       20.190000       0.055285 
      13       20.140000       0.056723 
      13       20.180000       0.055285 
      13       20.210000       0.055285 
      14       20.170000       0.056723 
      14       20.200000       0.055285 
      14       20.210000       0.055285 
      14       20.210000       0.055285 
      14       20.250000       0.056723 
      14       20.220000       0.056723 
      14       20.250000       0.055285 
      14       20.200000       0.055285 
      14       20.140000       0.055285 
      14       20.150000       0.055285 
      14       20.170000       0.056723 
      14       20.250000       0.055285 
      14       20.170000       0.056723 
      14       20.190000       0.055285 
      14       20.140000       0.055285 
      15       20.110000       0.056723 
      15       19.970000       0.055285 
      15       20.030000       0.055285 
      15       19.900000       0.055285 
      15       19.860000       0.055285 
      15       19.780000       0.055285 
      15       19.810000       0.055285 
      15       19.780000       0.055285 
      15       19.720000       0.055285 
      15       19.770000       0.055285 
      15       19.800000       0.055285 
      15       19.820000       0.055285 
      15       19.760000       0.055285 
      15       19.730000       0.056723 
      15       19.850000       0.055285 
      16       19.800000       0.055285 
      16       19.770000       0.055285 
      16       19.740000       0.056723 
      16       19.820000       0.055285 
      16       19.770000       0.056156 
      16       19.850000       0.054171 
      16       19.840000       0.054171 
      16       19.810000       0.054171 
      16       19.750000       0.054171 
      16       19.820000       0.055053 
      16       19.880000       0.053078 
      16       19.880000       0.053078 
      16       19.860000       0.053078 
      16       19.930000       0.053972 
      16       20.020000       0.052008 
      16       20.060000       0.052008 
      17       20.080000       0.052008 
      17       20.200000       0.052008 
      17       20.090000       0.052008 
      17       20.170000       0.052912 
      17       20.180000       0.050959 
      17       20.180000       0.051873 
      17       20.160000       0.049930 
      17       20.160000       0.050855 
      17       20.120000       0.048923 
      17       20.180000       0.048923 
      17       20.150000       0.048923 
      17       20.110000       0.049858 
      17       20.090000       0.047961 
      17       20.150000       0.047961 
      17       20.190000       0.047961 
      17       20.120000       0.047961 
      18       20.140000       0.047961 
      18       20.130000       0.047961 
      18       20.140000       0.047961 
      18       20.090000       0.047961 
      18       20.120000       0.049757 
      18       20.100000       0.057648 
      18       20.120000       0.095715 
      18       20.140000       0.124415 
      18       20.150000       0.093514 
      18       20.090000       0.093514 
      18       20.150000       0.053922 
      18       20.150000       0.044568 
      18       20.050000       0.036941 
      18       20.120000       0.036941 
      19       20.140000       0.036941 
      19       20.070000       0.036941 
      19       20.150000       0.036941 
      19       20.070000       0.036941 
      19       20.140000       0.036941 
      19       20.090000       0.019360 
      19       20.020000       0.002201 
      19       20.000000       0.002201 
      19       20.020000       0.019144 
      19       20.000000       0.036138 
      19       20.010000       0.042067 
      19       20.070000       0.039372 
      19       20.060000       0.039372 
      19       20.070000       0.025696 
      19       19.950000       -0.031815 
      20       19.910000       -0.076693 
      20       19.830000       -0.076693 
      20       19.850000       -0.076693 
      20       19.800000       -0.076693 
      20       19.850000       -0.076693 
      20       19.810000       -0.076693 
      20       19.770000       -0.076693 
      20       19.870000       -0.076693 
      20       19.790000       -0.076693 
      20       19.810000       -0.076693 
      20       19.840000       -0.076693 
      20       19.800000       -0.076693 
      20       19.810000       -0.030730 
      20       19.810000       0.026832 
      20       19.870000       0.026832 
      20       19.810000       0.026832 
      21       19.860000       0.026832 
      21       19.730000       0.026832 
      21       19.790000       0.039858 
      21       19.820000       0.042160 
      21       19.790000       0.042160 
      21       19.850000       0.040354 
      21       19.830000       0.040354 
      21       19.940000       0.041349 
      21       19.900000       0.038673 
      21       20.040000       0.038673 
      21       20.050000       0.038673 
      21       20.030000       0.030310 
      21       20.110000       -0.004143 
      21       20.160000       -0.004143 
      21       20.120000       -0.004143 
      22       20.140000       -0.004143 
      22       20.130000       -0.004143 
      22       20.060000       -0.004143 
      22       20.140000       -0.004143 
      22       20.130000       -0.004143 
      22       20.070000       -0.004143 
      22       20.050000       -0.004143 
      22       20.140000       -0.019642 
      22       20.100000       -0.019642 
      22       20.120000       -0.019642 
      22       20.140000       0.011635 
      22       20.070000       0.011635 
      22       20.090000       0.033198 
      22       20.030000       0.039609 
      22       20.090000       0.039609 
      23       20.030000       0.038228 
      23       20.140000       0.039283 
      23       20.070000       0.037466 
      23       20.040000       0.038489 
      23       20.090000       0.038489 
      23       20.100000       0.038489 
      23       20.090000       0.038489 
      23       20.020000       0.038489 
      23       20.030000       0.038489 
      23       20.030000       0.038489 
      23       20.090000       0.038489 
      23       20.120000       0.035842 
      23       20.080000       0.035842 
      23       20.070000       0.027507 
      23       20.060000       0.027507 
      23       20.060000       -0.006918 
      24       20.040000       -0.022389 
      24       20.100000       -0.022389 
      24       20.110000       -0.022389 
      24       20.060000       -0.022389 
      24       20.090000       0.008915 
      24       20.100000       0.030506 
      24       20.060000       0.030506 
      24       20.030000       0.036944 
      24       20.040000       0.035589 
      24       20.010000       0.035589 
      24       20.070000       0.035589 
      24       20.040000       0.035589 
      24       20.040000       0.035589 
      24       20.080000       0.035589 
      24       20.080000       0.035589 
      25       20.070000       0.035589 
      25       20.030000       0.035589 
      25       20.030000       0.035589 
      25       19.980000       0.036670 
      25       19.990000       0.034880 
      25       19.880000       0.034880 
      25       19.930000       0.035955 
      25       19.910000       0.034171 
      25       19.870000       0.035254 
      25       19.900000       0.033477 
      25       19.860000       0.033477 
      25       19.930000       0.034566 
      25       19.900000       0.032797 
      25       19.890000       0.032797 
      25       19.880000       0.033893 
      26       19.890000       0.032130 
      26       19.880000       0.032130 
      26       19.890000       0.032130 
      26       19.810000       0.032130 
      26       19.930000       0.032130 
      26       19.870000       0.032130 
      26       19.840000       0.032130 
      26       19.920000       0.032130 
      26       19.900000       0.032130 
      26       19.920000       0.032130 
      26       19.870000       0.032130 
      26       19.930000       0.033232 
      26       19.870000       0.031476 
      26       19.870000       0.031476 
      26       19.890000       0.031476 
      27       19.890000       0.031476 
      27       19.930000       0.031476 
      27       19.840000       0.031476 
      27       19.860000       0.032585 
      27       19.860000       0.030836 
      27       19.880000       0.030836 
      27       19.920000       0.030836 
      27       19.900000       0.031951 
      27       19.860000       0.030208 
      27       19.860000       0.030208 
      27       19.930000       0.030208 
      27       19.930000       0.031330 
      27       20.020000       0.031330 
      27       19.940000       0.031330 
      27       20.000000       0.029592 
      28       20.040000       0.029592 
      28       20.080000       0.029592 
      28       20.140000       0.030720 
      28       20.070000       0.028989 
      28       20.070000       0.028989 
      28       20.000000       0.028989 
      28       20.040000       0.028989 
      28       20.050000       0.030123 
      28       20.010000       0.030123 
      28       20.020000       0.028398 
      28       20.020000       0.028398 
      28       20.030000       0.028398 
      28       20.010000       0.029538 
      28       20.010000       0.027819 
      28       20.040000       0.028965 
      28       20.010000       0.027251 
      29       20.000000       0.027251 
      29       20.010000       0.027251 
      29       20.040000       0.027251 
      29       19.970000       0.027251 
      29       19.980000       0.027251 
      29       20.030000       0.028402 
      29       20.070000       0.026694 
      29       20.010000       0.027851 
      29       19.960000       0.027851 
      29       20.060000       0.027851 
      29       19.980000       0.026149 
      29       19.990000       0.026149 
      29       20.020000       0.026149 
      29       20.020000       0.026149 
      29       20.010000       0.026149 
      30       19.980000       0.026149 
      30       19.990000       0.027311 
      30       19.930000       0.025614 
      30       19.990000       0.025614 
      30       20.030000       0.025614 
      30       20.010000       0.025614 
      30       20.030000       0.026782 
      30       19.980000       0.025077 
      30       20.030000       0.025077 
      30       19.950000       0.025077 
      30       20.050000       0.025077 
      30       19.990000       0.025077 
      30       19.950000       0.025077 
      30       20.020000       0.025077 
      30       20.030000       0.025077 
      30       20.000000       0.025077 
      31       19.940000       0.025077 
      31       20.020000       0.025077 
      31       20.000000       0.025077 
      31       20.020000       0.025077 
      31       20.020000       0.025077 
      31       19.960000       0.025811 
      31       19.980000       0.018784 
      31       20.050000       -0.003921 
      31       20.010000       -0.044363 
      31       20.030000       -0.061105 
      31       20.020000       -0.043308 
      31       20.030000       -0.043308 
      31       20.030000       -0.043308 
      31       20.030000       -0.043308 
      31       20.060000       -0.002394 
      32       19.990000       -0.002394 
      32       19.970000       -0.002394 
      32       20.020000       0.020147 
      32       20.000000       0.020147 
      32       20.060000       0.020147 
      32       20.040000       0.020147 
      32       20.010000       0.020147 
      32       20.020000       0.020147 
      32       20.080000       0.020147 
      32       20.050000       0.020147 
      32       19.990000       0.026715 
      32       19.990000       0.025462 
      32       20.040000       0.025462 
      32       20.010000       0.025462 
      32       19.980000       0.025462 
      33       20.000000       0.025462 
      33       20.030000       0.025462 
      33       19.960000       0.025462 
      33       19.980000       0.025462 
      33       19.990000       0.026645 
      33       20.010000       0.024955 
      33       19.980000       0.026129 
      33       20.000000       0.024444 
      33       20.010000       0.024444 
      33       19.960000       0.025637 
      33       20.090000       0.024382 
      33       20.020000       0.030468 
      33       20.050000       0.030468 
      33       20.010000       0.030468 
      33       19.930000       0.030468 
      33       20.040000       0.030468 
      34       20.010000       0.030468 
      34       20.050000       0.030468 
      34       20.050000       0.030468 
      34       19.890000       0.030468 
      34       19.990000       0.030468 
      34       19.910000       0.030468 
      34       20.030000       0.030468 
      34       19.990000       0.030468 
      34       20.050000       0.047350 
      34       19.960000       0.063840 
      34       19.970000       0.063840 
      34       19.970000       0.046238 
      34       20.010000       0.028589 
      34       20.030000       0.021973 
      34       19.950000       0.022752 
      35       19.990000       0.022752 
      35       19.950000       0.022752 
      35       20.050000       0.022752 
      35       19.850000       0.022752 
      35       20.120000       0.022752 
      35       19.970000       0.022752 
      35       20.050000       0.022752 
      35       19.950000       0.022752 
      35       20.070000       0.022752 
      35       19.970000       0.021087 
      35       20.010000       0.022300 
      35       20.040000       0.022300 
      35       19.930000       0.022300 
      35       20.100000       0.022300 
      35       19.930000       0.022300 
      36       20.000000       0.022300 
      36       19.990000       0.020653 
      36       20.110000       0.021884 
      36       19.950000       0.021884 
      36       20.000000       0.021884 
      36       19.980000       0.020680 
      36       19.950000       0.027216 
      36       20.080000       0.048624 
      36       19.900000       0.079218 
      36       20.070000       0.079218 
      36       20.090000       0.079218 
      36       19.980000       0.062885 
      36       19.970000       0.028106 
      36       19.940000       0.028106 
      36       20.090000       0.028106 
      37       20.010000       0.019849 
      37       19.960000       0.019849 
      37       19.930000       0.017389 
      37       20.050000       0.017389 
      37       19.960000       0.017389 
      37       20.010000       0.017389 
      37       19.960000       0.017389 
      37       20.020000       0.017389 
      37       19.970000       0.017389 
      37       20.010000       0.017389 
      37       20.000000       0.017389 
      37       19.980000       0.017389 
      37       20.040000       0.017389 
      37       20.020000       0.017389 
      37       20.080000       0.017389 
      38       19.960000       0.017389 
      38       20.030000       0.017389 
      38       20.010000       0.017389 
      38       20.020000       0.018613 
      38       20.000000       0.018613 
      38       19.990000       0.017002 
      38       19.950000       0.017002 
      38       19.990000       0.017002 
      38       20.040000       0.017002 
      38       19.960000       0.017002 
      38       20.020000       0.017002 
      38       20.020000       0.018256 
      38       19.960000       0.018256 
      38       20.020000       0.018256 
      38       20.040000       0.018256 
      39       20.030000       0.016650 
      39       20.010000       0.016650 
      39       19.980000       0.016650 
      39       19.970000       0.017907 
      39       20.030000       0.016304 
      39       19.970000       0.016304 
      39       19.970000       0.017565 
      39       20.050000       0.015992 
      39       19.980000       0.015992 
      39       19.990000       0.015992 
      39       20.010000       0.015992 
      39       19.980000       0.018107 
      39       20.000000       0.026315 
      39       19.950000       0.026315 
      39       20.000000       0.026315 
      39       20.010000       0.026315 
      40       20.000000       0.026315 
      40       20.040000       0.026315 
      40       19.980000       0.064695 
      40       20.000000       0.093705 
      40       20.020000       0.093705 
      40       20.010000       0.063111 
      40       20.000000       0.023836 
      40       20.010000       0.023836 
      40       19.970000       0.023836 
      40       20.040000       0.023836 
      40       20.020000       0.023836 
      40       19.930000       0.023836 
      40       19.960000       0.023836 
      40       20.000000       0.023836 
      40       20.040000       0.023836 
      41       19.960000       0.023836 
      41       20.020000       0.015209 
      41       20.120000       0.012782 
      41       19.980000       0.012782 
      41       19.980000       0.012782 
      41       19.960000       0.012782 
      41       20.050000       0.012782 
      41       19.940000       0.012782 
      41       20.030000       0.012782 
      41       19.920000       0.012782 
      41       20.050000       0.012782 
      41       19.900000       0.014052 
      41       19.970000       0.012487 
      41       19.990000       0.013786 
      41       20.010000       0.012225 
      41       20.060000       0.012225 
      42       20.000000       0.013526 
      42       19.920000       0.011967 
      42       19.950000       0.011967 
      42       19.960000       0.011967 
      42       19.990000       0.011967 
      42       19.990000       0.011967 
      42       19.960000       0.013271 
      42       19.980000       0.011715 
      42       19.990000       0.013022 
      42       19.960000       0.011467 
      42       19.980000       0.011467 
      42       20.010000       0.011467 
      42       20.030000       0.011467 
      42       19.970000       0.011467 
      42       20.010000       0.012777 
      43       20.010000       0.011225 
      43       20.000000       0.012537 
      43       20.000000       0.010987 
      43       19.960000       0.010987 
      43       19.930000       0.010987 
      43       19.950000       0.010987 
      43       20.030000       0.010987 
      43       19.930000       0.010987 
      43       19.940000       0.010987 
      43       20.000000       0.010987 
      43       19.960000       0.010987 
      43       19.940000       0.010987 
      43       20.020000       0.010987 
      43       20.030000       0.010987 
      43       19.980000       0.010987 
      44       20.000000       0.012301 
      44       19.930000       0.010754 
      44       19.890000       0.012071 
      44       19.950000       0.010526 
      44       20.050000       0.010526 
      44       19.890000       0.010526 
      44       19.920000       0.011845 
      44       19.960000       0.010302 
      44       20.020000       0.011623 
      44       20.080000       0.010083 
      44       20.020000       0.010083 
      44       20.100000       0.011406 
      44       20.030000       0.009868 
      44       20.050000       0.011194 
      44       20.030000       0.009658 
      45       20.020000       0.009658 
      45       20.050000       0.009658 
      45       20.050000       0.010985 
      45       20.100000       0.010985 
      45       20.070000       0.009451 
      45       20.050000       0.009451 
      45       19.980000       0.009451 
      45       19.970000       0.009451 
      45       20.100000       0.010781 
      45       20.040000       0.010781 
      45       20.070000       0.009249 
      45       20.070000       0.009249 
      45       20.030000       0.010580 
      45       20.090000       0.009051 
      45       20.020000       0.009051 
      46       19.980000       0.009051 
      46       20.100000       0.009051 
      46       19.990000       0.009051 
      46       20.030000       0.009051 
      46       20.050000       0.009051 
      46       20.030000       0.009051 
      46       19.980000       0.010384 
      46       19.990000       0.008856 
      46       20.020000       0.008856 
      46       20.030000       0.008856 
      46       20.070000       0.008856 
      46       20.060000       0.010192 
      46       20.070000       0.008666 
      46       20.050000       0.008666 
      46       20.010000       0.008666 
      47       20.040000       0.008666 
      47       19.990000       0.010003 
      47       20.040000       0.008479 
      47       20.090000       0.009818 
      47       20.040000       0.008296 
      47       20.060000       0.008296 
      47       20.100000       0.008296 
      47       19.960000       0.008296 
      47       20.010000       0.008296 
      47       20.020000       0.008296 
      47       20.000000       0.008296 
      47       20.030000       0.008296 
      47       20.000000       0.008296 
      47       20.060000       0.008296 
      47       20.110000       0.009637 
      48       20.020000       0.009637 
      48       20.090000       0.008117 
      48       20.030000       0.009460 
      48       20.070000       0.009460 
      48       20.030000       0.007941 
      48       20.050000       0.007941 
      48       20.000000       0.007941 
      48       20.010000       0.007941 
      48       20.000000       0.009286 
      48       20.040000       0.007769 
      48       20.020000       0.007769 
      48       20.000000       0.007769 
      48       20.030000       0.007769 
      48       20.000000       0.007769 
      48       20.080000       0.007769 
      49       20.070000       0.007769 
      49       20.040000       0.007769 
      49       20.050000       0.007769 
      49       20.050000       0.009115 
      49       20.040000       0.009115 
      49       20.020000       0.007600 
      49       20.030000       0.008948 
      49       20.010000       0.007434 
      49       20.010000       0.007434 
      49       19.980000       0.007434 
      49       20.100000       0.007434 
      49       19.960000       0.007434 
      49       20.030000       0.008784 
      49       20.070000       0.008784 
      49       20.010000       0.007272 
      49       20.070000       0.008624 
      50       20.050000       0.007113 
      50       20.110000       0.008466 
      50       20.000000       0.006957 
      50       20.090000       0.006957 
      50       20.000000       0.008312 
      50       20.030000       0.006792 
      50       20.070000       0.006792 
      50       20.050000       0.006792 
      50       20.080000       0.006792 
      50       20.040000       0.006792 
      50       20.080000       0.006792 
      50       20.020000       0.007722 
      50       20.050000       0.001315 
      50       20.020000       0.001315 
      50       20.010000       -0.015885 
      51       19.980000       -0.032690 
      51       20.110000       -0.032690 
      51       20.060000       -0.032690 
      51       20.050000       -0.032690 
      51       20.010000       -0.032690 
      51       19.930000       -0.032690 
      51       19.980000       -0.032690 
      51       20.000000       -0.032690 
      51       19.980000       -0.015399 
      51       19.940000       0.001915 
      51       19.960000       0.001915 
      51       19.910000       0.001915 
      51       19.940000       0.001915 
      51       20.010000       0.001915 
      51       19.960000       0.001915 
      51       19.950000       0.007375 
      52       19.960000       0.007375 
      52       19.980000       -0.003510 
      52       19.960000       -0.003510 
      52       19.950000       -0.003510 
      52       19.950000       -0.039258 
      52       19.980000       -0.071370 
      52       19.990000       -0.071370 
      52       19.940000       -0.071370 
      52       19.940000       -0.038152 
      52       19.970000       -0.001987 
      52       20.000000       -0.001987 
      52       19.990000       0.008844 
      52       19.960000       0.003276 
      52       20.030000       0.003276 
      52       19.950000       0.003276 
      53       19.930000       -0.013916 
      53       19.980000       -0.030741 
      53       20.020000       -0.013470 
      53       19.960000       0.003851 
      53       20.000000       0.003851 
      53       20.020000       0.010143 
      53       19.980000       0.009043 
      53       20.020000       0.009043 
      53       19.950000       0.010390 
      53       19.990000       0.008862 
      53       20.010000       0.010197 
      53       20.010000       0.008671 
      53       19.970000       0.010009 
      53       20.030000       0.008485 
      53       19.990000       0.008485 
      53       19.970000       0.009824 
      54       19.950000       0.008301 
      54       20.050000       0.008301 
      54       19.880000       0.009642 
      54       19.980000       0.008122 
      54       19.960000       0.009465 
      54       19.970000       0.007946 
      54       19.990000       0.007946 
      54       19.940000       0.009291 
      54       19.960000       0.007800 
      54       19.990000       0.007800 
      54       20.040000       0.007800 
      54       19.910000       0.007800 
      54       19.950000       0.009997 
      54       19.960000       0.018286 
      54       19.950000       0.056747 
      55       19.970000       0.085836 
      55       19.950000       0.085836 
      55       19.950000       0.055321 
      55       19.970000       0.016124 
      55       19.980000       0.007574 
      55       19.930000       0.007574 
      55       20.010000       0.007574 
      55       20.010000       0.005223 
      55       19.990000       0.005223 
      55       19.940000       0.005223 
      55       19.950000       0.006569 
      55       19.960000       0.005079 
      55       19.970000       0.005079 
      55       19.980000       0.005079 
      55       20.000000       0.005079 
      56       19.970000       0.005079 
      56       20.020000       0.006452 
      56       20.010000       0.004964 
      56       19.970000       0.004964 
      56       19.950000       0.006338 
      56       19.940000       0.004851 
      56       19.970000       0.004851 
      56       19.970000       0.004851 
      56       20.010000       0.004851 
      56       20.010000       0.004851 
      56       20.000000       0.004851 
      56       20.020000       0.006226 
      56       19.920000       0.004727 
      56       20.000000       0.005678 
      56       19.990000       0.005678 
      57       19.980000       -0.000709 
      57       19.890000       -0.017888 
      57       19.970000       -0.017888 
      57       19.950000       -0.017888 
      57       19.970000       -0.017888 
      57       19.980000       -0.017888 
      57       20.020000       -0.034647 
      57       20.010000       -0.016485 
      57       19.980000       -0.016485 
      57       19.980000       -0.016485 
      57       19.980000       -0.016485 
      57       19.990000       -0.016485 
      57       19.980000       -0.016485 
      57       20.020000       -0.016485 
      57       19.970000       -0.016485 
      58       19.970000       -0.016485 
      58       19.930000       0.010665 
      58       20.020000       0.010665 
      58       19.970000       0.053683 
      58       20.020000       0.078322 
      58       20.010000       0.078322 
      58       20.000000       0.029285 
      58       19.940000       0.029285 
      58       19.810000       -0.025191 
      58       19.560000       -0.025191 
      58       19.970000       -0.025191 
      58       19.880000       -0.025191 
      58       19.930000       -0.025191 
      58       19.990000       -0.025191 
      58       20.110000       -0.025191 
      58       20.010000       -0.025191 
      59       19.990000       -0.025191 
      59       19.970000       -0.025191 
      59       20.120000       -0.025191 
      59       20.030000       -0.025191 
      59       20.030000       -0.025191 
      59       20.070000       -0.025191 
      59       20.070000       -0.025191 
      59       20.400000       -0.025191 
      59       19.950000       -0.017788 
      59       20.020000       -0.001276 
      59       20.020000       -0.001276 
      59       19.940000       -0.001276 
      59       19.850000       -0.001276 
      59       19.820000       -0.001276 
      59       19.720000       -0.001276 
      60       19.950000       0.005015 
      60       20.030000       0.003128 
      60       19.980000       0.003128 
      60       19.870000       0.003128 
      60       19.940000       0.003128 
      60       19.950000       0.003128 
      60       20.090000       -0.004866 
      60       19.940000       -0.004866 
      60       20.060000       -0.038967 
      60       20.200000       -0.038967 
      60       20.050000       -0.038967 
      60       20.150000       -0.038967 
      60       20.100000       -0.038967 
      60       20.090000       -0.038967 
      60       20.090000       -0.038967 
      61       20.130000       -0.038967 
