

 time    ||    gripping force   ||   raspberry measurement 

      0       0.110000       -795.046667 
      0       0.870000       -795.046667 
      0       0.370000       -795.046667 
      0       0.500000       -795.046667 
      0       0.570000       -795.046667 
      0       0.190000       -795.046667 
      0       0.120000       -795.046667 
      1       0.270000       -787.096200 
      1       0.310000       -779.225238 
      1       0.160000       -771.432981 
      1       0.330000       -763.717482 
      1       17.910000       -755.975109 
      1       47.420000       -752.456235 
      1       70.780000       -709.587837 
      2       85.520000       -517.468051 
      2       98.140000       -200.727108 
      2       95.640000       -8.623019 
      2       91.900000       34.242277 
      2       91.580000       37.759297 
      2       91.360000       37.866983 
      2       91.080000       37.866725 
      2       90.980000       37.868168 
      2       90.840000       37.866758 
      3       90.700000       37.869176 
      3       90.670000       37.881666 
      3       90.510000       37.970233 
      3       90.310000       38.230613 
      3       90.230000       38.632315 
      3       90.090000       39.018736 
      3       90.130000       39.397100 
      3       90.030000       39.688046 
      3       89.960000       39.794815 
      3       89.810000       39.812010 
      3       89.800000       39.791329 
      4       89.330000       39.773594 
      4       88.300000       39.767630 
      4       87.600000       39.774037 
      4       87.520000       39.796782 
      4       87.550000       39.838088 
      4       87.530000       39.859987 
      4       87.420000       39.856886 
      4       87.390000       39.817435 
      4       87.340000       39.777554 
      4       86.660000       39.769028 
      4       86.240000       39.765897 
      4       84.900000       39.758257 
      4       84.570000       39.729160 
      4       83.540000       39.737633 
      5       83.710000       39.808036 
      5       83.610000       39.843360 
      5       83.780000       39.808022 
      5       83.590000       39.737150 
      5       83.720000       39.722431 
      5       83.690000       39.717822 
      5       83.650000       39.652055 
      5       83.570000       39.608064 
      5       83.480000       39.616107 
      5       82.810000       39.630475 
      5       82.360000       39.675268 
      5       81.790000       39.663102 
      6       82.040000       39.571782 
      6       81.830000       39.559173 
      6       81.750000       39.598567 
      6       81.820000       39.588738 
      6       81.660000       39.556887 
      6       81.040000       39.488725 
      6       80.700000       39.418446 
      6       80.470000       39.424191 
      6       80.390000       39.457773 
      6       80.340000       39.464083 
      6       80.340000       39.446491 
      6       80.260000       39.368168 
      7       80.330000       39.286954 
      7       80.220000       39.271783 
      7       79.460000       39.269454 
      7       79.470000       39.278870 
      7       79.390000       39.246616 
      7       79.330000       39.221033 
      7       79.390000       39.212564 
      7       79.280000       39.194608 
      7       79.150000       39.260071 
      7       78.720000       39.300728 
      7       78.490000       39.292793 
      7       78.380000       39.262618 
      7       78.410000       39.147528 
      7       78.340000       39.048915 
      7       78.350000       39.045731 
      8       78.350000       39.060511 
      8       78.310000       39.057357 
      8       78.270000       39.023291 
      8       78.260000       39.007595 
      8       78.220000       39.038612 
      8       78.060000       39.057274 
      8       77.060000       39.065125 
      8       75.730000       39.124093 
      8       75.710000       39.210263 
      8       75.760000       39.198083 
      8       75.760000       39.196837 
      8       75.770000       39.193141 
      8       75.820000       39.125572 
      9       75.700000       39.080726 
      9       75.750000       39.078441 
      9       75.730000       39.116603 
      9       75.780000       39.146975 
      9       75.720000       39.122391 
      9       75.840000       39.106707 
      9       75.750000       39.128620 
      9       75.650000       39.117019 
      9       74.900000       39.101295 
      9       74.820000       39.108949 
      9       74.830000       39.091396 
      9       74.830000       39.078940 
      10       74.800000       39.090484 
      10       74.810000       39.097277 
      10       74.840000       39.042532 
      10       74.830000       38.993752 
      10       74.430000       39.017906 
      10       74.340000       39.047015 
      10       74.320000       39.022392 
      11       74.370000       39.006694 
      11       74.400000       39.028203 
      11       74.310000       39.012506 
      11       74.300000       38.987923 
      11       74.260000       39.018308 
      11       74.310000       39.056913 
      11       74.310000       39.060027 
      11       74.160000       39.039405 
      11       74.090000       39.012563 
      11       73.620000       39.042102 
      12       73.540000       39.073470 
      12       73.370000       39.049273 
      12       73.310000       39.038519 
      12       73.200000       39.012506 
      12       73.200000       38.977581 
      12       72.940000       38.974870 
      12       72.590000       38.995896 
      12       72.600000       39.026417 
      12       72.520000       39.001225 
      12       72.570000       38.933673 
      12       72.450000       38.908481 
      12       72.620000       38.939028 
      13       72.500000       38.960901 
      13       72.560000       38.967712 
      13       72.450000       38.966716 
      13       72.430000       38.968168 
      13       72.430000       38.966730 
      13       72.100000       38.968168 
      13       72.170000       38.966730 
      13       71.950000       38.968182 
      13       71.970000       38.967186 
      13       71.940000       38.973997 
      13       71.910000       38.995896 
      13       71.900000       39.027290 
      14       72.160000       39.011593 
      14       71.810000       38.977098 
      14       71.860000       38.969041 
      14       71.880000       38.966783 
      14       71.900000       38.969041 
      14       71.720000       38.977071 
      14       71.710000       39.010707 
      14       71.760000       39.016505 
      14       71.570000       38.947958 
      14       71.620000       38.900038 
      15       71.720000       38.947958 
      15       71.320000       39.016505 
      15       71.660000       39.010707 
      15       71.360000       38.977071 
      15       71.340000       38.969041 
      15       71.590000       38.966783 
      15       71.260000       38.969055 
      15       71.400000       38.977528 
      15       71.410000       39.016562 
      16       71.370000       39.046518 
      16       71.430000       39.016562 
      16       71.380000       38.977528 
      16       71.310000       38.969068 
      16       71.340000       38.967213 
      16       71.320000       38.973997 
      16       71.330000       38.995896 
      16       71.270000       39.027290 
      17       71.200000       39.011593 
      17       71.210000       38.977098 
      17       71.230000       38.969041 
      17       71.210000       38.966743 
      17       71.150000       38.967712 
      17       71.160000       38.960901 
      17       71.210000       38.939002 
      17       71.150000       38.907621 
      17       71.120000       38.923748 
      17       71.180000       38.963199 
      18       71.130000       38.990040 
      18       71.090000       39.007592 
      18       71.200000       38.985527 
      18       71.160000       38.949370 
      18       71.260000       38.927279 
      18       71.140000       38.943984 
      19       71.120000       38.961331 
      19       71.120000       38.967725 
      19       71.090000       38.966716 
      19       71.130000       38.968181 
      19       71.070000       38.967173 
      19       71.090000       38.973567 
      19       71.140000       38.990927 
      19       71.040000       39.008062 
      20       71.070000       38.990927 
      20       71.150000       38.973567 
      20       71.070000       38.967173 
      20       71.140000       38.968195 
      20       71.100000       38.967173 
      20       71.050000       38.973567 
      20       71.140000       38.990927 
      20       71.070000       39.008062 
      21       71.110000       38.990927 
      21       71.070000       38.973567 
      21       71.060000       38.967173 
      21       71.010000       38.968181 
      21       71.120000       38.966729 
      21       71.060000       38.968141 
      21       71.040000       38.965843 
      21       71.130000       38.957383 
      22       71.070000       38.918779 
      22       71.040000       38.893779 
      22       71.010000       38.942533 
      22       71.040000       38.997278 
      22       71.110000       38.990497 
      22       71.010000       38.979369 
      22       71.030000       38.996339 
      22       71.100000       39.027304 
      22       71.020000       39.011593 
      23       71.030000       38.977098 
      23       71.040000       38.969041 
      23       71.070000       38.966756 
      23       71.070000       38.968168 
      24       71.060000       38.966730 
      24       71.070000       38.968168 
      24       71.010000       38.966730 
      24       71.030000       38.968168 
      24       70.950000       38.966730 
      24       71.000000       38.968168 
      24       71.020000       38.966730 
      24       71.000000       38.968168 
      24       71.050000       38.966730 
      24       71.030000       38.968168 
      25       70.950000       38.966730 
      25       71.010000       38.968168 
      25       71.200000       38.966716 
      25       70.910000       38.967711 
      25       70.980000       38.960874 
      25       71.050000       38.938116 
      25       70.940000       38.896823 
      25       71.020000       38.875354 
      25       70.990000       38.883411 
      25       71.000000       38.941686 
      25       71.000000       38.998111 
      26       70.970000       39.000408 
      26       70.940000       39.016965 
      26       71.030000       39.027733 
      26       70.920000       38.995896 
      26       71.000000       38.973554 
      26       70.940000       38.961774 
      26       70.930000       38.943541 
      26       70.950000       38.921436 
      27       70.950000       38.919774 
      27       70.960000       38.921436 
      27       70.950000       38.943528 
      27       70.930000       38.961317 
      27       70.980000       38.967725 
      27       71.040000       38.966716 
      27       70.950000       38.968181 
      28       71.030000       38.967186 
      28       70.970000       38.973997 
      28       70.930000       38.995896 
      28       70.870000       39.027290 
      28       70.680000       39.011606 
      28       70.520000       38.977541 
      29       70.480000       38.974440 
      29       70.700000       38.990940 
      29       70.450000       39.007606 
      29       70.560000       38.985071 
      30       70.430000       38.943514 
      30       70.440000       38.897252 
      30       70.470000       38.874924 
      30       70.290000       38.877985 
      30       70.470000       38.916576 
      30       70.550000       38.946545 
      30       70.350000       38.917449 
      31       70.550000       38.888353 
      31       70.530000       38.918335 
      31       70.400000       38.957370 
      31       70.430000       38.965843 
      31       70.430000       38.968141 
      31       70.400000       38.966716 
      31       70.430000       38.967712 
      31       70.480000       38.960914 
      31       70.490000       38.939445 
      32       70.390000       38.913007 
      32       70.450000       38.947502 
      32       70.440000       38.997694 
      32       70.460000       38.990054 
      32       70.500000       38.973540 
      32       70.440000       38.967173 
      32       70.430000       38.968195 
      33       70.420000       38.967173 
      33       70.470000       38.973580 
      33       70.390000       38.991370 
      33       70.450000       39.013461 
      33       70.460000       39.015124 
      33       70.470000       39.013461 
      33       70.410000       38.991370 
      33       70.400000       38.973580 
      34       70.410000       38.967173 
      34       70.320000       38.968181 
      34       70.480000       38.966729 
      34       70.420000       38.968141 
      34       70.400000       38.965856 
      34       70.420000       38.957800 
      34       70.490000       38.923305 
      35       70.440000       38.907634 
      35       70.360000       38.939875 
      35       70.340000       38.971269 
      35       70.420000       39.011137 
      35       70.390000       39.027276 
      35       70.390000       38.995882 
      35       70.440000       38.973541 
      36       70.410000       38.961370 
      36       70.390000       38.939458 
      36       70.410000       38.913007 
      36       70.330000       38.947502 
      36       70.400000       38.997694 
      36       70.380000       38.990054 
      36       70.400000       38.973540 
      36       70.420000       38.967172 
      36       70.390000       38.968155 
      36       70.380000       38.965843 
      37       70.330000       38.957370 
      37       70.370000       38.918335 
      37       70.350000       38.888380 
      37       70.370000       38.918362 
      38       70.390000       38.958243 
      38       70.340000       38.976185 
      38       70.350000       39.010680 
      39       70.410000       39.016492 
      39       70.300000       38.947502 
      39       70.450000       38.894209 
      39       70.280000       38.918792 
      39       70.320000       38.957383 
      39       70.360000       38.965843 
      39       70.300000       38.968141 
      39       70.330000       38.966729 
      39       70.300000       38.968168 
      40       70.330000       38.966730 
      40       70.310000       38.968168 
      40       70.300000       38.966730 
      40       70.360000       38.968168 
      40       70.350000       38.966756 
      40       70.340000       38.969041 
      40       70.340000       38.977098 
      40       70.380000       39.011579 
      40       70.360000       39.026834 
      40       70.350000       38.990067 
      41       70.320000       38.944831 
      41       70.280000       38.908064 
      41       70.260000       38.923318 
      42       70.300000       38.957813 
      42       70.310000       38.966300 
      42       70.270000       38.973540 
      42       70.230000       38.990926 
      42       70.300000       39.008035 
      42       70.270000       38.990040 
      43       70.290000       38.962769 
      43       70.270000       38.918779 
      43       70.290000       38.888393 
      43       70.300000       38.918336 
      43       70.300000       38.957370 
      43       70.260000       38.965843 
      43       70.220000       38.968114 
      43       70.280000       38.965843 
      43       70.310000       38.957370 
      43       70.290000       38.918336 
      44       70.300000       38.888393 
      44       70.250000       38.918779 
      44       70.290000       38.962769 
      44       70.240000       38.990067 
      44       70.310000       39.008909 
      44       70.300000       39.001295 
      44       70.280000       39.017019 
      44       70.290000       39.028606 
      44       70.260000       39.006277 
      45       70.250000       39.017422 
      45       70.250000       39.027747 
      45       70.290000       38.995909 
      46       70.300000       38.973997 
      46       70.190000       38.967186 
      46       70.240000       38.968182 
      46       70.130000       38.966730 
      46       70.020000       38.968168 
      46       69.860000       38.966730 
      46       69.920000       38.968168 
      47       69.910000       38.966730 
      47       69.860000       38.968168 
      47       69.880000       38.966730 
      47       69.800000       38.968168 
      47       69.890000       38.966730 
      47       69.850000       38.968168 
      47       69.770000       38.966729 
      47       69.800000       38.968141 
      47       69.760000       38.965843 
      48       69.820000       38.957383 
      48       69.780000       38.918792 
      48       69.800000       38.894235 
      48       69.750000       38.948388 
      48       69.840000       39.027290 
      48       69.780000       39.059101 
      48       69.770000       39.056860 
      48       69.840000       39.017435 
      48       69.810000       38.977554 
      48       69.810000       38.969055 
      48       69.790000       38.966756 
      49       69.770000       38.968142 
      49       69.890000       38.965843 
      49       69.810000       38.957383 
      49       69.740000       38.918779 
      49       69.860000       38.893779 
      50       69.830000       38.942533 
      50       69.690000       38.997264 
      50       69.840000       38.990040 
      50       69.720000       38.973540 
      50       69.770000       38.967173 
      50       69.810000       38.968181 
      50       69.720000       38.966730 
      50       69.810000       38.968168 
      50       69.660000       38.966730 
      50       69.760000       38.968168 
      50       69.700000       38.966730 
      50       69.790000       38.968168 
      51       69.730000       38.966730 
      51       69.830000       38.968181 
      51       69.760000       38.967173 
      51       69.750000       38.973567 
      51       69.810000       38.990927 
      51       69.800000       39.008063 
      51       69.780000       38.990953 
      52       69.710000       38.974440 
      52       69.850000       38.977541 
      52       69.770000       39.011606 
      52       69.750000       39.027264 
      52       69.750000       38.995009 
      52       69.750000       38.963199 
      52       69.760000       38.918792 
      52       69.700000       38.888406 
      53       69.760000       38.918779 
      53       69.750000       38.962742 
      53       69.770000       38.989154 
      53       69.780000       38.997237 
      53       69.790000       38.942532 
      53       69.710000       38.893779 
      53       69.740000       38.918805 
      53       69.800000       38.958256 
      53       69.760000       38.976212 
      54       69.730000       39.011566 
      54       69.800000       39.027290 
      54       69.690000       38.995896 
      54       69.790000       38.973997 
      55       69.740000       38.967186 
      55       69.790000       38.968182 
      55       69.810000       38.966730 
      55       69.720000       38.968168 
      55       69.760000       38.966756 
      56       69.780000       38.969041 
      56       69.740000       38.977098 
      56       69.800000       39.011579 
      56       69.690000       39.026834 
      57       69.680000       38.990067 
      57       69.740000       38.944831 
      57       69.740000       38.908064 
      57       69.700000       38.923318 
      57       69.740000       38.957800 
      58       69.800000       38.965856 
      58       69.680000       38.968141 
      58       69.860000       38.966729 
      58       69.690000       38.968168 
      58       69.760000       38.966716 
      58       69.760000       38.967712 
      58       69.770000       38.960914 
      59       69.730000       38.939445 
      59       69.720000       38.913020 
      59       69.740000       38.947958 
      59       69.710000       39.003523 
      59       69.730000       39.019220 
      59       69.690000       39.032662 
      59       69.760000       39.012009 
      59       69.730000       38.976225 
      60       69.700000       38.958243 
      60       69.690000       38.918349 
      60       69.740000       38.887923 
      60       69.740000       38.912506 
      60       69.760000       38.928204 
      60       69.770000       38.906735 
      60       69.700000       38.923735 
      60       69.720000       38.963655 
