

 time    ||    gripping force   ||   raspberry measurement 

      0       0.190000       -802.954545 
      0       0.150000       -802.954545 
      0       0.090000       -802.954545 
      0       1.310000       -802.954545 
      0       0.210000       -802.954545 
      0       0.480000       -802.954545 
      0       0.270000       -802.954545 
      0       0.640000       -802.954545 
      0       0.470000       -802.954545 
      0       0.470000       -802.954545 
      0       0.420000       -802.954545 
      0       0.260000       -802.954545 
      0       0.120000       -802.954545 
      0       0.200000       -802.954545 
      0       0.270000       -802.954545 
      0       0.070000       -802.954545 
      1       0.220000       -794.925000 
      1       1.490000       -794.925000 
      1       0.600000       -794.925000 
      1       25.550000       -794.925000 
      1       31.260000       -786.975745 
      1       62.960000       -779.104807 
      1       87.390000       -771.207501 
      1       117.870000       -767.653185 
      1       119.670000       -724.353290 
      1       117.190000       -530.302694 
      1       116.940000       -530.302694 
      1       116.690000       -210.389011 
      1       115.670000       -16.364853 
      1       115.140000       26.948068 
      1       115.130000       26.948068 
      1       114.290000       26.948068 
      1       114.280000       30.519341 
      1       114.310000       30.633054 
      1       113.850000       30.633332 
      1       113.680000       30.637933 
      1       113.740000       30.675765 
      1       113.470000       30.675765 
      1       113.220000       30.675765 
      1       113.180000       30.867615 
      1       113.130000       31.276115 
      1       112.870000       31.817472 
      2       112.800000       32.303462 
      2       112.710000       32.303462 
      2       112.510000       32.303462 
      2       112.470000       32.519053 
      2       112.400000       32.584765 
      2       112.280000       32.613405 
      2       112.220000       32.583973 
      2       112.180000       32.554435 
      2       112.060000       32.579448 
      2       112.010000       32.599255 
      2       111.920000       32.587062 
      2       111.960000       32.585816 
      2       111.810000       32.582133 
      2       111.800000       32.580887 
      2       111.740000       32.568721 
      2       111.570000       32.589387 
      2       111.580000       32.624285 
      2       111.480000       32.631495 
      2       111.360000       32.631495 
      2       111.330000       32.631495 
      2       111.190000       32.623842 
      2       111.190000       32.583974 
      3       111.140000       32.544080 
      3       111.000000       32.535580 
      3       110.620000       32.535580 
      3       109.190000       32.533282 
      3       107.400000       32.534667 
      3       102.620000       32.532382 
      3       96.140000       32.532382 
      3       87.590000       32.532382 
      3       80.860000       32.532382 
      3       74.680000       32.524326 
      3       72.970000       32.489843 
      3       73.070000       32.489843 
      3       73.710000       32.489843 
      3       74.600000       32.474549 
      3       75.310000       32.510014 
      3       75.910000       32.539965 
      4       76.070000       32.515785 
      4       76.230000       32.438712 
      4       76.070000       32.443664 
      4       76.210000       32.476290 
      4       76.550000       32.427039 
      4       76.890000       32.427039 
      4       77.460000       32.427039 
      4       78.170000       32.427039 
      4       78.480000       32.427039 
      4       79.140000       32.423375 
      4       79.230000       32.445685 
      4       79.380000       32.445685 
      4       79.410000       32.445685 
      4       79.420000       32.342137 
      4       79.500000       32.099189 
      5       79.430000       31.822196 
      5       79.420000       31.668887 
      5       79.410000       31.668887 
      5       79.340000       31.668887 
      5       79.470000       31.637448 
      5       79.360000       31.633337 
      5       79.350000       31.634695 
      5       79.420000       31.634695 
      5       79.360000       31.634695 
      5       79.380000       31.633255 
      5       79.330000       31.634694 
      5       79.330000       31.634694 
      5       79.380000       31.634694 
      5       79.380000       31.634694 
      5       79.310000       31.634694 
      6       79.360000       31.634694 
      6       79.350000       31.634694 
      6       79.400000       31.634694 
      6       79.370000       31.634694 
      6       79.320000       31.634694 
      6       79.340000       31.634694 
      6       79.320000       31.634694 
      6       79.330000       31.634694 
      6       79.360000       31.633255 
      6       79.380000       31.634694 
      6       79.360000       31.634694 
      6       79.280000       31.634694 
      6       79.360000       31.634694 
      6       79.300000       31.634694 
      6       79.220000       31.633255 
      7       79.350000       31.633255 
      7       79.280000       31.634694 
      7       79.330000       31.634694 
      7       79.340000       31.633255 
      7       79.290000       31.634694 
      7       79.260000       31.634694 
      7       79.300000       31.634694 
      7       79.340000       31.634694 
      7       79.250000       31.634694 
      7       79.580000       31.634694 
      7       79.820000       31.634694 
      7       79.820000       31.634694 
      7       79.850000       31.634694 
      7       79.810000       31.634694 
      7       79.820000       31.634694 
      8       79.770000       31.634694 
      8       79.840000       31.634694 
      8       79.800000       31.634694 
      8       79.850000       31.634694 
      8       79.790000       31.633255 
      8       79.770000       31.634707 
      8       79.770000       31.633712 
      8       79.780000       31.633712 
      8       79.760000       31.640523 
      8       79.840000       31.640523 
      8       79.770000       31.640523 
      8       79.810000       31.640523 
      8       79.780000       31.640523 
      8       79.850000       31.640523 
      8       79.840000       31.640523 
      9       79.770000       31.640523 
      9       79.790000       31.662422 
      9       79.820000       31.693816 
      9       79.800000       31.693816 
      9       79.770000       31.693816 
      9       79.770000       31.693816 
      9       79.750000       31.693816 
      9       79.780000       31.678119 
      9       79.810000       31.678119 
      9       79.770000       31.643624 
      9       79.740000       31.635567 
      9       79.820000       31.633282 
      9       79.730000       31.633282 
      9       79.780000       31.634694 
      9       79.680000       31.634694 
      10       79.710000       31.633255 
      10       79.770000       31.633255 
      10       79.630000       31.633255 
      10       79.720000       31.633255 
      10       79.720000       31.633255 
      10       79.670000       31.633255 
      10       79.720000       31.633255 
      10       79.730000       31.634694 
      10       79.730000       31.633255 
      10       79.730000       31.633255 
      10       79.700000       31.633255 
      10       79.660000       31.633255 
      10       79.690000       31.633255 
      10       79.670000       31.633255 
      10       79.700000       31.633255 
      10       79.670000       31.633255 
      11       79.650000       31.633255 
      11       79.770000       31.633255 
      11       79.680000       31.634694 
      11       79.660000       31.633255 
      11       79.720000       31.634694 
      11       79.680000       31.633255 
      11       79.660000       31.633255 
      11       79.700000       31.633255 
      11       79.650000       31.633255 
      11       79.720000       31.633255 
      11       79.730000       31.633255 
      11       79.680000       31.633255 
      11       79.680000       31.633255 
      11       79.660000       31.633255 
      11       79.670000       31.633255 
      12       79.730000       31.633255 
      12       79.690000       31.633255 
      12       79.690000       31.633255 
      12       79.640000       31.633255 
      12       79.620000       31.633255 
      12       79.680000       31.633255 
      12       79.660000       31.634707 
      12       79.590000       31.634707 
      12       79.680000       31.633699 
      12       79.670000       31.633699 
      12       79.650000       31.640093 
      12       79.700000       31.657479 
      12       79.670000       31.657479 
      12       79.680000       31.657479 
      12       79.600000       31.657479 
      13       79.740000       31.657479 
      13       79.620000       31.657479 
      13       79.680000       31.657479 
      13       79.680000       31.657479 
      13       79.660000       31.675474 
      13       79.690000       31.668251 
      13       79.650000       31.668251 
      13       79.680000       31.668251 
      13       79.640000       31.688487 
      13       79.590000       31.713487 
      13       79.660000       31.683101 
      13       79.650000       31.644054 
      13       79.660000       31.644054 
      13       79.600000       31.644054 
      13       79.650000       31.644054 
      14       79.610000       31.644054 
      14       79.680000       31.644054 
      14       79.460000       31.644054 
      14       79.610000       31.644054 
      14       79.700000       31.644054 
      14       79.580000       31.644054 
      14       79.620000       31.635580 
      14       79.600000       31.633282 
      14       79.720000       31.633282 
      14       79.560000       31.633282 
      14       79.750000       31.634694 
      14       79.550000       31.634694 
      14       79.590000       31.634694 
      14       79.630000       31.633255 
      14       79.560000       31.633255 
      15       79.680000       31.633255 
      15       79.650000       31.633255 
      15       79.650000       31.633255 
      15       79.660000       31.633255 
      15       79.600000       31.634694 
      15       79.630000       31.633255 
      15       79.630000       31.633255 
      15       79.640000       31.633255 
      15       79.680000       31.633255 
      15       79.560000       31.634694 
      15       79.700000       31.633282 
      15       79.660000       31.633282 
      15       79.600000       31.633282 
      15       79.650000       31.633282 
      15       79.590000       31.633282 
      15       79.630000       31.635580 
      16       79.630000       31.644054 
      16       79.610000       31.644054 
      16       79.640000       31.644054 
      16       79.610000       31.644054 
      16       79.600000       31.644054 
      16       79.650000       31.644054 
      16       79.570000       31.683088 
      16       79.660000       31.713044 
      16       79.580000       31.683088 
      16       79.610000       31.644054 
      16       79.590000       31.644054 
      16       79.580000       31.644054 
      16       79.620000       31.644054 
      16       79.610000       31.644054 
      16       79.560000       31.644054 
      17       79.620000       31.644054 
      17       79.580000       31.635580 
      17       79.580000       31.633282 
      17       79.560000       31.633282 
      17       79.530000       31.633282 
      17       79.610000       31.633282 
      17       79.600000       31.634694 
      17       79.550000       31.633255 
      17       79.590000       31.633255 
      17       79.570000       31.633255 
      17       79.530000       31.634694 
      17       79.570000       31.633255 
      17       79.590000       31.633255 
      17       80.300000       31.633255 
      17       81.470000       31.633255 
      17       82.690000       31.634694 
      18       83.390000       31.633282 
      18       84.170000       31.633282 
      18       84.170000       31.633282 
      18       84.090000       31.633282 
      18       84.120000       31.633282 
      18       84.110000       31.633282 
      18       84.090000       31.633282 
      18       84.110000       31.633282 
      18       84.110000       31.635580 
      18       84.050000       31.644080 
      18       84.040000       31.644080 
      18       84.030000       31.644080 
      18       84.060000       31.683974 
      18       84.040000       31.723842 
      18       84.010000       31.723842 
      19       84.070000       31.723842 
      19       84.000000       31.723842 
      19       84.030000       31.731482 
      19       83.930000       31.723842 
      19       84.010000       31.723842 
      19       84.060000       31.723842 
      19       83.940000       31.723842 
      19       84.000000       31.723842 
      19       83.970000       31.723842 
      19       83.950000       31.723842 
      19       83.930000       31.723842 
      19       83.940000       31.723842 
      19       84.040000       31.723842 
      19       83.940000       31.723842 
      19       83.960000       31.683974 
      20       83.960000       31.644080 
      20       83.920000       31.644080 
      20       84.020000       31.644080 
      20       83.960000       31.635580 
      20       83.920000       31.633282 
      20       83.880000       31.634694 
      20       83.830000       31.634694 
      20       83.790000       31.633255 
      20       83.720000       31.634694 
      20       83.600000       31.634694 
      20       83.640000       31.634694 
      20       83.610000       31.634694 
      20       83.600000       31.634694 
      20       83.630000       31.634694 
      20       83.550000       31.634694 
      20       83.550000       31.633282 
      21       83.420000       31.633282 
      21       83.310000       31.635580 
      21       82.950000       31.635580 
      21       82.060000       31.635580 
      21       81.250000       31.644080 
      21       80.180000       31.683975 
      21       79.240000       31.683975 
      21       78.910000       31.683975 
      21       78.340000       31.683975 
      21       78.410000       31.723869 
      21       78.450000       31.732368 
      21       78.440000       31.732368 
      21       78.420000       31.734640 
      21       78.510000       31.732382 
      21       78.470000       31.732382 
      22       78.540000       31.732382 
      22       78.540000       31.732382 
      22       78.530000       31.732382 
      22       78.520000       31.732382 
      22       78.540000       31.732382 
      22       78.620000       31.732382 
      22       78.550000       31.732382 
      22       78.590000       31.732382 
      22       78.610000       31.732382 
      22       78.520000       31.732382 
      22       78.530000       31.724325 
      22       78.590000       31.689830 
      22       78.530000       31.689830 
      22       78.550000       31.689830 
      23       78.600000       31.674133 
      23       78.570000       31.674133 
      23       78.620000       31.705528 
      23       78.660000       31.705528 
      23       78.600000       31.705528 
      23       78.610000       31.705528 
      23       78.580000       31.727426 
      23       78.580000       31.734237 
      23       78.560000       31.734237 
      23       78.670000       31.734237 
      23       78.560000       31.734237 
      23       78.570000       31.734237 
      23       78.590000       31.733242 
      23       78.640000       31.734667 
      23       78.590000       31.734667 
      24       78.570000       31.732369 
      24       78.620000       31.732369 
      24       78.610000       31.723896 
      24       78.610000       31.723896 
      24       78.580000       31.723896 
      24       78.680000       31.723896 
      24       78.650000       31.723896 
      24       78.590000       31.723896 
      24       78.650000       31.723896 
      24       78.620000       31.723896 
      24       78.610000       31.723896 
      24       78.590000       31.723896 
      24       78.650000       31.723896 
      24       78.670000       31.723896 
      24       78.650000       31.723896 
      24       78.680000       31.723896 
      25       78.610000       31.723896 
      25       78.670000       31.723896 
      25       78.680000       31.723896 
      25       78.610000       31.684861 
      25       78.710000       31.654878 
      25       78.620000       31.683975 
      25       78.670000       31.713097 
      25       78.670000       31.713097 
      25       78.670000       31.713097 
      25       78.710000       31.713097 
      25       78.730000       31.713097 
      25       78.690000       31.713097 
      25       78.670000       31.683975 
      25       78.660000       31.654878 
      25       78.710000       31.654878 
      26       78.710000       31.654878 
      26       78.830000       31.654878 
      26       78.900000       31.654878 
      26       78.790000       31.654878 
      26       78.890000       31.654878 
      26       78.880000       31.654878 
      26       78.810000       31.654878 
      26       78.890000       31.654878 
      26       78.800000       31.684861 
      26       78.840000       31.723896 
      26       78.960000       31.723896 
      26       78.860000       31.723896 
      26       78.900000       31.723896 
      26       78.930000       31.732369 
      26       78.920000       31.734640 
      27       78.960000       31.734640 
      27       78.870000       31.734640 
      27       78.870000       31.734640 
      27       79.090000       31.734640 
      27       79.480000       31.734640 
      27       79.560000       31.734640 
      27       79.570000       31.732368 
      27       79.570000       31.723869 
      27       79.620000       31.723869 
      27       79.620000       31.723869 
      27       79.660000       31.723869 
      27       79.810000       31.723869 
      27       79.770000       31.723869 
      27       79.800000       31.723869 
      27       79.800000       31.723869 
      27       79.740000       31.723869 
      28       79.730000       31.723869 
      28       79.720000       31.723869 
      28       79.810000       31.723869 
      28       79.750000       31.723869 
      28       79.790000       31.723869 
      28       79.840000       31.723869 
      28       79.770000       31.723869 
      28       79.770000       31.723869 
      28       79.750000       31.723869 
      28       79.770000       31.723869 
      28       79.830000       31.723869 
      28       79.770000       31.683975 
      28       79.730000       31.644080 
      28       79.750000       31.644080 
      28       79.720000       31.644080 
      29       79.750000       31.644080 
      29       79.770000       31.644080 
      29       79.780000       31.644080 
      29       79.730000       31.644080 
      29       79.770000       31.644080 
      29       79.820000       31.644080 
      29       79.780000       31.644080 
      29       79.770000       31.644080 
      29       79.720000       31.644080 
      29       79.780000       31.635580 
      29       79.820000       31.633282 
      29       79.690000       31.633282 
      29       79.830000       31.633282 
      29       79.800000       31.633282 
      29       79.760000       31.633282 
      30       79.790000       31.633282 
      30       79.720000       31.634694 
      30       79.750000       31.633282 
      30       79.760000       31.635580 
      30       79.750000       31.644080 
      30       79.700000       31.644080 
      30       79.800000       31.644080 
      30       79.840000       31.644080 
      30       79.810000       31.644080 
      30       79.680000       31.644080 
      30       79.780000       31.683975 
      30       79.770000       31.723869 
      30       79.760000       31.723869 
      30       79.760000       31.723869 
      30       79.760000       31.723869 
      31       79.740000       31.723869 
      31       79.740000       31.732368 
      31       79.730000       31.734640 
      31       79.790000       31.734640 
      31       79.770000       31.734640 
      31       79.730000       31.734640 
      31       79.790000       31.734640 
      31       79.740000       31.734640 
      31       79.740000       31.734640 
      31       79.750000       31.734640 
      31       79.760000       31.734640 
      31       79.760000       31.734640 
      31       79.740000       31.734640 
      31       79.770000       31.734640 
      31       79.790000       31.734640 
      32       79.720000       31.734640 
      32       79.740000       31.734640 
      32       79.720000       31.732368 
      32       79.710000       31.723869 
      32       79.730000       31.723869 
      32       79.800000       31.723869 
      32       79.790000       31.723869 
      32       79.810000       31.723869 
      32       79.710000       31.723869 
      32       79.820000       31.683975 
      32       79.730000       31.644080 
      32       79.750000       31.644080 
      32       79.780000       31.635581 
      32       79.740000       31.633309 
      32       79.830000       31.633309 
      33       80.080000       31.633309 
      33       80.150000       31.635580 
      33       80.150000       31.644054 
      33       80.160000       31.644054 
      33       80.160000       31.644054 
      33       80.110000       31.683088 
      33       80.120000       31.713071 
      33       80.200000       31.713071 
      33       80.060000       31.683974 
      33       80.160000       31.654852 
      33       80.140000       31.654852 
      33       80.200000       31.654852 
      33       80.160000       31.654852 
      33       80.150000       31.654852 
      33       80.250000       31.654852 
      34       80.080000       31.654852 
      34       80.160000       31.654852 
      34       80.240000       31.654852 
      34       80.050000       31.654852 
      34       80.260000       31.654852 
      34       80.010000       31.683974 
      34       80.020000       31.713071 
      34       80.180000       31.713071 
      34       80.090000       31.713071 
      34       80.120000       31.713071 
      34       80.160000       31.713071 
      34       80.100000       31.713071 
      34       80.170000       31.713071 
      34       80.100000       31.713071 
      34       80.040000       31.683088 
      35       80.120000       31.644054 
      35       80.200000       31.644054 
      35       80.150000       31.644054 
      35       80.170000       31.635580 
      35       80.110000       31.633309 
      35       80.110000       31.633309 
      35       80.190000       31.633309 
      35       80.050000       31.633309 
      35       80.130000       31.633309 
      35       80.070000       31.633309 
      35       80.100000       31.633309 
      35       80.170000       31.633309 
      35       80.100000       31.635581 
      35       80.130000       31.635581 
      35       80.020000       31.644080 
      35       80.110000       31.683974 
      36       80.090000       31.723842 
      36       80.090000       31.723842 
      36       80.120000       31.731482 
      36       80.140000       31.723842 
      36       80.120000       31.723842 
      36       80.160000       31.723842 
      36       80.050000       31.723842 
      36       80.110000       31.723842 
      36       80.080000       31.723842 
      36       80.140000       31.723842 
      36       80.090000       31.723842 
      36       80.130000       31.723842 
      36       80.180000       31.723842 
      36       80.080000       31.723842 
      36       80.170000       31.723842 
      37       80.070000       31.683974 
      37       80.040000       31.644080 
      37       80.130000       31.644080 
      37       80.120000       31.644080 
      37       80.090000       31.644080 
      37       80.070000       31.644080 
      37       80.100000       31.644080 
      37       80.070000       31.644080 
      37       80.170000       31.644080 
      37       80.180000       31.644080 
      37       80.010000       31.644080 
      37       80.100000       31.644080 
      37       80.040000       31.644080 
      37       80.070000       31.644080 
      37       80.140000       31.644080 
      37       80.060000       31.644080 
      38       80.100000       31.644080 
      38       80.150000       31.644080 
      38       80.060000       31.644080 
      38       80.140000       31.644080 
      38       80.080000       31.635581 
      38       80.080000       31.633309 
      38       80.110000       31.635580 
      38       80.110000       31.644054 
      38       80.140000       31.644054 
      38       80.060000       31.644054 
      38       80.040000       31.683088 
      38       80.080000       31.713071 
      38       80.100000       31.713071 
      38       80.080000       31.683974 
      38       80.040000       31.654852 
      39       80.050000       31.654852 
      39       80.110000       31.654852 
      39       80.030000       31.654852 
      39       80.050000       31.654852 
      39       80.090000       31.654852 
      39       80.040000       31.683975 
      39       80.080000       31.713097 
      39       80.070000       31.713097 
      39       80.070000       31.713097 
      39       80.110000       31.713097 
      39       80.070000       31.713097 
      39       80.090000       31.713097 
      39       80.040000       31.683975 
      39       80.080000       31.654852 
      39       80.060000       31.654852 
      40       80.060000       31.683975 
      40       80.100000       31.713097 
      40       79.980000       31.713097 
      40       80.100000       31.713097 
      40       80.080000       31.713097 
      40       80.090000       31.713097 
      40       80.090000       31.713097 
      40       80.020000       31.713097 
      40       80.030000       31.713097 
      40       80.080000       31.683975 
      40       80.020000       31.654878 
      40       80.060000       31.684861 
      40       80.020000       31.684861 
      40       79.970000       31.684861 
      40       80.070000       31.723896 
      41       80.040000       31.732369 
      41       80.080000       31.732369 
      41       80.100000       31.732369 
      41       80.060000       31.732369 
      41       80.070000       31.732369 
      41       80.000000       31.732369 
      41       80.070000       31.732369 
      41       79.990000       31.732369 
      41       80.050000       31.732369 
      41       80.060000       31.732369 
      41       80.050000       31.732369 
      41       80.120000       31.732369 
      41       79.980000       31.732369 
      41       80.060000       31.732369 
      41       80.000000       31.732369 
      42       80.080000       31.732369 
      42       80.070000       31.732369 
      42       80.030000       31.734667 
      42       80.040000       31.733255 
      42       79.990000       31.733255 
      42       80.070000       31.733255 
      42       80.020000       31.733255 
      42       80.000000       31.733255 
      42       80.040000       31.733255 
      42       80.000000       31.733255 
      42       80.080000       31.733255 
      42       80.000000       31.733255 
      42       80.040000       31.733255 
      42       80.030000       31.733255 
      42       80.060000       31.733255 
      43       80.010000       31.733255 
      43       80.010000       31.733255 
      43       79.950000       31.733255 
      43       80.030000       31.733255 
      43       79.990000       31.734694 
      43       80.040000       31.733255 
      43       80.020000       31.734694 
      43       80.000000       31.733255 
      43       80.000000       31.733255 
      43       80.030000       31.733255 
      43       79.980000       31.733255 
      43       80.040000       31.733255 
      43       79.990000       31.733255 
      43       80.000000       31.733255 
      43       79.990000       31.733255 
      43       80.010000       31.733255 
      44       79.970000       31.733255 
      44       80.050000       31.733255 
      44       80.000000       31.734667 
      44       79.960000       31.734667 
      44       79.940000       31.732382 
      44       79.970000       31.732382 
      44       80.020000       31.724325 
      44       79.980000       31.689804 
      44       79.990000       31.689804 
      44       80.020000       31.689804 
      44       79.940000       31.689804 
      44       79.980000       31.689804 
      44       79.990000       31.689804 
      44       79.990000       31.689804 
      44       79.960000       31.689804 
      44       80.020000       31.689804 
      45       80.020000       31.689804 
      45       80.040000       31.689804 
      45       80.020000       31.689804 
      45       79.990000       31.689804 
      45       80.020000       31.689804 
      45       79.950000       31.689804 
      45       80.080000       31.689804 
      45       79.990000       31.689804 
      45       80.020000       31.689804 
      45       79.980000       31.689804 
      45       79.990000       31.673247 
      45       79.990000       31.694703 
      45       80.040000       31.694703 
      45       79.970000       31.694703 
      45       80.050000       31.694703 
      45       79.960000       31.694703 
      46       79.970000       31.694703 
      46       80.010000       31.694703 
      46       80.000000       31.694703 
      46       80.020000       31.694703 
      46       80.050000       31.694703 
      46       79.970000       31.694703 
      46       79.980000       31.678145 
      46       80.020000       31.678145 
      46       79.920000       31.643624 
      46       80.020000       31.643624 
      46       80.020000       31.643624 
      46       79.980000       31.643624 
      46       80.020000       31.643624 
      46       79.980000       31.643624 
      46       80.040000       31.643624 
      47       79.960000       31.643624 
      47       79.980000       31.643624 
      47       79.940000       31.643624 
      47       79.980000       31.643624 
      47       79.990000       31.643624 
      47       79.940000       31.643624 
      47       80.010000       31.643624 
      47       80.040000       31.643624 
      47       80.040000       31.643624 
      47       79.970000       31.643624 
      47       79.930000       31.643624 
      47       79.970000       31.643624 
      47       80.050000       31.643624 
      47       79.940000       31.643624 
      47       79.960000       31.643624 
      48       80.000000       31.635567 
      48       80.000000       31.633282 
      48       79.990000       31.633282 
      48       79.980000       31.633282 
      48       79.990000       31.633282 
      48       80.010000       31.634694 
      48       79.980000       31.633255 
      48       80.010000       31.633255 
      48       79.990000       31.633255 
      48       79.960000       31.633255 
      48       79.920000       31.633255 
      48       79.950000       31.633255 
      48       79.950000       31.633255 
      48       79.950000       31.634694 
      48       79.960000       31.633255 
      48       79.930000       31.633255 
      49       79.950000       31.633255 
      49       79.950000       31.633255 
      49       79.960000       31.633255 
      49       79.970000       31.633255 
      49       79.930000       31.633255 
      49       80.040000       31.634694 
      49       79.910000       31.633255 
      49       79.940000       31.633255 
      49       79.990000       31.633255 
      49       79.920000       31.633255 
      49       79.960000       31.633255 
      49       80.000000       31.634694 
      49       79.960000       31.633255 
      49       79.940000       31.634694 
      49       79.960000       31.633255 
      50       79.920000       31.633255 
      50       79.920000       31.633255 
      50       79.940000       31.634694 
      50       79.970000       31.633282 
      50       79.980000       31.635580 
      50       79.900000       31.644054 
      50       79.970000       31.644054 
      50       79.990000       31.644054 
      50       79.950000       31.644054 
      50       79.970000       31.683088 
      50       79.930000       31.713044 
      50       80.000000       31.713044 
      50       80.010000       31.713044 
      50       79.960000       31.713044 
      50       79.960000       31.713044 
      51       79.980000       31.713044 
      51       80.000000       31.683088 
      51       79.960000       31.644054 
      51       79.910000       31.644054 
      51       79.990000       31.644054 
      51       79.980000       31.644054 
      51       79.980000       31.644054 
      51       79.980000       31.644054 
      51       79.970000       31.635580 
      51       79.970000       31.633309 
      51       79.940000       31.635581 
      51       79.980000       31.635581 
      51       80.020000       31.644080 
      51       79.940000       31.644080 
      51       80.020000       31.644080 
      52       79.960000       31.644080 
      52       79.920000       31.644080 
      52       79.910000       31.644080 
      52       79.970000       31.644080 
      52       79.960000       31.644080 
      52       80.010000       31.644080 
      52       79.990000       31.644080 
      52       79.980000       31.683975 
      52       79.970000       31.723869 
      52       79.960000       31.723869 
      52       79.980000       31.732368 
      52       79.930000       31.734640 
      52       79.930000       31.734640 
      52       79.970000       31.732369 
      52       79.940000       31.723896 
      53       79.920000       31.723896 
      53       79.960000       31.723896 
      53       79.890000       31.684861 
      53       79.940000       31.654905 
      53       79.940000       31.654905 
      53       80.010000       31.654905 
      53       79.930000       31.654905 
      53       79.960000       31.654905 
      53       79.970000       31.654905 
      53       79.940000       31.654905 
      53       79.960000       31.654905 
      53       79.930000       31.654905 
      53       79.960000       31.654905 
      53       79.940000       31.684861 
      53       79.960000       31.723896 
      53       79.960000       31.723896 
      54       79.950000       31.723896 
      54       79.990000       31.723896 
      54       79.960000       31.723896 
      54       79.950000       31.723896 
      54       79.970000       31.723896 
      54       80.000000       31.723896 
      54       79.970000       31.723896 
      54       79.890000       31.723896 
      54       80.010000       31.723896 
      54       79.990000       31.732369 
      54       79.910000       31.734667 
      54       79.940000       31.734667 
      54       79.900000       31.734667 
      54       80.000000       31.734667 
      54       79.930000       31.734667 
      55       79.960000       31.734667 
      55       80.000000       31.733255 
      55       79.980000       31.734667 
      55       79.970000       31.734667 
      55       79.970000       31.734667 
      55       79.980000       31.734667 
      55       79.930000       31.734667 
      55       79.910000       31.734667 
      55       79.990000       31.734667 
      55       79.960000       31.734667 
      55       79.930000       31.734667 
      55       79.940000       31.734667 
      55       79.930000       31.734667 
      55       79.910000       31.734667 
      55       79.920000       31.734667 
      55       79.890000       31.734667 
      56       79.940000       31.734667 
      56       79.850000       31.734667 
      56       79.890000       31.734667 
      56       79.900000       31.734667 
      56       79.950000       31.734667 
      56       79.970000       31.734667 
      56       79.890000       31.734667 
      56       79.900000       31.732369 
      56       79.930000       31.723869 
      56       79.870000       31.723869 
      56       79.910000       31.723869 
      56       79.900000       31.723869 
      56       79.900000       31.723869 
      56       79.940000       31.723869 
      56       79.880000       31.723869 
      57       79.880000       31.723869 
      57       79.940000       31.723869 
      57       79.880000       31.723869 
      57       79.900000       31.723869 
      57       79.840000       31.723869 
      57       79.920000       31.723869 
      57       79.910000       31.723869 
      57       79.860000       31.723869 
      57       79.920000       31.723869 
      57       79.940000       31.723869 
      57       79.920000       31.723869 
      57       79.910000       31.723869 
      57       79.910000       31.723869 
      57       79.900000       31.723869 
      57       79.900000       31.723869 
      58       79.880000       31.723869 
      58       79.930000       31.723869 
      58       79.920000       31.723869 
      58       79.900000       31.723869 
      58       79.930000       31.723869 
      58       79.870000       31.683975 
      58       79.920000       31.644080 
      58       79.880000       31.644080 
      58       79.880000       31.644080 
      58       79.870000       31.644080 
      58       79.840000       31.644080 
      58       79.890000       31.644080 
      58       79.900000       31.635580 
      58       80.010000       31.633282 
      58       79.840000       31.633282 
      59       79.920000       31.633282 
      59       79.890000       31.633282 
      59       79.770000       31.633282 
      59       79.820000       31.633282 
      59       79.970000       31.633282 
      59       79.870000       31.633282 
      59       79.990000       31.633282 
      59       79.920000       31.633282 
      59       79.860000       31.633282 
      59       79.890000       31.633282 
      59       79.870000       31.633282 
      59       79.910000       31.633282 
      59       79.910000       31.634694 
      59       79.890000       31.633282 
      59       79.890000       31.635580 
      60       79.900000       31.635580 
      60       79.890000       31.635580 
      60       79.870000       31.635580 
      60       79.860000       31.635580 
      60       79.920000       31.635580 
      60       79.920000       31.635580 
      60       79.870000       31.635580 
      60       79.890000       31.635580 
      60       79.920000       31.635580 
      60       79.850000       31.635580 
      60       79.920000       31.635580 
      60       79.900000       31.635580 
      60       79.880000       31.635580 
      60       79.900000       31.635580 
      60       79.930000       31.635580 
      61       79.880000       31.635580 
