Human trial picking the raspberry twin 

 time    ||     output     ||     loadcell

      0.000000       -792.904762       0.160000 
      0.031922       -792.904762       0.150000 
      0.064003       -792.904762       0.080000 
      0.093053       -792.904762       0.120000 
      0.123676       -792.904762       0.200000 
      0.153879       -792.904762       0.160000 
      0.183816       -792.904762       0.170000 
      0.214997       -792.904762       0.170000 
      0.244838       -792.904762       0.100000 
      0.276815       -792.904757       0.310000 
      0.308864       -792.903578       0.240000 
      0.339923       -792.797451       0.020000 
      0.370921       -789.282995       0.250000 
      0.402009       -746.468159       0.100000 
      0.433122       -554.585374       0.040000 
      0.463123       -238.224186       0.220000 
      0.494991       -46.342691       0.210000 
      0.525137       -3.542749       0.060000 
      0.555125       -0.085560       0.190000 
      0.586444       -0.036892       0.120000 
      0.616953       -0.032033       0.060000 
      0.648732       -0.035752       0.110000 
      0.681095       -0.043213       0.330000 
      0.710720       -0.024994       0.050000 
      0.741485       0.015882       0.180000 
      0.772961       0.037324       0.030000 
      0.803222       0.028851       0.140000 
      0.833452       -0.033910       0.040000 
      0.864916       -0.102874       0.120000 
      0.896720       -0.086760       0.040000 
      0.927563       -0.010130       0.080000 
      0.957922       0.053505       0.480000 
      0.988826       0.064706       0.230000 
      1.019741       0.054421       0.110000 
      1.050098       0.065189       0.100000 
      1.080748       0.060193       0.330000 
      1.110883       0.028908       0.090000 
      1.142158       0.008655       0.080000 
      1.173021       -0.041941       0.190000 
      1.203604       -0.118598       0.050000 
      1.234883       -0.082691       0.100000 
      1.264889       0.013997       0.350000 
      1.295654       0.028864       0.210000 
      1.325840       -0.010153       0.060000 
      1.357125       0.000641       0.210000 
      1.389014       0.025252       0.210000 
      1.420051       0.000668       0.240000 
      1.451669       -0.009227       0.140000 
      1.482823       0.040992       0.160000 
      1.513726       0.078601       0.090000 
      1.544269       0.070119       0.260000 
      1.591288       0.054421       0.080000 
      1.622773       0.059790       0.020000 
      1.652681       0.035607       0.080000 
      1.683088       -0.014612       0.280000 
      1.713805       -0.018143       0.030000 
      1.745710       0.009555       0.310000 
      1.776982       0.016365       0.290000 
      1.807999       0.009558       0.120000 
      1.837912       0.045505       0.110000 
      1.868942       0.073619       0.380000 
      1.899997       0.045518       0.170000 
      1.930445       0.010001       0.190000 
      1.961493       0.021764       0.050000 
      1.991990       0.033738       0.240000 
      2.024151       0.021321       0.210000 
      2.054182       0.004616       0.100000 
      2.085990       0.021764       0.230000 
      2.117527       0.039097       0.140000 
      2.148889       0.044632       0.100000 
      2.180170       0.033711       0.270000 
      2.211626       -0.002446       0.220000 
      2.243194       -0.035708       0.230000 
      2.274029       -0.007832       0.200000 
      2.305897       0.009541       0.100000 
      2.351779       0.005611       0.090000 
      2.382137       0.025268       0.090000 
      2.414201       0.059790       0.190000 
      2.445203       0.064746       0.110000 
      2.476812       0.049479       0.070000 
      2.507766       0.046378       0.130000 
      2.537769       0.044106       0.060000 
      2.569166       0.040979       0.230000 
      2.600937       0.024839       0.320000 
      2.631995       0.019439       0.270000 
      2.662793       0.010939       0.170000 
      2.694781       -0.025854       0.080000 
      2.726057       -0.048182       0.460000 
      2.756329       -0.054550       0.230000 
      2.788129       -0.047739       0.060000 
      2.818317       -0.020468       0.160000 
      2.849003       0.034693       0.010000 
      2.879039       0.053921       0.080000 
      2.910833       0.024409       0.350000 
      2.942032       0.001528       0.200000 
      2.972092       0.001541       0.100000 
      3.003088       0.024866       0.100000 
      3.034288       0.059791       0.340000 
      3.064830       0.065189       0.190000 
      3.096202       0.054865       0.120000 
      3.127737       0.070145       0.170000 
      3.158110       0.079018       0.160000 
      3.189046       0.045519       0.250000 
      3.221060       0.004642       0.180000 
      3.252148       -0.001559       0.010000 
      3.284126       0.004213       0.180000 
      3.314150       0.040563       0.310000 
      3.344842       0.060220       0.060000 
      3.375920       0.054448       0.250000 
      3.406174       0.070535       0.120000 
      3.438298       0.083114       0.000000 
      3.469070       0.054405       0.140000 
      3.499967       -0.017270       0.100000 
      3.530972       -0.049081       0.020000 
      3.561984       0.011853       0.090000 
      3.593835       0.054378       0.300000 
      3.625333       0.053119       0.280000 
      3.656325       0.060207       0.140000 
      3.686957       0.041435       0.210000 
      3.718782       0.014567       0.090000 
      3.749677       0.041422       0.100000 
      3.780447       0.059803       0.260000 
      3.811746       0.049036       0.200000 
      3.841983       0.045935       0.280000 
      3.873213       0.039137       0.090000 
      3.904144       0.021765       0.140000 
      3.934835       0.004642       0.330000 
      3.965734       0.022208       0.120000 
      4.012515       0.044523       0.170000 
      4.044268       0.069689       0.200000 
      4.075140       0.083531       0.230000 
      4.107001       0.059777       0.010000 
      4.136805       0.006054       0.320000 
      4.168566       -0.019542       0.390000 
      4.199086       -0.006945       0.200000 
      4.229570       0.004213       0.340000 
      4.260370       0.045948       0.240000 
      4.291904       0.084417       0.290000 
      4.321827       0.094342       0.160000 
      4.353081       0.094772       0.150000 
      4.382831       0.089843       0.090000 
      4.414157       0.071045       0.230000 
      4.445772       0.055348       0.260000 
      4.477005       0.071045       0.070000 
      4.508765       0.089843       0.420000 
      4.540078       0.094786       0.260000 
      4.571441       0.094786       0.420000 
      4.603019       0.089843       0.270000 
      4.634289       0.071045       0.230000 
      4.665119       0.055348       0.080000 
      4.696959       0.071018       0.380000 
      4.728094       0.088957       0.170000 
      4.758346       0.084001       0.260000 
      4.790372       0.046835       0.420000 
      4.821234       0.015440       0.140000 
      4.853277       0.046405       0.140000 
      4.883867       0.079032       0.340000 
      4.915044       0.069716       0.140000 
      4.946485       0.049922       0.030000 
      4.977043       0.046834       0.210000 
      5.007916       0.049479       0.120000 
      5.038055       0.064303       0.350000 
      5.068474       0.054391       0.070000 
      5.098769       0.001112       0.330000 
      5.130100       -0.032954       0.120000 
      5.160996       0.001555       0.010000 
      5.191001       0.059804       0.170000 
      5.221972       0.088943       0.150000 
      5.253168       0.094759       0.190000 
      5.284424       0.094785       0.270000 
      5.331138       0.089843       0.250000 
      5.363047       0.071032       0.190000 
      5.392712       0.054905       0.420000 
      5.424591       0.065646       0.090000 
      5.456073       0.065646       0.110000 
      5.487050       0.054905       0.190000 
      5.516928       0.071032       0.210000 
      5.547792       0.089843       0.360000 
      5.579129       0.094799       0.130000 
      5.609102       0.095229       0.320000 
      5.640340       0.095242       0.380000 
      5.670922       0.095242       0.220000 
      5.702064       0.095242       0.180000 
      5.731854       0.095242       0.000000 
      5.762963       0.095242       0.160000 
      5.793943       0.095242       0.350000 
      5.824116       0.095242       0.260000 
      5.855847       0.095229       0.070000 
      5.886568       0.094799       0.190000 
      5.917944       0.089843       0.060000 
      5.948864       0.071032       0.170000 
      5.980581       0.054905       0.220000 
      6.011127       0.065646       0.460000 
      6.043208       0.065646       0.890000 
      6.074103       0.054905       0.600000 
      6.104600       0.071032       1.860000 
      6.136131       0.089843       2.200000 
      6.167989       0.094786       2.710000 
      6.198236       0.094786       3.390000 
      6.229347       0.089843       4.060000 
      6.259092       0.071045       7.380000 
      6.290972       0.055348       14.270000 
      6.321168       0.071045       25.820000 
      6.352105       0.089843       40.940000 
      6.381939       0.094799       52.220000 
      6.413163       0.095216       69.250000 
      6.443472       0.094799       87.240000 
      6.474892       0.089843       101.580000 
      6.505149       0.071045       109.600000 
      6.535367       0.055348       123.640000 
      6.567008       0.071045       141.130000 
      6.597203       0.089843       161.140000 
      6.627858       0.094799       173.670000 
      6.658072       0.095227       180.160000 
      6.689110       0.095108       194.710000 
      6.719938       0.090757       208.580000 
      6.751431       0.039465       205.100000 
      6.781974       -0.168768       168.020000 
      6.812920       -0.405887       112.210000 
      6.844829       -0.330502       0.780000 
      6.875332       -0.095431       14.250000 
      6.907158       0.045059       2.630000 
      6.938014       0.089402       0.650000 
      6.969037       0.115509       0.200000 
      7.000458       0.226393       3.920000 
      7.032193       0.516032       9.040000 
      7.062783       0.877271       2.830000 
      7.094660       1.135608       6.870000 
      7.123860       1.431348       5.950000 
      7.154264       1.801262       8.070000 
      7.186090       1.899793       5.070000 
      7.217532       1.446504       5.860000 
      7.248311       0.432866       5.830000 
      7.279209       -0.253702       4.180000 
      7.309747       -0.034221       3.800000 
      7.341110       -0.105356       2.000000 
      7.371933       -0.739005       2.970000 
      7.402936       -1.342048       1.900000 
      7.433572       -1.720516       2.310000 
      7.464108       -1.873058       0.320000 
      7.495009       -1.902405       3.680000 
      7.525818       -1.904689       2.410000 
      7.555603       -1.904757       3.300000 
      7.586385       -1.904758       3.640000 
      7.617907       -1.904758       3.980000 
      7.647936       -1.904758       5.150000 
      7.679242       -1.904758       5.110000 
      7.711264       -1.904758       5.750000 
      7.742584       -1.904758       5.220000 
      7.773274       -1.904758       5.630000 
      7.804674       -1.904758       5.630000 
      7.835245       -1.904758       5.460000 
      7.866844       -1.904758       4.670000 
      7.897714       -1.904758       4.070000 
      7.928276       -1.904758       3.960000 
      7.958873       -1.904758       3.210000 
      7.990563       -1.904758       2.960000 
      8.021301       -1.904758       2.200000 
      8.052079       -1.904758       2.340000 
      8.082722       -1.904758       2.080000 
      8.113547       -1.904758       2.690000 
      8.145105       -1.904758       2.790000 
      8.175240       -1.904758       3.250000 
      8.206541       -1.904758       3.160000 
      8.237620       -1.904758       3.890000 
      8.269143       -1.904758       3.940000 
      8.300667       -1.904758       3.880000 
      8.331997       -1.904758       4.990000 
      8.362868       -1.904758       4.570000 
      8.393821       -1.904758       4.910000 
      8.424807       -1.904758       5.050000 
      8.456025       -1.904758       4.460000 
      8.486460       -1.904758       4.460000 
      8.518130       -1.904758       4.220000 
      8.548995       -1.904758       4.140000 
      8.579910       -1.904758       3.920000 
      8.611308       -1.904758       3.660000 
      8.641983       -1.904758       3.250000 
      8.672027       -1.904758       3.190000 
      8.702927       -1.904758       2.840000 
      8.733611       -1.904758       3.010000 
      8.764220       -1.904758       3.270000 
      8.795952       -1.904758       3.030000 
      8.826777       -1.904758       3.380000 
      8.858300       -1.904758       3.290000 
      8.889216       -1.904758       3.970000 
      8.919259       -1.904758       4.120000 
      8.949891       -1.904758       4.030000 
      8.981508       -1.904758       4.140000 
      9.013303       -1.904758       4.460000 
      9.044378       -1.904758       4.600000 
      9.075777       -1.904758       4.510000 
      9.106839       -1.904758       4.470000 
      9.137767       -1.904758       4.330000 
      9.168352       -1.904758       4.310000 
      9.200321       -1.904758       4.110000 
      9.231659       -1.904758       3.880000 
      9.261922       -1.904758       3.890000 
      9.293386       -1.904758       3.700000 
      9.323819       -1.904758       3.550000 
      9.354109       -1.904758       3.230000 
      9.384445       -1.904758       3.030000 
      9.415549       -1.904758       3.280000 
      9.447228       -1.904758       3.260000 
      9.479246       -1.904758       3.420000 
      9.508987       -1.904758       3.660000 
      9.539950       -1.904758       3.700000 
      9.571083       -1.904758       3.890000 
      9.602164       -1.904758       3.940000 
      9.633063       -1.904758       4.100000 
      9.662907       -1.904758       4.540000 
      9.693191       -1.904758       4.590000 
      9.724828       -1.904758       4.180000 
      9.756268       -1.904758       4.140000 
      9.787867       -1.904758       4.110000 
      9.819146       -1.904758       4.160000 
      9.849021       -1.904758       4.060000 
      9.880080       -1.904758       3.890000 
      9.911166       -1.904758       3.850000 
      9.941062       -1.904758       3.520000 
      9.972411       -1.904758       3.550000 
      10.001979       -1.904758       3.570000 
      10.032509       -1.904758       3.600000 
      10.063487       -1.904758       3.390000 
      10.093986       -1.904758       3.730000 
      10.124616       -1.904758       3.810000 
      10.156953       -1.904758       3.480000 
      10.187786       -1.904758       3.760000 
      10.217899       -1.904758       4.010000 
      10.264905       -1.904758       4.030000 
      10.295658       -1.904758       4.400000 
      10.326059       -1.904758       4.220000 
      10.356612       -1.904758       4.060000 
      10.404036       -1.904758       4.190000 
      10.435022       -1.904758       4.250000 
      10.466119       -1.904758       4.040000 
      10.496063       -1.904758       4.150000 
      10.527152       -1.904758       3.550000 
      10.557651       -1.904758       3.610000 
      10.588906       -1.904758       3.520000 
      10.620470       -1.904758       3.440000 
      10.652094       -1.904758       3.470000 
      10.682969       -1.904758       3.340000 
      10.713946       -1.904758       3.720000 
      10.744889       -1.904758       3.560000 
      10.789692       -1.904758       3.680000 
      10.820932       -1.904758       3.980000 
      10.851752       -1.904758       3.900000 
      10.884090       -1.904758       3.990000 
      10.915114       -1.904758       4.150000 
      10.946779       -1.904758       3.920000 
      10.977397       -1.904758       4.200000 
      11.008580       -1.904758       3.850000 
      11.039887       -1.904758       3.970000 
      11.071097       -1.904758       4.240000 
      11.102892       -1.904758       3.870000 
      11.134137       -1.904758       3.970000 
      11.163839       -1.904758       3.940000 
      11.195112       -1.904758       4.000000 
      11.226079       -1.904758       3.940000 
      11.257172       -1.904758       3.660000 
      11.288036       -1.904758       3.320000 
      11.318678       -1.904758       3.510000 
      11.348914       -1.904758       3.620000 
      11.395140       -1.904758       3.660000 
      11.425104       -1.904758       3.680000 
      11.455917       -1.904758       3.680000 
      11.486189       -1.904758       3.890000 
      11.517406       -1.904758       3.850000 
      11.549012       -1.904758       3.850000 
      11.579343       -1.904758       3.910000 
      11.611197       -1.904758       4.120000 
      11.642105       -1.904758       4.160000 
      11.688078       -1.904758       4.000000 
      11.718659       -1.904758       3.920000 
      11.749851       -1.904758       3.980000 
      11.780353       -1.904758       3.760000 
      11.811265       -1.904758       3.810000 
      11.841408       -1.904758       3.640000 
      11.872486       -1.904758       3.620000 
      11.903052       -1.904758       3.580000 
      11.933893       -1.904758       3.720000 
      11.964081       -1.904758       3.650000 
      11.995041       -1.904758       3.630000 
      12.026316       -1.904758       3.800000 
      12.057281       -1.904758       3.920000 
      12.086975       -1.904758       3.720000 
      12.117944       -1.904758       3.850000 
      12.147880       -1.904758       3.900000 
      12.178073       -1.904758       3.920000 
      12.208972       -1.904758       3.920000 
      12.238895       -1.904758       4.090000 
      12.270854       -1.904758       3.810000 
      12.300758       -1.904758       3.780000 
      12.331795       -1.904758       3.780000 
      12.361891       -1.904758       3.860000 
      12.392922       -1.904758       3.860000 
      12.422936       -1.904758       3.680000 
      12.454937       -1.904758       3.730000 
      12.486569       -1.904758       3.760000 
      12.516995       -1.904758       3.880000 
      12.546633       -1.904758       3.700000 
      12.577428       -1.904758       3.390000 
      12.607849       -1.904758       3.670000 
      12.638854       -1.904758       3.630000 
      12.670195       -1.904758       3.660000 
      12.700753       -1.904758       3.680000 
      12.731826       -1.904758       3.850000 
      12.762111       -1.904758       3.940000 
      12.792850       -1.904758       3.940000 
      12.822986       -1.904758       4.040000 
      12.853969       -1.904758       3.940000 
      12.885114       -1.904758       3.840000 
      12.917034       -1.904758       4.010000 
      12.947130       -1.904758       3.940000 
      12.977215       -1.904758       3.900000 
      13.008917       -1.904758       3.700000 
      13.040826       -1.904758       3.910000 
      13.072028       -1.904758       3.770000 
      13.102128       -1.904758       3.720000 
      13.133364       -1.904758       3.490000 
      13.165291       -1.904758       3.430000 
      13.196697       -1.904758       3.720000 
      13.227942       -1.904758       3.720000 
      13.259387       -1.904758       3.640000 
      13.289922       -1.904758       3.630000 
      13.320981       -1.904758       3.630000 
      13.351928       -1.904758       3.540000 
      13.383088       -1.904758       3.750000 
      13.413405       -1.904758       3.830000 
      13.444800       -1.904758       3.990000 
      13.476839       -1.904758       3.920000 
      13.506946       -1.904758       3.910000 
      13.538755       -1.904758       3.950000 
      13.569885       -1.904758       3.750000 
      13.600919       -1.904758       3.810000 
      13.631836       -1.904758       3.750000 
      13.661752       -1.904758       3.870000 
      13.693242       -1.904758       3.820000 
      13.724719       -1.904758       3.880000 
      13.756396       -1.904758       3.960000 
      13.788198       -1.904758       3.700000 
      13.819361       -1.904758       3.470000 
      13.849104       -1.904758       3.500000 
      13.879739       -1.904758       3.620000 
      13.911007       -1.904758       3.570000 
      13.942217       -1.904758       3.510000 
      13.972938       -1.904744       3.640000 
      14.004302       -1.904314       3.860000 
      14.034739       -1.899359       3.600000 
      14.065669       -1.880561       3.580000 
      14.096217       -1.864863       3.580000 
      14.127151       -1.880561       3.950000 
      14.159384       -1.899359       3.600000 
      14.189881       -1.904314       3.580000 
      14.221813       -1.904744       3.570000 
      14.251644       -1.904758       3.580000 
      14.283024       -1.904758       3.440000 
      14.313790       -1.904758       3.410000 
      14.343825       -1.904758       3.600000 
      14.375106       -1.904758       3.400000 
      14.406853       -1.904758       3.590000 
      14.437941       -1.904758       3.750000 
      14.468531       -1.904758       3.620000 
      14.499465       -1.904758       3.730000 
      14.531002       -1.904758       3.600000 
      14.562215       -1.904758       3.720000 
      14.592517       -1.904758       3.670000 
      14.623100       -1.904758       3.860000 
      14.653404       -1.904758       3.640000 
      14.684115       -1.904758       3.830000 
      14.715059       -1.904758       3.940000 
      14.746402       -1.904758       3.930000 
      14.777050       -1.904758       3.820000 
      14.807167       -1.904758       3.870000 
      14.838430       -1.904758       3.940000 
      14.869194       -1.904758       3.780000 
      14.900273       -1.904758       3.840000 
      14.931130       -1.904758       3.600000 
      14.962962       -1.904758       4.010000 
      14.993245       -1.904758       3.790000 
      15.025064       -1.904758       3.900000 
      15.055891       -1.904758       3.900000 
      15.086650       -1.904758       3.660000 
      15.117233       -1.904758       3.430000 
      15.147342       -1.904758       3.490000 
      15.178977       -1.904758       3.550000 
      15.209736       -1.904758       3.840000 
      15.256814       -1.904758       3.410000 
      15.288445       -1.904758       3.520000 
      15.320142       -1.904758       3.440000 
      15.352046       -1.904758       3.300000 
      15.382871       -1.904758       3.230000 
      15.412838       -1.904758       3.610000 
      15.443810       -1.904758       3.600000 
      15.474933       -1.904758       3.380000 
      15.505489       -1.904758       3.380000 
      15.536307       -1.904758       3.500000 
      15.567895       -1.904758       3.330000 
      15.598909       -1.904758       3.480000 
      15.629862       -1.904758       3.280000 
      15.675786       -1.904758       3.470000 
      15.706992       -1.904758       3.710000 
      15.753865       -1.904758       3.650000 
      15.800261       -1.904758       3.920000 
      15.832364       -1.904758       3.530000 
      15.863453       -1.904758       3.640000 
      15.894599       -1.904758       3.590000 
      15.926235       -1.904758       3.620000 
      15.957028       -1.904758       3.920000 
      15.989106       -1.904758       3.500000 
      16.019864       -1.904758       3.390000 
      16.051058       -1.904758       3.630000 
      16.083007       -1.904758       3.470000 
      16.113489       -1.904758       3.510000 
      16.144207       -1.904758       3.550000 
      16.175338       -1.904758       3.840000 
      16.206828       -1.904758       3.720000 
      16.237825       -1.904758       3.740000 
      16.269723       -1.904758       3.650000 
      16.300703       -1.904744       3.620000 
      16.331484       -1.904314       3.590000 
      16.362869       -1.899359       3.540000 
      16.394160       -1.880561       3.810000 
      16.424790       -1.864863       3.570000 
      16.455902       -1.880561       3.650000 
      16.485844       -1.899359       3.360000 
      16.517036       -1.904314       3.890000 
      16.547954       -1.904744       3.670000 
      16.579266       -1.904758       3.650000 
      16.609866       -1.904758       3.890000 
      16.641121       -1.904758       3.920000 
      16.673069       -1.904758       3.990000 
      16.703607       -1.904758       3.670000 
      16.734857       -1.904758       3.840000 
      16.765609       -1.904758       3.780000 
      16.796699       -1.904758       3.710000 
      16.828122       -1.904758       3.630000 
      16.860044       -1.904758       3.370000 
      16.890917       -1.904758       3.750000 
      16.922005       -1.904758       3.590000 
      16.954028       -1.904758       3.680000 
      16.985295       -1.904758       3.620000 
      17.016075       -1.904758       3.600000 
      17.047900       -1.904758       3.600000 
      17.078743       -1.904758       3.320000 
      17.109941       -1.904758       3.540000 
      17.141800       -1.904744       3.630000 
      17.172200       -1.904314       3.460000 
      17.203045       -1.899359       3.610000 
      17.234877       -1.880561       3.550000 
      17.265888       -1.864863       3.520000 
      17.295932       -1.880561       3.460000 
      17.326043       -1.899359       3.870000 
      17.356878       -1.904314       3.600000 
      17.388501       -1.904744       3.600000 
      17.420299       -1.904758       3.550000 
      17.451242       -1.904758       3.790000 
      17.482919       -1.904758       3.690000 
      17.514453       -1.904758       3.700000 
      17.544783       -1.904758       3.700000 
      17.576789       -1.904758       3.580000 
      17.607858       -1.904758       3.860000 
      17.638057       -1.904758       3.580000 
      17.669042       -1.904758       3.510000 
      17.700351       -1.904758       3.540000 
      17.731195       -1.904758       3.600000 
      17.762517       -1.904758       3.310000 
      17.792326       -1.904758       3.400000 
      17.822491       -1.904758       3.520000 
      17.853531       -1.904758       3.340000 
      17.883849       -1.904758       3.470000 
      17.915027       -1.904758       3.180000 
      17.946463       -1.904758       3.380000 
      17.976475       -1.904758       3.340000 
      18.007942       -1.904758       3.390000 
      18.038958       -1.904758       3.440000 
      18.070889       -1.904758       3.640000 
      18.101969       -1.904758       3.600000 
      18.132659       -1.904758       3.550000 
      18.163743       -1.904758       3.640000 
      18.194668       -1.904758       3.620000 
      18.225771       -1.904758       3.660000 
      18.256907       -1.904758       3.580000 
      18.287084       -1.904758       3.660000 
      18.317796       -1.904758       3.500000 
      18.348846       -1.904758       3.590000 
      18.380823       -1.904758       3.600000 
      18.411755       -1.904758       3.420000 
      18.441815       -1.904758       3.460000 
      18.471956       -1.904758       3.480000 
      18.503077       -1.904758       3.580000 
      18.534818       -1.904758       3.520000 
      18.565767       -1.904758       3.570000 
      18.596846       -1.904758       3.430000 
      18.627679       -1.904758       3.550000 
      18.658131       -1.904758       3.550000 
      18.688886       -1.904758       3.410000 
      18.718904       -1.904758       3.680000 
      18.749294       -1.904744       3.800000 
      18.781072       -1.904314       3.780000 
      18.811066       -1.899359       3.920000 
      18.842715       -1.880561       3.800000 
      18.873120       -1.864863       3.860000 
      18.903682       -1.880560       3.860000 
      18.934332       -1.899345       3.690000 
      18.965852       -1.903871       3.670000 
      18.997082       -1.899345       3.580000 
      19.028507       -1.880560       4.030000 
      19.060428       -1.864863       3.740000 
      19.091461       -1.880561       3.750000 
      19.122586       -1.899359       3.600000 
      19.153819       -1.904314       3.730000 
      19.185646       -1.904744       3.700000 
      19.217087       -1.904758       3.630000 
      19.247989       -1.904758       3.640000 
      19.278883       -1.904758       3.670000 
      19.308966       -1.904744       3.710000 
      19.338800       -1.904314       3.650000 
      19.368977       -1.899359       3.790000 
      19.400332       -1.880561       3.760000 
      19.431889       -1.864863       3.670000 
      19.462846       -1.880561       3.790000 
      19.494103       -1.899359       3.960000 
      19.525112       -1.904314       3.920000 
      19.556164       -1.904744       3.950000 
      19.587884       -1.904757       3.720000 
      19.619282       -1.904744       3.760000 
      19.649139       -1.904314       3.890000 
      19.679818       -1.899359       3.850000 
      19.712066       -1.880561       3.820000 
      19.743253       -1.864863       3.810000 
      19.774783       -1.880561       3.860000 
      19.806718       -1.899359       3.590000 
      19.837268       -1.904314       3.960000 
      19.868555       -1.904744       3.870000 
      19.899162       -1.904758       3.730000 
      19.929281       -1.904758       3.690000 
      19.960310       -1.904758       3.750000 
      19.990911       -1.904758       3.740000 
      20.021863       -1.904758       3.810000 
      20.052907       -1.904758       3.570000 
      20.084988       -1.904758       3.570000 
      20.115227       -1.904758       3.560000 
      20.146940       -1.904758       3.680000 
      20.178058       -1.904758       3.690000 
      20.209060       -1.904758       3.680000 
      20.240195       -1.904758       3.680000 
      20.270066       -1.904758       3.680000 
      20.302081       -1.904758       3.800000 
      20.333226       -1.904758       3.940000 
      20.363319       -1.904758       3.870000 
      20.394790       -1.904758       3.920000 
      20.426770       -1.904758       3.780000 
      20.458699       -1.904758       3.780000 
      20.489367       -1.904758       3.730000 
      20.521075       -1.904758       3.710000 
      20.552214       -1.904758       3.740000 
      20.583171       -1.904758       3.750000 
      20.613766       -1.904758       3.710000 
      20.643839       -1.904758       3.920000 
      20.674889       -1.904757       3.630000 
      20.705294       -1.904731       3.360000 
      20.735107       -1.903871       3.780000 
      20.765086       -1.893959       3.660000 
      20.796002       -1.856364       3.840000 
      20.826547       -1.824969       3.740000 
      20.858147       -1.856364       3.560000 
      20.889034       -1.893959       3.810000 
      20.919941       -1.903871       3.710000 
      20.951186       -1.904731       3.670000 
      20.982362       -1.904757       3.850000 
      21.013135       -1.904758       3.770000 
