Human trial picking the raspberry twin 

 time    ||     output     ||     loadcell

      0.000000       -796.187302       0.110000 
      0.017966       -796.187302       0.080000 
      0.032171       -796.187302       0.010000 
      0.046656       -796.187302       0.010000 
      0.061102       -796.187302       0.030000 
      0.077034       -796.187302       0.050000 
      0.091925       -796.187302       0.020000 
      0.107285       -796.187302       0.030000 
      0.124324       -796.187302       0.080000 
      0.138714       -796.187297       0.030000 
      0.155164       -796.186113       0.060000 
      0.169698       -796.079558       0.030000 
      0.184759       -792.550933       0.040000 
      0.215332       -749.563742       0.110000 
      0.231338       -556.911151       0.010000 
      0.247336       -239.286330       0.050000 
      0.262582       -46.617529       0.090000 
      0.278604       -3.576229       0.030000 
      0.293676       -0.074473       0.020000 
      0.309658       -0.079942       0.070000 
      0.325915       -0.100714       0.120000 
      0.341158       -0.092257       0.080000 
      0.356310       -0.156734       0.010000 
      0.372587       -0.198892       0.040000 
      0.388632       -0.127608       0.000000 
      0.403506       -0.028662       0.100000 
      0.418942       -0.043320       0.020000 
      0.435832       -0.088639       0.090000 
      0.451263       -0.061700       0.040000 
      0.467222       -0.024494       0.050000 
      0.483177       0.052180       0.020000 
      0.498941       0.093767       0.190000 
      0.514900       0.084478       0.020000 
      0.529408       0.122517       0.100000 
      0.545835       0.112619       0.010000 
      0.561468       0.036568       0.040000 
      0.576887       0.019942       0.010000 
      0.591465       0.037357       0.130000 
      0.607553       0.076921       0.020000 
      0.622650       0.212993       0.070000 
      0.638197       0.265024       0.020000 
      0.654053       0.093364       0.060000 
      0.670044       -0.066542       0.030000 
      0.684433       -0.094883       0.150000 
      0.699936       -0.052252       0.080000 
      0.715181       -0.046972       0.070000 
      0.730122       -0.068899       0.010000 
      0.746083       -0.047443       0.060000 
      0.762040       -0.058618       0.010000 
      0.793732       -0.132551       0.050000 
      0.809179       -0.187681       0.040000 
      0.824138       -0.161660       0.050000 
      0.839853       -0.058174       0.100000 
      0.855158       -0.012921       0.030000 
      0.868962       -0.044675       0.010000 
      0.884988       -0.035289       0.000000 
      0.901034       -0.016450       0.020000 
      0.916052       -0.003841       0.010000 
      0.931192       0.029246       0.020000 
      0.947123       0.041828       0.020000 
      0.961542       0.059727       0.030000 
      0.977957       0.056569       0.010000 
      0.993327       -0.044289       0.100000 
      1.008534       -0.164787       0.110000 
      1.024633       -0.219939       0.000000 
      1.039694       -0.209184       0.000000 
      1.053654       -0.169743       0.030000 
      1.069611       -0.074285       0.100000 
      1.086567       0.051130       0.010000 
      1.102526       0.063766       0.020000 
      1.118045       -0.008824       0.010000 
      1.134002       -0.071099       0.030000 
      1.148961       -0.071529       0.010000 
      1.165915       0.051697       0.060000 
      1.180876       0.134087       0.140000 
      1.196259       0.054381       0.050000 
      1.211446       -0.058569       0.070000 
      1.227160       -0.085454       0.010000 
      1.242210       -0.028538       0.040000 
      1.257550       -0.017863       0.080000 
      1.272744       -0.093096       0.030000 
      1.288273       -0.121806       0.010000 
      1.304981       -0.105682       0.040000 
      1.319499       -0.132549       0.040000 
      1.334458       -0.140524       0.050000 
      1.351528       -0.084235       0.010000 
      1.367135       0.002460       0.040000 
      1.383471       0.110292       0.020000 
      1.398094       0.128314       0.000000 
      1.413536       -0.034416       0.020000 
      1.429511       -0.113165       0.020000 
      1.444948       -0.056361       0.020000 
      1.460627       -0.038397       0.000000 
      1.476299       -0.083665       0.040000 
      1.490256       -0.049158       0.080000 
      1.506792       0.086122       0.070000 
      1.523136       0.069565       0.070000 
      1.535949       -0.078714       0.030000 
      1.552549       -0.135660       0.100000 
      1.566846       -0.101598       0.020000 
      1.584323       -0.023582       0.160000 
      1.598943       0.017562       0.000000 
      1.613894       0.001491       0.090000 
      1.627861       0.017631       0.040000 
      1.643864       0.042202       0.060000 
      1.657988       0.010984       0.030000 
      1.673217       -0.036647       0.020000 
      1.689631       -0.066586       0.080000 
      1.704429       -0.029889       0.090000 
      1.719515       0.096074       0.050000 
      1.734878       0.090136       0.010000 
      1.750781       -0.046389       0.010000 
      1.765901       -0.074226       0.050000 
      1.781728       0.013572       0.080000 
      1.797225       0.046378       0.010000 
      1.813118       0.026991       0.060000 
      1.828100       0.049499       0.000000 
      1.843038       0.092850       0.010000 
      1.859024       0.077733       0.020000 
      1.873166       -0.047428       0.060000 
      1.904088       -0.118524       0.090000 
      1.921077       -0.066699       0.060000 
      1.936288       -0.012841       0.060000 
      1.951864       -0.033517       0.080000 
      1.967493       -0.046916       0.010000 
      1.983147       -0.022320       0.130000 
      1.998105       -0.023179       0.000000 
      2.016057       -0.057687       0.060000 
      2.032016       -0.080998       0.020000 
      2.045414       -0.080998       0.020000 
      2.062344       -0.057674       0.010000 
      2.078436       -0.022736       0.010000 
      2.094248       -0.016947       0.120000 
      2.109188       -0.023605       0.130000 
      2.126477       -0.004368       0.050000 
      2.139570       -0.035332       0.130000 
      2.155456       -0.121736       0.000000 
      2.171532       -0.097609       0.150000 
      2.187207       -0.031749       0.020000 
      2.202166       -0.090428       0.060000 
      2.217394       -0.158918       0.020000 
      2.232431       -0.142887       0.150000 
      2.247786       -0.046823       0.000000 
      2.262735       0.090153       0.040000 
      2.277514       0.160612       0.010000 
      2.291424       0.132801       0.020000 
      2.306549       0.080395       0.050000 
      2.321702       0.008744       0.010000 
      2.337822       0.003801       0.000000 
      2.353642       0.056655       0.000000 
      2.368888       0.098333       0.010000 
      2.383358       0.161525       0.010000 
      2.399990       0.136373       0.060000 
      2.414278       0.037440       0.010000 
      2.430755       0.006449       0.010000 
      2.446127       0.037356       0.040000 
      2.461121       0.070079       0.080000 
      2.476950       0.041316       0.030000 
      2.493389       -0.052275       0.050000 
      2.507953       -0.120450       0.020000 
      2.524304       -0.129405       0.070000 
      2.539104       -0.109200       0.030000 
      2.555977       -0.081082       0.040000 
      2.571445       -0.095767       0.120000 
      2.585799       -0.071197       0.000000 
      2.602754       -0.005724       0.010000 
      2.617928       -0.070744       0.110000 
      2.633818       -0.153546       0.130000 
      2.648777       -0.138844       0.120000 
      2.664899       -0.044666       0.120000 
      2.680811       0.027403       0.050000 
      2.696784       -0.004821       0.040000 
      2.712262       -0.028549       0.070000 
      2.726974       -0.035359       0.040000 
      2.742701       -0.098415       0.010000 
      2.759021       -0.126292       0.000000 
      2.774992       -0.113305       0.050000 
      2.789935       -0.096201       0.030000 
      2.806120       -0.041644       0.060000 
      2.820080       -0.066201       0.110000 
      2.835889       -0.105196       0.000000 
      2.852846       -0.051872       0.040000 
      2.867123       -0.035776       0.080000 
      2.884079       -0.013711       0.090000 
      2.897938       -0.011202       0.080000 
      2.913897       -0.069303       0.030000 
      2.929977       -0.087324       0.040000 
      2.944240       -0.106139       0.030000 
      2.961046       -0.172874       0.060000 
      2.976725       -0.193497       0.010000 
      2.992141       -0.150476       0.020000 
      3.005898       -0.063087       0.020000 
      3.022532       0.021617       0.020000 
      3.037694       0.048928       0.060000 
      3.053670       0.027486       0.010000 
      3.068675       -0.032175       0.050000 
      3.084011       -0.070630       0.020000 
      3.099108       -0.062160       0.000000 
      3.115087       -0.046033       0.050000 
      3.132110       -0.046473       0.020000 
      3.146919       -0.004338       0.060000 
      3.163759       0.052070       0.040000 
      3.178201       0.006430       0.060000 
      3.194043       -0.061714       0.030000 
      3.209777       -0.054100       0.020000 
      3.224973       -0.020495       0.060000 
      3.240532       -0.012908       0.030000 
      3.255130       -0.081925       0.000000 
      3.271087       -0.137920       0.000000 
      3.287045       -0.124507       0.010000 
      3.304014       -0.137963       0.020000 
      3.318974       -0.146875       0.000000 
      3.333584       -0.116463       0.050000 
      3.348277       -0.092657       0.010000 
      3.364416       -0.081482       0.070000 
      3.379407       -0.052745       0.090000 
      3.395129       -0.003965       0.080000 
      3.410584       -0.002123       0.060000 
      3.427363       -0.049604       0.050000 
      3.442491       -0.064428       0.010000 
      3.458128       -0.075613       0.050000 
      3.474906       -0.050087       0.080000 
      3.488895       0.002333       0.060000 
      3.504112       -0.055074       0.020000 
      3.520418       -0.159375       0.010000 
      3.536111       -0.184138       0.070000 
      3.552401       -0.111911       0.080000 
      3.568211       -0.040289       0.090000 
      3.583239       -0.053702       0.020000 
      3.599227       -0.121819       0.090000 
      3.613415       -0.145533       0.070000 
      3.628936       -0.116007       0.010000 
      3.644341       -0.088143       0.040000 
      3.660722       -0.068056       0.010000 
      3.675747       -0.060386       0.100000 
      3.692247       -0.049645       0.010000 
      3.707367       -0.007522       0.050000 
      3.723041       -0.028592       0.100000 
      3.738276       -0.097568       0.160000 
      3.753985       -0.123550       0.060000 
      3.769873       -0.101638       0.050000 
      3.785443       -0.037034       0.090000 
      3.800661       0.019776       0.010000 
      3.816353       0.021631       0.050000 
      3.832536       -0.033518       0.030000 
      3.847557       -0.081469       0.020000 
      3.862481       -0.111494       0.070000 
      3.878907       -0.138379       0.040000 
      3.893865       -0.164414       0.050000 
      3.909627       -0.186327       0.040000 
      3.925141       -0.133034       0.000000 
      3.940259       -0.066688       0.050000 
      3.954888       -0.084223       0.080000 
      3.971844       -0.091228       0.010000 
      3.986013       -0.053341       0.140000 
      4.002850       -0.045508       0.020000 
      4.017810       -0.069880       0.150000 
      4.033770       -0.040096       0.010000 
      4.049633       -0.028258       0.090000 
      4.065577       -0.040508       0.010000 
      4.081178       -0.010745       0.030000 
      4.096138       0.029324       0.090000 
      4.112105       -0.034916       0.060000 
      4.143284       -0.084942       0.100000 
      4.159589       -0.067196       0.110000 
      4.174919       -0.053635       0.060000 
      4.189849       -0.092709       0.050000 
      4.205806       -0.145963       0.050000 
      4.220766       -0.150046       0.020000 
      4.236724       -0.105625       0.070000 
      4.251683       -0.038903       0.070000 
      4.268639       0.021631       0.080000 
      4.284272       0.025175       0.000000 
      4.300582       -0.012381       0.070000 
      4.315226       -0.055915       0.080000 
      4.331076       -0.070187       0.070000 
      4.347972       -0.033061       0.060000 
      4.363928       0.016232       0.040000 
      4.379943       -0.005254       0.060000 
      4.394911       -0.085981       0.050000 
      4.410975       -0.153519       0.050000 
      4.426669       -0.122721       0.020000 
      4.441889       -0.034323       0.050000 
      4.458031       -0.011162       0.090000 
      4.473159       0.018573       0.030000 
      4.488117       0.044832       0.050000 
      4.503285       0.021254       0.030000 
      4.519361       -0.061770       0.050000 
      4.533912       -0.134238       0.050000 
      4.549555       -0.119536       0.010000 
      4.565274       -0.035691       0.080000 
      4.581128       0.054355       0.000000 
      4.597392       0.110416       0.070000 
      4.612437       0.078097       0.030000 
      4.626913       0.024041       0.030000 
      4.643008       0.068725       0.000000 
      4.657794       0.144083       0.090000 
      4.674119       0.162398       0.090000 
      4.688816       0.166911       0.010000 
      4.705019       0.096465       0.020000 
      4.720810       -0.016783       0.090000 
      4.735578       -0.073813       0.110000 
      4.751463       -0.075129       0.000000 
      4.766763       -0.033880       0.040000 
      4.781350       0.012606       0.080000 
      4.796872       -0.007452       0.080000 
      4.812374       -0.025004       0.020000 
      4.827870       -0.009723       0.050000 
      4.843446       -0.059516       0.020000 
      4.859992       -0.095256       0.040000 
      4.873958       -0.085068       0.010000 
      4.889826       -0.051832       0.030000 
      4.905901       0.011333       0.090000 
      4.921859       0.059710       0.020000 
      4.938351       0.023000       0.050000 
      4.953861       -0.055885       0.030000 
      4.968978       -0.041020       0.060000 
      4.985387       0.031913       0.020000 
      5.000822       0.027944       0.050000 
      5.016258       -0.009210       0.060000 
      5.030378       0.024733       0.040000 
      5.046832       0.033369       0.160000 
      5.062986       0.023457       0.040000 
      5.076951       0.042312       0.060000 
      5.091830       0.006365       0.010000 
      5.108366       0.032083       0.040000 
      5.124421       0.090539       0.060000 
      5.140351       0.021711       0.040000 
      5.156222       -0.101621       0.010000 
      5.172054       -0.118151       0.040000 
      5.186321       -0.072959       0.050000 
      5.201812       -0.047833       0.100000 
      5.218632       -0.058184       0.010000 
      5.233371       -0.063571       0.060000 
      5.249834       -0.077469       0.010000 
      5.265054       -0.138836       0.090000 
      5.281409       -0.204282       0.170000 
      5.296646       -0.233391       0.030000 
      5.310857       -0.167502       0.030000 
      5.326419       -0.042518       0.090000 
      5.342478       -0.005334       0.040000 
      5.357987       -0.029878       0.110000 
      5.372541       -0.051070       0.060000 
      5.387935       -0.100683       0.100000 
      5.402752       -0.119081       0.070000 
      5.417952       -0.083713       0.030000 
      5.433172       -0.097152       0.040000 
      5.449887       -0.063943       0.010000 
      5.465159       0.022004       0.050000 
      5.480013       -0.010197       0.010000 
      5.495104       -0.110591       0.070000 
      5.510889       -0.134775       0.080000 
      5.526127       -0.079271       0.030000 
      5.541436       -0.067574       0.020000 
      5.557361       -0.148744       0.060000 
      5.571857       -0.188998       0.060000 
      5.588425       -0.161327       0.040000 
      5.602478       -0.118599       0.030000 
      5.618499       -0.102621       0.080000 
      5.635401       -0.119508       0.000000 
      5.649572       -0.089123       0.050000 
      5.665175       0.007718       0.100000 
      5.681891       0.008091       0.020000 
      5.696557       -0.083214       0.030000 
      5.712619       -0.173840       0.140000 
      5.728889       -0.209624       0.030000 
      5.744294       -0.157647       0.050000 
      5.758807       -0.093210       0.030000 
      5.775085       -0.112851       0.040000 
      5.789267       -0.143815       0.100000 
      5.805184       -0.125366       0.130000 
      5.821286       -0.142005       0.150000 
      5.836134       -0.153493       0.100000 
      5.850432       -0.065850       0.050000 
      5.867360       0.095217       0.240000 
      5.883567       0.179712       0.000000 
      5.897683       0.088034       0.340000 
      5.914241       -0.092235       0.070000 
      5.929593       -0.131536       0.210000 
      5.943904       -0.077860       0.140000 
      5.960397       -0.051862       0.100000 
      5.975981       -0.060341       0.200000 
      5.990804       -0.000794       0.260000 
      6.007159       0.088877       0.100000 
      6.021142       0.034158       0.350000 
      6.036545       -0.030719       0.040000 
      6.053646       -0.016034       0.410000 
      6.068994       -0.003844       0.040000 
      6.084659       -0.034818       0.480000 
      6.099063       -0.050929       0.150000 
      6.115368       0.036000       0.240000 
      6.131001       0.110333       0.050000 
      6.146334       0.030198       0.330000 
      6.161709       -0.079612       0.260000 
      6.177543       -0.087226       0.410000 
      6.192733       -0.008810       0.240000 
      6.207596       0.080337       0.340000 
      6.222834       0.064612       0.160000 
      6.238894       -0.028575       0.330000 
      6.254218       -0.105652       0.130000 
      6.269584       -0.161233       0.080000 
      6.285541       -0.198842       0.190000 
      6.300574       -0.184997       0.240000 
      6.316575       -0.082328       0.160000 
      6.332097       0.030047       0.270000 
      6.347435       0.044485       0.080000 
      6.362722       -0.015136       0.140000 
      6.377552       -0.088196       0.170000 
      6.393843       -0.150432       0.170000 
      6.409033       -0.103411       0.400000 
      6.423340       -0.031776       0.350000 
      6.438850       -0.085513       0.430000 
      6.454151       -0.141074       0.380000 
      6.470358       -0.140218       0.070000 
      6.486142       -0.138366       0.200000 
      6.501866       -0.135261       0.070000 
      6.517375       -0.121819       0.230000 
      6.533039       -0.063987       0.150000 
      6.547878       -0.018347       0.440000 
      6.561973       -0.064403       0.350000 
      6.577914       -0.126332       0.370000 
      6.594306       -0.148634       0.540000 
      6.610289       -0.129060       0.720000 
      6.625491       -0.076500       0.250000 
      6.641064       -0.082509       0.460000 
      6.656162       -0.145521       0.050000 
      6.671359       -0.241142       0.360000 
      6.687361       -0.259777       0.160000 
      6.702889       -0.202098       0.370000 
      6.718450       -0.170244       0.270000 
      6.733514       -0.152285       0.570000 
      6.748810       -0.045659       0.170000 
      6.765068       0.026473       0.440000 
      6.780847       -0.079671       0.290000 
      6.796404       -0.169283       0.270000 
      6.812437       -0.134362       0.470000 
      6.827554       -0.079660       0.350000 
      6.843350       -0.071613       0.550000 
      6.860178       -0.092250       0.410000 
      6.876369       -0.058575       0.380000 
      6.892069       -0.022833       0.170000 
      6.906996       -0.082744       0.050000 
      6.923585       -0.136603       0.310000 
      6.938284       -0.107866       0.050000 
      6.954667       -0.059946       0.270000 
      6.970720       -0.002123       0.150000 
      6.985553       0.006350       0.270000 
      7.001510       -0.010194       0.510000 
      7.016588       -0.031303       0.240000 
      7.030422       -0.108823       0.430000 
      7.046116       -0.175988       0.230000 
      7.062982       -0.208808       0.110000 
      7.078120       -0.210524       0.330000 
      7.093165       -0.133947       0.110000 
      7.107531       -0.054202       0.110000 
      7.122789       -0.098995       0.290000 
      7.138225       -0.180942       0.120000 
      7.153870       -0.174283       0.150000 
      7.169609       -0.117270       0.350000 
      7.186154       -0.073428       0.340000 
      7.201334       -0.055000       0.020000 
      7.217232       -0.020063       0.030000 
      7.233162       0.056529       0.040000 
      7.247931       0.034170       0.180000 
      7.264055       -0.084183       0.270000 
      7.278544       -0.190756       0.270000 
      7.294108       -0.226734       0.260000 
      7.310696       -0.140108       0.320000 
      7.326760       -0.071767       0.160000 
      7.342836       -0.098000       0.280000 
      7.358410       -0.171692       0.270000 
      7.373544       -0.190328       0.100000 
      7.388024       -0.154643       0.030000 
      7.404145       -0.161705       0.110000 
      7.421266       -0.242445       0.160000 
      7.435811       -0.258919       0.530000 
      7.451586       -0.190923       0.260000 
      7.467788       -0.118639       0.700000 
      7.483088       -0.074355       0.670000 
      7.498093       -0.065812       0.010000 
      7.514153       -0.068900       1.060000 
      7.529377       -0.028632       1.960000 
      7.544106       -0.037548       3.960000 
      7.560174       -0.124507       0.960000 
      7.575950       -0.172428       13.090000 
      7.590909       -0.172082       22.760000 
      7.607727       -0.119499       51.940000 
      7.623733       -0.103148       71.320000 
      7.638960       -0.190288       92.360000 
      7.653924       -0.221844       134.850000 
      7.668171       -0.123552       154.710000 
      7.683493       -0.063643       189.910000 
      7.700588       -0.075547       203.450000 
      7.716155       -0.134857       227.100000 
      7.731400       -0.094286       239.920000 
      7.746590       0.067394       255.360000 
      7.762005       0.182687       293.070000 
      7.777487       0.219986       310.530000 
      7.792483       0.356325       324.750000 
      7.808359       0.630281       340.930000 
      7.822828       0.897500       345.650000 
      7.838203       1.135643       351.000000 
      7.853624       1.443256       351.870000 
      7.868756       1.836386       352.770000 
      7.884309       2.156140       355.470000 
      7.899772       2.374150       357.840000 
      7.915458       2.617244       360.490000 
      7.930638       2.886360       365.100000 
      7.947212       3.244653       366.720000 
      7.961406       3.704164       363.280000 
      7.975656       4.137311       359.990000 
      7.992147       4.487065       356.200000 
      8.006869       4.759315       356.070000 
      8.022545       5.090708       358.620000 
      8.038752       5.490539       366.620000 
      8.056018       5.740275       368.040000 
      8.072013       5.827363       365.000000 
      8.086505       5.852032       339.530000 
      8.101863       5.836885       152.510000 
      8.117395       5.818101       66.920000 
      8.132431       5.813119       15.420000 
      8.147943       5.811775       7.370000 
      8.164196       5.800024       0.270000 
      8.180183       5.739072       6.920000 
      8.195205       5.589750       13.670000 
      8.209190       5.370634       11.520000 
      8.224609       5.181837       0.340000 
      8.239923       5.140673       2.700000 
      8.256184       5.180236       12.570000 
      8.272398       5.124808       8.890000 
      8.288005       4.801367       2.810000 
      8.303064       3.753482       4.140000 
      8.318449       1.927551       9.520000 
      8.333514       0.714480       7.670000 
      8.349200       0.624619       3.050000 
      8.364821       0.882580       2.640000 
      8.378965       1.114174       11.020000 
      8.394487       1.298378       11.410000 
      8.411592       1.348815       4.310000 
      8.426457       1.174263       4.820000 
      8.442757       0.934992       8.150000 
      8.457080       0.647434       11.220000 
      8.473208       0.228797       7.170000 
      8.489431       -0.298868       5.530000 
      8.505555       -0.775833       8.420000 
      8.520404       -1.043512       10.790000 
      8.536142       -1.148110       5.850000 
      8.551443       -1.180889       3.850000 
      8.567189       -1.186826       7.540000 
      8.583157       -1.187284       9.490000 
      8.598580       -1.187297       5.330000 
      8.613572       -1.187297       3.760000 
      8.628577       -1.187297       7.790000 
      8.642981       -1.187297       9.210000 
      8.658380       -1.187297       7.610000 
      8.674891       -1.187284       4.460000 
      8.690995       -1.186854       5.960000 
      8.705225       -1.181885       9.420000 
      8.721559       -1.162644       7.590000 
      8.737621       -1.141547       5.480000 
      8.753574       -1.133047       6.950000 
      8.769091       -1.111951       9.260000 
      8.784316       -1.092697       7.810000 
      8.799702       -1.087298       5.830000 
      8.815651       -1.081925       5.690000 
      8.831514       -1.063557       9.520000 
      8.847518       -1.053259       9.420000 
      8.862379       -1.093153       5.540000 
      8.877711       -1.151805       5.640000 
      8.893929       -1.179655       7.370000 
      8.909404       -1.170160       8.410000 
      8.924573       -1.108393       6.400000 
      8.940610       -1.032136       5.510000 
      8.955878       -1.019662       7.200000 
      8.970859       -1.025834       8.450000 
      8.985819       -1.008891       5.800000 
      9.001550       -0.983729       5.070000 
      9.016954       -1.028175       7.540000 
      9.032509       -1.116837       8.270000 
      9.048489       -1.150945       7.320000 
      9.062589       -1.146033       5.650000 
      9.079189       -1.157661       6.590000 
      9.094146       -1.157258       8.650000 
      9.110729       -1.141561       7.680000 
      9.126002       -1.138876       6.140000 
      9.140256       -1.141547       7.300000 
      9.156407       -1.156815       8.590000 
      9.170898       -1.152289       7.520000 
      9.187368       -1.122763       6.500000 
      9.203247       -1.123193       7.500000 
      9.217618       -1.157701       8.430000 
      9.234008       -1.181455       8.160000 
      9.249407       -1.186841       6.060000 
      9.263894       -1.187270       6.190000 
      9.278991       -1.186854       7.830000 
      9.295444       -1.181898       7.560000 
      9.310633       -1.163100       6.520000 
      9.325809       -1.147390       6.150000 
      9.342040       -1.162657       7.090000 
      9.357327       -1.176486       7.440000 
      9.372900       -1.162214       6.460000 
      9.387069       -1.141990       5.980000 
      9.403139       -1.138890       7.500000 
      9.419248       -1.141547       7.970000 
      9.433999       -1.156801       7.420000 
      9.449947       -1.151832       6.260000 
      9.465189       -1.116920       6.770000 
      9.481110       -1.093570       8.010000 
      9.498159       -1.092723       7.510000 
      9.512679       -1.106552       6.530000 
      9.528383       -1.108407       7.040000 
      9.544341       -1.096200       7.850000 
      9.559824       -1.112450       7.180000 
      9.576440       -1.114109       6.500000 
      9.592255       -1.054627       7.120000 
      9.608471       -0.973900       7.720000 
      9.623811       -1.010237       6.790000 
      9.639727       -1.115964       6.240000 
      9.655231       -1.158515       7.130000 
      9.671332       -1.113310       7.610000 
      9.686835       -1.061745       6.660000 
      9.702320       -1.085109       6.330000 
      9.717411       -1.106995       6.580000 
      9.733551       -1.121433       7.600000 
      9.748573       -1.152235       7.310000 
      9.763385       -1.156344       6.690000 
      9.778924       -1.135262       6.940000 
      9.793043       -1.103894       7.420000 
      9.809480       -1.053702       7.380000 
      9.824638       -1.058215       6.920000 
      9.839656       -1.122209       7.040000 
      9.856123       -1.144687       7.580000 
      9.871780       -1.106082       7.760000 
      9.886372       -1.050104       6.740000 
      9.902508       -1.031276       6.590000 
      9.917374       -1.067986       7.000000 
      9.934475       -1.051416       7.540000 
      9.950480       -1.001197       7.090000 
      9.964874       -0.990039       6.490000 
      9.980071       -0.985912       6.980000 
      9.995702       -0.989193       7.390000 
      10.011230       -0.991742       6.930000 
      10.026676       -1.019675       6.590000 
      10.042277       -1.066617       7.040000 
      10.057599       -1.131690       7.370000 
      10.072971       -1.169703       7.350000 
      10.088322       -1.150502       6.840000 
      10.104306       -1.087740       6.900000 
      10.119701       -1.029491       7.440000 
      10.135318       -1.028632       7.210000 
      10.150458       -1.076969       6.790000 
      10.166193       -1.102995       6.990000 
      10.182212       -1.100740       7.360000 
      10.197492       -1.132577       7.200000 
      10.213327       -1.146433       6.980000 
      10.227658       -1.116477       7.000000 
      10.243693       -1.093583       7.200000 
      10.258934       -1.093596       7.140000 
      10.273099       -1.116907       6.950000 
      10.290054       -1.151389       6.830000 
      10.305922       -1.151389       7.160000 
      10.321089       -1.116907       7.240000 
      10.336789       -1.093596       6.830000 
      10.351941       -1.093596       6.800000 
      10.367786       -1.116907       7.010000 
      10.383569       -1.151402       7.280000 
      10.398777       -1.151845       7.170000 
      10.413743       -1.122749       6.930000 
      10.429851       -1.123192       7.120000 
      10.445361       -1.157688       7.310000 
      10.460325       -1.181012       7.100000 
      10.477373       -1.181442       6.870000 
      10.492439       -1.163087       7.120000 
      10.508694       -1.147403       7.300000 
      10.524214       -1.163100       7.210000 
      10.539446       -1.181885       6.900000 
      10.554941       -1.186397       6.980000 
      10.571054       -1.181415       7.320000 
      10.586307       -1.156814       7.220000 
      10.602861       -1.112381       6.900000 
      10.618270       -1.073926       6.930000 
      10.633737       -1.067115       7.210000 
      10.649390       -1.084667       7.140000 
      10.664574       -1.096241       6.940000 
      10.679533       -1.137560       7.020000 
      10.694526       -1.171073       7.220000 
      10.709486       -1.162200       7.050000 
      10.724839       -1.146920       6.910000 
      10.740236       -1.157244       6.860000 
      10.755945       -1.151832       7.260000 
      10.771475       -1.116477       7.250000 
      10.788040       -1.088197       6.960000 
      10.803802       -1.069412       6.900000 
      10.819134       -1.077456       7.130000 
      10.834096       -1.132604       7.120000 
      10.849781       -1.170630       7.010000 
      10.865923       -1.161757       6.970000 
      10.881325       -1.141950       7.080000 
      10.897417       -1.138017       7.150000 
      10.912929       -1.131206       7.010000 
      10.929099       -1.114263       6.940000 
      10.943905       -1.102083       7.110000 
      10.957916       -1.138003       7.190000 
      10.974499       -1.170630       7.170000 
      10.991108       -1.156358       6.980000 
      11.005664       -1.117324       6.950000 
      11.019344       -1.093166       7.250000 
      11.035664       -1.088184       7.220000 
      11.049701       -1.092280       6.960000 
      11.065265       -1.106552       6.990000 
      11.081372       -1.108850       7.150000 
      11.096631       -1.101653       7.080000 
      11.111622       -1.138446       6.990000 
      11.126273       -1.176486       6.950000 
      11.141665       -1.186411       7.250000 
      11.158077       -1.187257       7.270000 
      11.173894       -1.186854       6.980000 
      11.189801       -1.181898       6.980000 
      11.206459       -1.163087       7.070000 
      11.220657       -1.146960       7.320000 
      11.234862       -1.157688       7.130000 
      11.251197       -1.157258       6.910000 
      11.266338       -1.141547       7.100000 
      11.281655       -1.138433       7.260000 
      11.297756       -1.136148       7.130000 
      11.312480       -1.132618       6.950000 
      11.328005       -1.112394       7.080000 
      11.343941       -1.098565       7.170000 
      11.359859       -1.117780       7.180000 
      11.374320       -1.156801       6.960000 
      11.391247       -1.175599       7.040000 
      11.406692       -1.157244       7.240000 
      11.421900       -1.123193       7.110000 
      11.437647       -1.123206       6.900000 
      11.453325       -1.157701       7.040000 
      11.468724       -1.181428       7.220000 
      11.482578       -1.185954       7.080000 
      11.497552       -1.176459       6.880000 
      11.513371       -1.138017       6.910000 
      11.529816       -1.096711       7.100000 
      11.544069       -1.090509       7.130000 
      11.559510       -1.096711       6.960000 
      11.576126       -1.138003       6.900000 
      11.591295       -1.176003       6.990000 
      11.606265       -1.180138       7.060000 
      11.622825       -1.152705       6.970000 
      11.636692       -1.103965       7.010000 
      11.652074       -1.102110       7.110000 
      11.668917       -1.149188       7.090000 
      11.684120       -1.159916       7.020000 
      11.699347       -1.162201       6.980000 
      11.715333       -1.158117       7.100000 
      11.732268       -1.146960       7.160000 
      11.746682       -1.162644       7.020000 
      11.761996       -1.176499       6.950000 
      11.778400       -1.162657       7.000000 
      11.794176       -1.147390       7.160000 
      11.810795       -1.163087       7.150000 
      11.825738       -1.181442       7.020000 
      11.840650       -1.180998       6.980000 
      11.856696       -1.157244       7.090000 
      11.872044       -1.117793       7.110000 
      11.887821       -1.098566       7.020000 
      11.903157       -1.112408       7.040000 
      11.918407       -1.133034       7.110000 
      11.933770       -1.140661       7.040000 
      11.949142       -1.151832       6.940000 
      11.977065       -1.133020       7.110000 
      11.980057       -1.100767       7.120000 
      11.995300       -1.103438       7.120000 
      12.010425       -1.082355       7.090000 
      12.026412       -1.052373       6.970000 
      12.041682       -1.063530       7.030000 
      12.056039       -1.081911       7.200000 
      12.071658       -1.086841       6.990000 
      12.086858       -1.086854       7.010000 
      12.103267       -1.082355       7.060000 
      12.119227       -1.068929       7.110000 
      12.135370       -1.076556       7.010000 
      12.149806       -1.121806       6.960000 
      12.165440       -1.122236       7.210000 
      12.182457       -1.081955       7.220000 
      12.198483       -1.093140       7.080000 
      12.213986       -1.122706       7.070000 
      12.228997       -1.116920       7.040000 
      12.244126       -1.122723       7.070000 
      12.259688       -1.157244       7.100000 
      12.274648       -1.176056       6.970000 
      12.290882       -1.162644       7.090000 
      12.305759       -1.147376       7.170000 
      12.321982       -1.162657       7.140000 
      12.337689       -1.176485       7.080000 
      12.353360       -1.162187       7.030000 
      12.369290       -1.141091       7.130000 
      12.383979       -1.127648       7.070000 
      12.401814       -1.087740       7.030000 
      12.415904       -1.052346       7.040000 
      12.432065       -1.057272       7.130000 
      12.446144       -1.047360       7.150000 
      12.462320       -1.003965       7.010000 
      12.477155       -1.007495       7.080000 
      12.493077       -1.073398       7.110000 
      12.508531       -1.100253       7.050000 
      12.522773       -1.091783       6.960000 
      12.538901       -1.087271       7.060000 
      12.553852       -1.081925       7.110000 
      12.569988       -1.063544       7.160000 
      12.586040       -1.052816       7.150000 
      12.601585       -1.087741       7.140000 
      12.616089       -1.127205       6.990000 
      12.631297       -1.135692       7.110000 
      12.647884       -1.137990       7.100000 
      12.663163       -1.136564       7.080000 
      12.680198       -1.137573       7.030000 
      12.697091       -1.131192       7.110000 
      12.713040       -1.114236       7.080000 
      12.727265       -1.101210       7.020000 
      12.742820       -1.127635       7.070000 
      12.758386       -1.127205       7.150000 
      12.773918       -1.095811       7.170000 
      12.788623       -1.090026       7.140000 
      12.803477       -1.090855       7.050000 
      12.818922       -1.107977       7.110000 
      12.834734       -1.106969       7.110000 
      12.850406       -1.097679       7.060000 
      12.865702       -1.112381       7.050000 
      12.880723       -1.133047       7.130000 
      12.896321       -1.141091       7.230000 
      12.911309       -1.156788       7.150000 
      12.927104       -1.151845       7.000000 
      12.942770       -1.117350       6.980000 
      12.958787       -1.098552       7.060000 
      12.973310       -1.112407       7.010000 
      12.989320       -1.133034       7.040000 
      13.005867       -1.140648       7.120000 
      13.020351       -1.151389       7.180000 
      13.036343       -1.127635       6.950000 
      13.051527       -1.076999       6.980000 
      13.067938       -1.068500       7.060000 
      13.083041       -1.076956       7.170000 
      13.097426       -1.062671       7.100000 
      13.113822       -1.047390       7.020000 
      13.128618       -1.063114       7.080000 
      13.143978       -1.082355       7.110000 
      13.158977       -1.092710       7.100000 
      13.175825       -1.117310       7.060000 
      13.191179       -1.156358       7.200000 
      13.207316       -1.170643       7.160000 
      13.221641       -1.138433       7.030000 
      13.238066       -1.107052       7.050000 
      13.253146       -1.133504       7.050000 
      13.268341       -1.152289       7.020000 
      13.284913       -1.146073       7.060000 
      13.300082       -1.157648       7.020000 
      13.316042       -1.156814       7.000000 
      13.330658       -1.136135       6.990000 
      13.346119       -1.113793       7.070000 
      13.362152       -1.090841       7.090000 
      13.377048       -1.083780       6.950000 
      13.393511       -1.061689       7.020000 
      13.408402       -1.049285       7.120000 
      13.424427       -1.067074       7.040000 
      13.439879       -1.107977       6.980000 
      13.456126       -1.130736       7.050000 
      13.470663       -1.137976       7.080000 
      13.486239       -1.141077       7.010000 
      13.502469       -1.151402       6.980000 
      13.517669       -1.127648       6.940000 
      13.533567       -1.077469       7.020000 
      13.549659       -1.074799       7.060000 
      13.565469       -1.112408       7.080000 
      13.580485       -1.156815       7.130000 
      13.596427       -1.181415       7.060000 
      13.612068       -1.186397       7.050000 
      13.626045       -1.181885       6.990000 
      13.641753       -1.163087       7.010000 
      13.656711       -1.146960       7.010000 
      13.671832       -1.157688       7.010000 
      13.687537       -1.157258       7.070000 
      13.703724       -1.141547       7.080000 
      13.718611       -1.138433       7.020000 
      13.734475       -1.136148       7.000000 
      13.764192       -1.132618       7.000000 
      13.780382       -1.112381       6.970000 
      13.794877       -1.098082       6.980000 
      13.811737       -1.111065       6.990000 
      13.826480       -1.116850       7.050000 
      13.843619       -1.068513       7.000000 
      13.858914       -1.037548       7.050000 
      13.874440       -1.084653       7.100000 
      13.888651       -1.125350       7.080000 
      13.904903       -1.137117       6.970000 
      13.920369       -1.136551       7.090000 
      13.937463       -1.138016       7.140000 
      13.953039       -1.136591       7.030000 
      13.968740       -1.138446       6.980000 
      13.984926       -1.141534       7.080000 
      13.998681       -1.156801       7.050000 
      14.013939       -1.151832       7.020000 
      14.027896       -1.116907       7.050000 
      14.042856       -1.093153       7.080000 
      14.058843       -1.088211       7.000000 
      14.075069       -1.093167       6.990000 
      14.089076       -1.117337       7.070000 
      14.105080       -1.156774       6.960000 
      14.122040       -1.175156       7.010000 
      14.138231       -1.151832       6.910000 
      14.152249       -1.098539       7.030000 
      14.167743       -1.077469       6.980000 
      14.181908       -1.103908       7.000000 
      14.198059       -1.111965       7.000000 
      14.213564       -1.122293       7.040000 
      14.229564       -1.157231       7.050000 
      14.244763       -1.176042       7.010000 
      14.260708       -1.162200       7.140000 
      14.276204       -1.141964       6.940000 
      14.292293       -1.138017       6.980000 
      14.309315       -1.131192       6.970000 
      14.324256       -1.113806       7.080000 
      14.340381       -1.096254       7.050000 
      14.354784       -1.108864       6.980000 
      14.370195       -1.112381       7.110000 
      14.386383       -1.121863       7.080000 
      14.401379       -1.151832       7.090000 
      14.417394       -1.151859       7.060000 
      14.434320       -1.122749       7.090000 
      14.448509       -1.123179       7.050000 
      14.465888       -1.157258       6.960000 
      14.481095       -1.176056       7.080000 
      14.497797       -1.162644       6.980000 
      14.512547       -1.147390       7.110000 
      14.527741       -1.163100       7.020000 
      14.542994       -1.181898       6.980000 
      14.559162       -1.186854       6.970000 
      14.574275       -1.187271       7.030000 
      14.589556       -1.186854       6.940000 
      14.604433       -1.181898       6.940000 
      14.619586       -1.163100       6.960000 
      14.635430       -1.147390       7.060000 
      14.650597       -1.162643       7.070000 
      14.666417       -1.176029       6.880000 
      14.682267       -1.156371       7.030000 
      14.697678       -1.112381       7.130000 
      14.712873       -1.074368       7.010000 
      14.728408       -1.072500       7.010000 
      14.744100       -1.108394       7.060000 
      14.759758       -1.129863       7.040000 
      14.773595       -1.127192       6.950000 
      14.788936       -1.093140       6.990000 
      14.805576       -1.077469       7.120000 
      14.820539       -1.109280       7.100000 
      14.836698       -1.135718       7.010000 
      14.852419       -1.156801       6.860000 
      14.868274       -1.157674       7.050000 
      14.883902       -1.146946       7.110000 
      14.899549       -1.162644       7.160000 
      14.914349       -1.176499       6.990000 
      14.930199       -1.162657       7.150000 
      14.946167       -1.147376       7.250000 
      14.962190       -1.162643       7.050000 
      14.977513       -1.176043       7.010000 
      14.993379       -1.156815       7.070000 
      15.008606       -1.117780       7.170000 
      15.023422       -1.098552       7.050000 
      15.038763       -1.111964       6.940000 
      15.054057       -1.127635       7.010000 
      15.070259       -1.116464       7.080000 
      15.086243       -1.111951       7.080000 
      15.101829       -1.109253       6.920000 
      15.117831       -1.100337       6.990000 
      15.134735       -1.122249       7.070000 
      15.149189       -1.103894       7.110000 
      15.163974       -1.066728       7.020000 
      15.179420       -1.114679       6.920000 
      15.195428       -1.171086       7.260000 
      15.210567       -1.185525       7.160000 
      15.226350       -1.181858       6.910000 
      15.241573       -1.163086       6.890000 
      15.257087       -1.146960       7.040000 
      15.273234       -1.157688       7.150000 
      15.288383       -1.157258       7.000000 
      15.303366       -1.141521       7.030000 
      15.318490       -1.137560       7.160000 
      15.335568       -1.125780       7.080000 
      15.349776       -1.089179       7.030000 
      15.365349       -1.051404       7.020000 
      15.381528       -1.065855       7.090000 
      15.397639       -1.090855       7.120000 
      15.412221       -1.132174       6.990000 
      15.442565       -1.152248       7.030000 
      15.457781       -1.146046       7.040000 
      15.473464       -1.156775       7.040000 
      15.489113       -1.146459       7.050000 
      15.506098       -1.093167       7.140000 
      15.521088       -1.059101       7.140000 
      15.537292       -1.093596       7.000000 
      15.553340       -1.151416       7.030000 
      15.568037       -1.175586       6.980000 
      15.583220       -1.162173       7.070000 
      15.599671       -1.141534       7.100000 
      15.615134       -1.133061       6.900000 
      15.631260       -1.112394       6.910000 
      15.647094       -1.098122       7.060000 
      15.663240       -1.112368       7.090000 
      15.678699       -1.132161       6.970000 
      15.694620       -1.130279       7.010000 
      15.709932       -1.107964       7.030000 
      15.725598       -1.067101       7.170000 
      15.741028       -1.050145       7.120000 
      15.756976       -1.071614       6.990000 
      15.772378       -1.121819       7.030000 
      15.786859       -1.127622       7.080000 
      15.803321       -1.106152       7.060000 
      15.818735       -1.133020       6.920000 
      15.833354       -1.146432       7.050000 
      15.849547       -1.116007       7.200000 
      15.865105       -1.087284       6.980000 
      15.880201       -1.058158       6.840000 
      15.894461       -1.023233       6.950000 
      15.910931       -1.023650       7.210000 
      15.926251       -1.063114       7.120000 
      15.941360       -1.106109       6.960000 
      15.957429       -1.132591       6.980000 
      15.972969       -1.141520       7.110000 
      15.988510       -1.162173       6.990000 
      16.003659       -1.175599       6.950000 
      16.019748       -1.151845       7.050000 
      16.034684       -1.098539       7.160000 
      16.050313       -1.077469       7.140000 
      16.066700       -1.103881       6.920000 
      16.080734       -1.111078       6.990000 
      16.096169       -1.111495       7.200000 
      16.110893       -1.108837       7.120000 
      16.127611       -1.096267       7.000000 
      16.143726       -1.114250       6.960000 
      16.157872       -1.136591       7.110000 
      16.173598       -1.162187       7.200000 
      16.189238       -1.180985       7.060000 
      16.204242       -1.176028       7.020000 
      16.221114       -1.137949       7.040000 
      16.236240       -1.094897       7.150000 
      16.251129       -1.067570       6.960000 
      16.266667       -0.983282       6.980000 
      16.282470       -0.900436       7.100000 
      16.298117       -0.935361       7.050000 
      16.313487       -1.046929       7.000000 
      16.343233       -1.120866       7.030000 
      16.358997       -1.139264       7.150000 
      16.374182       -1.145492       7.000000 
      16.389316       -1.097152       6.990000 
      16.406178       -1.002110       7.010000 
      16.421203       -0.956027       7.020000 
      16.435984       -0.968001       6.980000 
      16.450950       -1.013390       7.080000 
      16.466940       -1.054947       7.020000 
      16.482197       -1.078354       7.000000 
      16.497605       -1.072017       6.950000 
      16.512975       -1.097665       7.150000 
      16.528140       -1.146863       7.060000 
      16.544202       -1.156371       6.980000 
      16.560112       -1.141534       7.050000 
      16.576169       -1.138890       7.140000 
      16.591020       -1.142004       7.000000 
      16.607145       -1.162644       6.930000 
      16.623046       -1.181442       6.990000 
      16.637823       -1.181441       7.150000 
      16.653077       -1.162630       7.040000 
      16.668649       -1.141534       7.000000 
      16.683660       -1.132618       7.030000 
      16.698919       -1.106995       7.150000 
      16.713319       -1.073912       7.040000 
      16.729182       -1.072044       7.000000 
      16.745463       -1.103008       7.050000 
      16.762420       -1.106095       7.250000 
      16.777735       -1.092253       7.270000 
      16.793691       -1.087701       6.960000 
      16.808650       -1.086438       7.050000 
      16.824726       -1.076956       7.140000 
      16.839737       -1.044746       7.070000 
      16.853909       -1.037118       6.970000 
      16.869170       -1.103438       7.040000 
      16.885905       -1.146003       6.970000 
      16.901511       -1.140661       7.040000 
      16.917325       -1.138849       6.990000 
      16.932755       -1.141547       7.110000 
      16.948159       -1.156801       7.140000 
      16.962758       -1.151832       6.990000 
      16.979331       -1.116893       7.000000 
      16.995258       -1.092670       7.100000 
      17.009519       -1.081482       7.000000 
      17.025451       -1.052759       7.070000 
      17.040445       -1.004408       7.100000 
      17.056360       -1.007509       6.990000 
      17.072054       -1.073398       7.020000 
      17.102979       -1.100266       7.080000 
      17.119150       -1.092226       6.950000 
      17.134521       -1.092670       6.990000 
      17.150254       -1.106122       7.030000 
      17.166042       -1.103438       7.030000 
      17.181395       -1.076999       6.930000 
      17.196343       -1.092697       6.970000 
      17.211951       -1.122249       7.100000 
      17.229718       -1.111495       7.090000 
      17.244164       -1.097653       7.130000 
      17.260469       -1.106995       7.090000 
      17.276294       -1.108864       7.050000 
      17.290723       -1.101653       7.020000 
      17.305497       -1.138446       7.000000 
      17.321954       -1.176485       7.060000 
      17.337425       -1.186397       7.040000 
      17.352776       -1.186787       7.010000 
      17.369148       -1.180555       6.980000 
      17.384045       -1.146446       7.060000 
      17.399008       -1.068956       7.030000 
      17.415035       -1.013378       7.040000 
      17.431209       -1.039803       7.000000 
      17.446040       -1.081912       6.990000 
      17.459930       -1.110622       7.100000 
      17.475063       -1.127608       7.090000 
      17.490417       -1.116907       7.040000 
      17.506339       -1.117350       6.930000 
      17.522735       -1.133491       6.920000 
      17.537232       -1.141560       7.010000 
      17.552451       -1.162617       6.980000 
      17.568209       -1.180998       6.990000 
      17.583340       -1.176015       7.080000 
      17.598622       -1.137520       7.050000 
      17.615686       -1.089982       7.060000 
      17.630498       -1.050088       7.060000 
      17.647331       -0.983312       7.100000 
      17.662211       -0.982439       7.050000 
      17.677570       -1.038833       7.120000 
      17.691856       -1.035719       7.100000 
      17.707491       -1.027262       7.110000 
      17.723401       -1.053148       6.990000 
      17.738487       -1.062241       6.940000 
      17.755063       -1.066201       7.030000 
      17.770986       -1.084626       7.040000 
      17.786848       -1.095797       6.960000 
      17.803105       -1.132107       7.070000 
      17.817205       -1.145103       7.110000 
      17.832509       -1.100709       7.170000 
      17.848085       -1.025934       7.070000 
      17.862543       -0.992255       7.040000 
      17.878105       -1.054184       6.950000 
      17.894312       -1.090342       7.020000 
      17.910776       -1.072582       7.130000 
      17.925404       -1.072433       7.000000 
      17.940493       -1.107950       6.950000 
      17.956292       -1.124464       7.130000 
      17.972259       -1.102994       7.090000 
      17.987549       -1.053205       7.000000 
      18.002951       -1.051942       6.980000 
      18.018794       -1.087670       7.150000 
      18.034351       -1.062227       7.060000 
      18.049963       -1.031250       7.120000 
      18.066201       -1.055030       7.130000 
      18.080607       -1.060815       7.120000 
      18.097447       -1.067613       7.020000 
      18.111471       -1.082315       6.980000 
      18.126919       -1.086880       7.240000 
      18.142209       -1.087701       7.280000 
      18.157219       -1.091810       6.930000 
      18.173174       -1.100709       7.240000 
      18.188057       -1.079214       7.040000 
      18.203801       -1.036232       6.960000 
      18.219497       -1.058158       7.050000 
      18.233406       -1.074285       7.240000 
      18.249017       -1.060416       6.770000 
      18.266021       -1.107937       7.140000 
      18.281363       -1.136091       7.560000 
      18.297079       -1.097666       7.350000 
      18.312551       -1.082828       6.930000 
      18.328648       -1.128104       7.080000 
      18.344272       -1.151845       7.420000 
      18.359384       -1.146060       7.240000 
      18.375427       -1.157647       6.780000 
      18.390279       -1.156801       6.980000 
      18.406053       -1.135718       7.450000 
      18.422137       -1.109280       7.180000 
      18.437645       -1.077469       6.820000 
      18.453207       -1.093153       7.170000 
      18.467359       -1.127635       7.370000 
      18.483732       -1.135275       7.110000 
      18.497797       -1.133007       6.760000 
      18.514194       -1.116880       6.750000 
      18.528578       -1.111064       7.470000 
      18.545342       -1.098025       7.350000 
      18.559357       -1.046973       6.910000 
      18.575909       -1.023206       7.030000 
      18.591264       -1.033947       7.400000 
      18.606617       -1.041574       7.220000 
      18.622614       -1.062644       6.830000 
      18.637747       -1.081885       6.760000 
      18.653055       -1.086841       7.500000 
      18.668326       -1.086841       7.360000 
      18.684246       -1.081912       6.760000 
      18.698342       -1.063557       6.870000 
      18.714163       -1.053259       7.180000 
      18.728624       -1.093153       7.100000 
      18.743986       -1.151832       6.900000 
      18.760427       -1.180542       6.910000 
      18.775352       -1.180971       7.150000 
      18.791907       -1.157231       7.210000 
      18.806911       -1.117363       7.040000 
      18.822004       -1.093596       6.820000 
      18.838451       -1.093153       7.100000 
      18.854441       -1.111481       7.190000 
      18.868948       -1.126319       6.970000 
      18.885441       -1.101153       6.910000 
      18.899467       -1.050145       6.960000 
      18.915534       -1.037548       7.160000 
      18.930377       -1.103021       7.160000 
      18.946620       -1.141034       6.910000 
      18.961100       -1.121420       6.990000 
      18.978093       -1.117766       7.080000 
      18.992539       -1.133477       7.150000 
      19.008909       -1.140648       7.020000 
      19.024609       -1.150946       6.960000 
      19.040134       -1.122236       7.090000 
      19.056471       -1.052816       7.280000 
      19.070878       -1.029048       7.000000 
      19.085274       -1.058158       6.810000 
      19.100445       -1.081455       7.160000 
      19.116926       -1.086411       7.350000 
      19.132153       -1.082328       7.290000 
      19.148215       -1.068513       6.830000 
      19.164059       -1.072043       7.000000 
      19.179275       -1.108394       7.300000 
      19.194413       -1.130306       7.070000 
      19.210891       -1.132590       6.850000 
      19.226907       -1.117297       7.130000 
      19.242072       -1.116020       7.250000 
      19.258435       -1.116823       7.030000 
      19.274077       -1.062657       6.920000 
      19.289894       -1.007026       7.150000 
      19.305438       -1.008407       7.260000 
      19.320418       -0.995781       7.200000 
      19.336116       -0.944329       6.820000 
      19.350322       -0.913781       6.900000 
      19.366262       -0.968513       7.150000 
      19.381181       -1.040604       7.100000 
      19.396173       -1.050959       6.960000 
      19.411519       -1.022722       7.020000 
      19.427348       -1.023165       7.170000 
      19.443666       -1.056801       7.180000 
      19.459000       -1.070200       6.930000 
      19.474144       -1.032617       6.850000 
      19.489139       -0.978316       7.200000 
      19.506169       -0.979338       7.230000 
      19.520750       -1.026263       6.900000 
      19.536364       -1.054170       6.820000 
      19.551868       -1.055863       7.150000 
      19.567556       -1.112893       7.220000 
      19.583878       -1.159818       7.070000 
      19.599759       -1.131717       6.910000 
      19.615808       -1.077402       7.080000 
      19.630831       -1.068513       7.070000 
      19.646618       -1.076969       6.920000 
      19.662568       -1.063114       6.840000 
      19.677903       -1.052775       7.180000 
      19.692904       -1.086840       7.180000 
      19.707878       -1.115937       7.010000 
      19.723281       -1.080985       7.040000 
      19.739389       -1.022306       7.170000 
      19.754655       -0.988654       7.080000 
      19.771268       -0.969426       7.060000 
      19.786467       -0.977483       7.060000 
      19.803016       -1.033464       7.010000 
      19.817908       -1.080555       7.100000 
      19.833105       -1.099783       7.080000 
      19.849846       -1.078314       6.950000 
      19.865804       -1.025877       7.010000 
      19.880303       -1.015149       7.060000 
      19.896034       -1.018250       7.120000 
      19.911455       -1.046530       6.890000 
      19.927418       -1.097542       6.910000 
      19.941128       -1.104779       7.250000 
      19.956529       -1.081871       7.380000 
      19.973372       -1.044275       6.810000 
      19.987458       -1.025863       6.750000 
      20.002894       -1.048745       7.280000 
      20.019260       -1.030762       7.200000 
      20.034404       -0.998096       6.920000 
      20.049732       -0.993140       6.990000 
      20.064202       -1.006565       7.310000 
      20.080415       -1.008421       7.130000 
      20.096153       -0.996711       6.790000 
      20.111166       -1.020091       6.760000 
      20.125982       -1.066161       7.430000 
      20.141822       -1.125405       7.330000 
      20.157980       -1.134708       6.670000 
      20.173719       -1.062200       6.850000 
      20.189154       -0.983298       7.270000 
      20.204375       -0.969856       7.210000 
      20.220454       -0.987781       6.810000 
      20.236014       -1.011508       6.910000 
      20.252184       -1.032591       7.260000 
      20.266679       -1.036148       7.360000 
      20.281790       -1.038447       6.830000 
      20.297675       -1.042004       6.830000 
      20.314223       -1.063073       7.250000 
      20.330396       -1.086411       7.240000 
      20.346025       -1.100683       6.920000 
      20.361253       -1.083753       7.020000 
      20.377228       -1.050947       7.290000 
      20.393196       -1.065372       7.150000 
      20.407423       -1.084556       6.860000 
      20.423882       -1.096722       7.070000 
      20.438424       -1.058104       7.280000 
      20.454339       -1.012034       7.010000 
      20.470229       -1.033907       6.890000 
      20.485342       -1.051402       6.930000 
      20.500108       -1.034832       7.210000 
      20.515504       -1.003894       7.150000 
      20.530684       -0.954145       6.990000 
      20.546484       -0.963641       7.080000 
      20.562223       -1.047333       7.130000 
      20.578083       -1.096709       7.130000 
      20.593386       -1.094884       7.120000 
      20.609812       -1.108367       7.020000 
      20.624409       -1.106538       7.050000 
      20.641180       -1.092280       7.120000 
      20.655632       -1.088170       7.070000 
      20.671420       -1.092709       6.970000 
      20.687648       -1.111468       7.130000 
      20.703232       -1.126318       7.150000 
      20.718910       -1.101126       7.190000 
      20.734037       -1.049272       7.000000 
      20.749838       -1.027193       7.020000 
      20.765183       -1.060013       7.120000 
      20.780172       -1.084999       7.190000 
      20.794975       -1.107494       7.060000 
      20.810869       -1.106069       7.050000 
      20.826829       -1.086867       7.030000 
      20.842050       -1.063517       7.100000 
      20.857680       -1.046973       7.090000 
      20.873778       -1.057688       7.020000 
      20.889360       -1.057258       7.050000 
      20.903738       -1.041547       7.050000 
      20.919163       -1.038407       7.070000 
      20.934952       -1.035289       7.000000 
      20.951495       -1.022706       7.140000 
      20.967433       -0.974799       7.160000 
      20.982534       -0.967185       7.120000 
      20.998229       -1.049618       6.940000 
      21.015240       -1.099823       7.010000 
