Human trial picking the raspberry twin 

 time    ||     output compensated 

      0       -799.924390 
      0       -799.924390 
      0       -799.924390 
      0       -799.924390 
      0       -799.924390 
      0       -799.924390 
      0       -799.924390 
      0       -799.924390 
      0       -799.924390 
      0       -799.924385 
      0       -799.923196 
      0       -799.816146 
      0       -796.271123 
      0       -753.084165 
      0       -559.536309 
      0       -240.436208 
      0       -46.880294 
      0       -3.656557 
      0       -0.089219 
      0       0.023796 
      0       0.014065 
      0       -0.022517 
      0       -0.060723 
      0       -0.051227 
      0       -0.045025 
      0       -0.019417 
      0       0.015938 
      0       0.024021 
      0       0.026280 
      0       0.024008 
      0       0.015535 
      0       -0.023500 
      1       -0.053482 
      1       -0.024373 
      1       0.005153 
      1       -0.019873 
      1       -0.040083 
      1       -0.032000 
      1       -0.040057 
      1       -0.019000 
      1       0.015508 
      1       0.018622 
      1       0.002110 
      1       -0.015000 
      1       0.002136 
      1       0.019496 
      1       0.025890 
      1       0.024881 
      1       0.026333 
      1       0.024895 
      1       0.026333 
      1       0.024895 
      1       0.026333 
      1       0.024895 
      1       0.026333 
      1       0.024895 
      1       0.026333 
      1       0.024881 
      1       0.025877 
      1       0.019039 
      1       -0.003719 
      1       -0.045026 
      1       -0.066938 
      1       -0.064267 
      1       -0.029772 
      1       -0.008715 
      1       -0.016773 
      1       -0.008715 
      1       -0.029772 
      1       -0.064267 
      1       -0.066938 
      2       -0.045026 
      2       -0.003720 
      2       0.019026 
      2       0.025433 
      2       0.019482 
      2       0.002136 
      2       -0.015013 
      2       0.001693 
      2       0.014096 
      2       0.001666 
      2       -0.015886 
      2       -0.008232 
      2       -0.023929 
      2       -0.034670 
      2       -0.002846 
      2       0.019066 
      2       0.025877 
      2       0.024881 
      2       0.026333 
      2       0.024895 
      2       0.026333 
      2       0.024881 
      2       0.025890 
      2       0.019495 
      2       0.002110 
      2       -0.015873 
      2       -0.008232 
      2       -0.023929 
      2       -0.034670 
      2       -0.002846 
      2       0.019065 
      2       0.025837 
      2       0.023565 
      2       0.010565 
      3       -0.042754 
      3       -0.075035 
      3       -0.038715 
      3       -0.045526 
      3       -0.102749 
      3       -0.103328 
      3       -0.033303 
      3       0.007811 
      3       0.001223 
      3       -0.015026 
      3       0.002136 
      3       0.019469 
      3       0.024754 
      3       0.013695 
      3       -0.022225 
      3       -0.054507 
      3       -0.021458 
      3       0.014540 
      3       0.025193 
      3       0.019049 
      3       -0.002809 
      3       -0.034299 
      3       -0.023735 
      3       -0.012451 
      3       -0.034007 
      3       -0.017289 
      3       0.017061 
      3       0.024866 
      3       0.026880 
      3       0.025213 
      3       0.026345 
      3       0.023381 
      3       0.009813 
      3       -0.048816 
      3       -0.108243 
      3       -0.117794 
      3       -0.105983 
      3       -0.045007 
      3       0.013973 
      3       0.027168 
      4       0.029597 
      4       0.027916 
      4       0.029062 
      4       0.027347 
      4       0.028497 
      4       0.026775 
      4       0.027506 
      4       0.020901 
      4       0.003506 
      4       -0.013494 
      4       0.003606 
      4       0.020756 
      4       0.026878 
      4       0.025598 
      4       0.026353 
      4       0.019760 
      4       0.002376 
      4       -0.014612 
      4       0.002498 
      4       0.019659 
      4       0.025793 
      4       0.024524 
      4       0.025290 
      4       0.018694 
      4       0.000895 
      4       -0.020985 
      4       -0.022447 
      4       -0.021428 
      4       -0.009155 
      4       -0.028672 
      4       -0.053123 
      4       -0.022523 
      4       0.015934 
      4       0.019257 
      4       0.002730 
      4       -0.014235 
      4       0.002871 
      4       0.020015 
      4       0.025707 
      4       0.019106 
      4       -0.003603 
      5       -0.044460 
      5       -0.065695 
      5       -0.061968 
      5       -0.022292 
      5       0.017413 
      5       0.025654 
      5       0.027672 
      5       0.025998 
      5       0.027162 
      5       0.025467 
      5       0.026636 
      5       0.024932 
      5       0.025682 
      5       0.019094 
      5       0.001717 
      5       -0.015264 
      5       0.001853 
      5       0.019020 
      5       0.025160 
      5       0.023897 
      5       0.024670 
      5       0.018093 
      5       0.000726 
      5       -0.016259 
      5       0.000429 
      5       0.012292 
      5       -0.004617 
      5       -0.035652 
      5       -0.024648 
      5       -0.008861 
      5       -0.016337 
      5       0.001629 
      5       0.018825 
      5       0.024967 
      5       0.023692 
      5       0.024042 
      5       0.012564 
      5       -0.023383 
      6       -0.056492 
      6       -0.032823 
      6       -0.029425 
      6       -0.034858 
      6       -0.002578 
      6       0.019140 
      6       0.025267 
      6       0.019122 
      6       0.001758 
      6       -0.015223 
      6       0.001893 
      6       0.019060 
      6       0.025200 
      6       0.023949 
      6       0.025147 
      6       0.023472 
      6       0.024661 
      6       0.022990 
      6       0.024184 
      6       0.022492 
      6       0.022840 
      6       0.011375 
      6       -0.024561 
      6       -0.057658 
      6       -0.033977 
      6       -0.030568 
      6       -0.035989 
      6       -0.003698 
      6       0.018045 
      7       0.024608 
      7       0.023430 
      7       0.026428 
      7       0.047423 
      7       0.159817 
      7       0.382214 
      7       0.582214 
      7       0.694033 
      7       0.851025 
      7       1.097674 
      7       1.410712 
      7       1.723628 
      7       1.999846 
      7       2.246070 
      7       2.518702 
      7       2.809728 
      7       3.024957 
      7       3.217000 
      7       3.495337 
      7       3.802503 
      7       4.000258 
      7       4.087777 
      7       4.189663 
      7       4.454569 
      7       4.771035 
      7       4.882583 
      7       4.824088 
      7       4.774656 
      7       4.772104 
      7       4.726661 
      7       4.653709 
      7       4.537857 
      7       4.361711 
      7       4.181811 
      7       4.037017 
      7       3.708173 
      7       2.976714 
      8       1.761672 
      8       0.267371 
      8       -0.367051 
      8       0.273818 
      8       0.892618 
      8       0.935421 
      8       0.612190 
      8       0.034366 
      8       -0.554703 
      8       -0.952823 
      8       -1.224687 
      8       -1.501788 
      8       -1.802200 
      8       -1.979761 
      8       -2.034968 
      8       -2.055207 
      8       -2.038165 
      8       -2.020806 
      8       -2.014412 
      8       -2.015421 
      8       -2.013969 
      8       -2.015407 
      8       -2.013969 
      8       -2.015407 
      8       -2.013996 
      8       -1.996131 
      8       -1.984558 
      8       -2.003356 
      8       -2.012979 
      8       -1.963193 
      8       -1.904917 
      8       -1.877479 
      8       -1.856429 
      8       -1.839263 
      8       -1.819446 
      8       -1.802676 
      8       -1.783225 
      9       -1.766817 
      9       -1.765378 
      9       -1.766817 
      9       -1.765378 
      9       -1.766817 
      9       -1.765378 
      9       -1.766830 
      9       -1.765835 
      9       -1.772646 
      9       -1.794544 
      9       -1.825939 
      9       -1.810242 
      9       -1.775747 
      9       -1.767703 
      9       -1.765848 
      9       -1.772216 
      9       -1.789602 
      9       -1.807584 
      9       -1.799944 
      9       -1.815640 
      9       -1.826355 
      9       -1.793685 
      9       -1.762278 
      9       -1.722409 
      9       -1.706256 
      9       -1.737221 
      9       -1.754606 
      9       -1.747992 
      9       -1.754650 
      9       -1.802185 
      10       -1.810242 
      10       -1.799500 
      10       -1.807571 
      10       -1.789602 
      10       -1.772216 
      10       -1.765821 
      10       -1.766830 
      10       -1.765378 
      10       -1.766817 
      10       -1.765378 
      10       -1.766817 
      10       -1.765378 
      10       -1.766817 
      10       -1.765378 
      10       -1.766817 
      10       -1.765378 
      10       -1.766830 
      11       -1.765821 
      11       -1.772216 
      11       -1.789575 
      11       -1.806711 
      11       -1.789575 
      11       -1.772216 
      11       -1.765821 
      11       -1.766830 
      11       -1.765378 
      11       -1.766817 
      11       -1.747724 
      11       -1.731671 
      11       -1.712930 
      11       -1.697225 
      11       -1.678829 
      11       -1.663438 
      11       -1.644529 
      11       -1.619695 
      11       -1.564854 
      11       -1.519549 
      11       -1.534010 
      11       -1.557314 
      11       -1.550129 
      11       -1.536903 
      12       -1.520136 
      12       -1.506359 
      12       -1.489872 
      12       -1.476410 
      12       -1.460648 
      12       -1.452385 
      12       -1.455472 
      12       -1.462788 
      12       -1.449806 
      12       -1.433662 
      12       -1.397455 
      12       -1.365869 
      12       -1.345867 
      12       -1.333406 
      12       -1.318635 
      12       -1.306873 
      12       -1.292380 
      12       -1.280881 
      12       -1.266674 
      12       -1.256269 
      13       -1.251682 
      13       -1.273303 
      13       -1.275671 
      13       -1.226515 
      13       -1.169466 
      13       -1.121373 
      13       -1.125261 
      13       -1.148145 
      13       -1.144639 
      13       -1.135455 
      13       -1.122703 
      13       -1.112900 
      13       -1.100347 
      13       -1.090741 
      13       -1.077558 
      13       -1.058368 
      13       -1.008289 
      13       -0.958737 
      13       -0.941586 
      14       -0.939734 
      14       -0.969806 
      14       -0.999602 
      14       -0.998021 
      14       -0.990316 
      14       -0.979016 
      14       -0.970650 
      14       -0.959519 
      14       -0.951348 
      14       -0.940410 
      14       -0.932404 
      14       -0.920805 
      14       -0.903208 
      14       -0.855532 
      14       -0.817334 
      14       -0.839242 
      14       -0.874400 
      14       -0.892655 
      14       -0.901543 
      14       -0.875590 
      14       -0.849648 
      14       -0.834822 
      14       -0.827472 
      14       -0.817760 
      14       -0.811006 
      14       -0.801472 
      14       -0.794881 
      15       -0.785509 
      15       -0.779078 
      15       -0.769863 
      15       -0.763588 
      15       -0.754528 
      15       -0.748407 
      15       -0.739499 
      15       -0.733528 
      15       -0.724769 
      15       -0.718945 
      15       -0.710332 
      15       -0.704652 
      15       -0.696182 
      15       -0.690644 
      15       -0.682313 
      15       -0.676888 
      15       -0.667844 
      15       -0.652777 
      15       -0.607605 
      15       -0.571873 
      15       -0.595810 
      15       -0.628496 
      15       -0.630600 
      16       -0.626569 
      16       -0.618892 
      16       -0.613689 
      16       -0.600809 
      16       -0.573148 
      16       -0.537174 
      16       -0.556742 
      16       -0.618051 
      16       -0.636811 
      16       -0.600201 
      16       -0.572545 
      16       -0.560077 
      16       -0.555462 
      16       -0.548470 
      16       -0.544383 
      16       -0.536677 
      17       -0.523334 
      17       -0.483950 
      17       -0.463571 
      17       -0.490015 
      17       -0.506795 
      17       -0.508470 
      17       -0.502400 
      17       -0.498813 
      17       -0.492401 
      17       -0.488901 
      17       -0.482588 
      18       -0.479160 
      18       -0.472093 
      18       -0.458983 
      18       -0.415749 
      18       -0.381936 
      18       -0.407773 
      18       -0.442339 
      18       -0.446304 
      18       -0.444116 
      18       -0.438277 
      18       -0.435319 
      18       -0.429541 
      18       -0.426644 
      18       -0.420102 
      18       -0.407486 
      18       -0.363916 
      18       -0.320808 
      18       -0.310036 
      18       -0.314499 
      18       -0.350823 
      18       -0.386810 
      18       -0.391357 
      18       -0.389719 
      18       -0.384424 
      18       -0.382004 
      19       -0.376760 
      19       -0.374416 
      19       -0.369248 
      19       -0.366980 
      19       -0.361886 
      19       -0.359691 
      19       -0.354657 
      19       -0.352109 
      19       -0.342257 
      19       -0.321649 
      19       -0.301468 
      19       -0.315418 
      19       -0.329449 
      19       -0.332485 
      19       -0.328162 
      19       -0.326317 
      19       -0.321630 
      19       -0.319812 
      19       -0.314338 
      19       -0.302806 
      19       -0.261134 
      19       -0.228867 
      19       -0.256261 
      19       -0.293180 
      20       -0.308037 
      20       -0.339958 
      20       -0.352125 
      20       -0.317523 
      20       -0.292668 
      20       -0.282999 
      20       -0.281154 
      20       -0.276906 
      20       -0.275560 
      20       -0.271380 
      20       -0.270064 
      20       -0.265089 
      20       -0.254049 
      20       -0.212865 
      20       -0.181080 
