

 time    ||    gripping force   ||   raspberry measurement 

      0       0.060000       -795.023529 
      0       0.030000       -795.023529 
      0       0.010000       -795.023529 
      0       0.000000       -795.023529 
      0       0.040000       -795.023529 
      0       0.000000       -795.023529 
      0       0.320000       -795.023529 
      0       0.380000       -795.023529 
      0       0.120000       -795.023529 
      0       0.310000       -795.023525 
      0       0.430000       -795.022345 
      0       0.130000       -794.916164 
      0       0.150000       -791.399963 
      0       0.120000       -748.564402 
      0       0.170000       -556.595145 
      0       0.080000       -240.116058 
      1       0.150000       -48.177599 
      1       0.000000       -5.296952 
      1       0.110000       -1.724593 
      1       0.180000       -1.625236 
      1       0.070000       -1.635574 
      1       0.050000       -1.688183 
      1       0.020000       -1.691976 
      1       0.030000       -1.620468 
      1       0.060000       -1.602499 
      1       0.100000       -1.664705 
      1       0.130000       -1.644151 
      1       0.310000       -1.603787 
      2       0.230000       -1.635594 
      2       0.310000       -1.557092 
      2       0.320000       -1.445690 
      2       0.210000       -1.461650 
      2       0.300000       -1.534750 
      2       0.240000       -1.576003 
      2       0.490000       -1.611774 
      2       0.430000       -1.608712 
      2       0.360000       -1.556665 
      3       3.810000       -1.531196 
      3       8.450000       -1.521253 
      3       24.760000       -1.509613 
      3       46.680000       -1.458507 
      3       55.080000       -1.431582 
      3       76.620000       -1.425310 
      3       93.920000       -1.351293 
      3       114.670000       -1.290872 
      3       131.920000       -1.273263 
      3       134.250000       -1.263501 
      3       133.360000       -1.224922 
      3       132.380000       -1.202071 
      4       131.810000       -1.275631 
      4       131.420000       -1.425198 
      4       130.470000       -1.505914 
      4       127.620000       -1.442548 
      4       125.680000       -1.339555 
      4       122.910000       -1.166161 
      4       120.600000       -0.813999 
      4       118.840000       -0.316551 
      5       110.660000       0.213603 
      5       110.420000       0.790802 
      5       109.860000       1.302071 
      5       109.130000       1.648938 
      5       103.680000       1.789544 
      5       102.330000       1.805104 
      5       97.080000       1.796962 
      5       96.450000       1.766963 
      6       95.610000       1.635210 
      6       91.070000       1.519970 
      6       87.510000       1.454479 
      6       87.470000       1.328037 
      6       87.300000       1.208840 
      6       86.400000       1.108328 
      7       85.790000       1.042490 
      7       84.610000       1.028511 
      7       83.370000       1.024909 
      7       82.210000       1.016370 
      7       81.710000       0.976475 
      7       81.440000       0.936580 
      7       80.990000       0.928053 
      7       80.430000       0.924856 
      7       78.170000       0.915039 
      7       77.510000       0.860237 
      8       68.950000       0.762646 
      8       68.990000       0.691703 
      8       68.960000       0.673334 
      9       68.910000       0.642351 
      9       60.040000       0.575061 
      9       60.060000       0.428041 
      10       60.440000       0.285986 
      10       60.440000       0.245645 
      10       60.470000       0.204272 
      10       60.440000       0.197726 
      10       60.470000       0.308605 
      11       60.520000       0.369673 
      11       60.500000       0.251254 
      11       60.520000       0.125010 
      11       60.510000       0.058051 
      11       60.490000       0.033090 
      11       60.550000       0.025326 
      11       60.510000       0.016382 
      11       60.490000       -0.023552 
      11       60.510000       -0.064293 
      12       60.530000       -0.082288 
      12       60.540000       -0.117643 
      12       60.520000       -0.133366 
      12       60.510000       -0.101972 
      12       60.510000       -0.080074 
      12       60.590000       -0.073289 
      12       60.560000       -0.075131 
      12       60.560000       -0.083174 
      12       60.550000       -0.117669 
      13       60.570000       -0.133367 
      13       60.630000       -0.101972 
      13       60.560000       -0.080073 
      14       60.210000       -0.073262 
      14       60.200000       -0.074258 
      14       60.200000       -0.072806 
      14       60.100000       -0.074245 
      14       60.130000       -0.072833 
      14       60.130000       -0.075117 
      14       60.050000       -0.083174 
      15       60.050000       -0.117669 
      15       59.980000       -0.133367 
      15       59.890000       -0.101972 
      15       59.910000       -0.080073 
      15       59.960000       -0.072530 
      16       59.950000       -0.072790 
      16       59.890000       -0.070625 
      16       59.830000       -0.071342 
      16       59.810000       -0.069205 
      16       59.800000       -0.069937 
      16       59.890000       -0.067814 
      16       59.850000       -0.068559 
      16       59.890000       -0.066450 
      16       59.850000       -0.067223 
      16       59.860000       -0.065552 
      16       59.860000       -0.071200 
      16       59.870000       -0.086823 
      17       59.820000       -0.093106 
      17       59.780000       -0.037991 
      17       59.830000       0.010655 
      17       59.790000       -0.014202 
      17       59.870000       -0.052291 
      17       59.800000       -0.060569 
      17       59.820000       -0.067145 
      18       59.760000       -0.083686 
      18       59.810000       -0.099813 
      18       59.780000       -0.081851 
      18       59.760000       -0.063847 
      19       59.790000       -0.056878 
      19       59.720000       -0.057307 
      19       59.740000       -0.055297 
      19       59.820000       -0.056168 
      19       59.730000       -0.054182 
      19       59.790000       -0.055038 
      19       59.810000       -0.052226 
      19       59.780000       -0.043727 
      19       59.780000       -0.009140 
      20       59.800000       0.006492 
      20       59.730000       -0.024654 
      20       59.790000       -0.046087 
      20       59.730000       -0.052369 
      20       59.800000       -0.050860 
      20       59.740000       -0.051788 
      20       59.770000       -0.049847 
      20       59.720000       -0.050772 
      20       59.750000       -0.048840 
      20       59.800000       -0.049776 
      20       59.700000       -0.047854 
      20       59.740000       -0.048800 
      21       59.770000       -0.046888 
      21       59.750000       -0.047843 
      21       59.790000       -0.045940 
      21       59.740000       -0.046905 
      21       59.730000       -0.045012 
      21       59.750000       -0.045986 
      21       59.730000       -0.044102 
      22       59.740000       -0.045098 
      22       59.790000       -0.043662 
      22       59.710000       -0.049968 
      22       59.690000       -0.071148 
      22       59.720000       -0.101517 
      22       59.670000       -0.084962 
      22       59.750000       -0.049962 
      22       59.730000       -0.041486 
      23       59.790000       -0.038809 
      23       59.670000       -0.039819 
      23       59.760000       -0.037997 
      23       59.750000       -0.039041 
      23       59.670000       -0.037226 
      24       59.690000       -0.038252 
      24       59.680000       -0.035594 
      24       59.670000       -0.026850 
      24       59.690000       0.012037 
      25       59.740000       0.040735 
      25       59.700000       0.001271 
      25       59.630000       -0.070112 
      25       59.720000       -0.094764 
      25       59.770000       -0.063587 
      25       59.700000       -0.041297 
      25       59.720000       -0.034142 
      25       59.710000       -0.034786 
      26       59.680000       -0.033001 
      26       59.690000       -0.034095 
      26       59.780000       -0.032330 
      26       59.630000       -0.033444 
      26       59.740000       -0.032124 
      26       59.740000       -0.038545 
      26       59.680000       -0.059840 
      26       59.700000       -0.090322 
      27       59.720000       -0.073878 
      27       59.700000       -0.038989 
      27       59.700000       -0.030623 
      27       59.710000       -0.028055 
      27       59.730000       -0.029172 
      27       59.690000       -0.027456 
      27       59.730000       -0.028606 
      27       59.680000       -0.026896 
      27       59.670000       -0.028064 
      27       59.690000       -0.026798 
      28       59.680000       -0.033273 
      28       59.730000       -0.054620 
      28       59.670000       -0.085155 
      28       59.700000       -0.068789 
      28       59.680000       -0.034802 
      28       59.650000       -0.036290 
      28       59.680000       -0.070886 
      28       59.690000       -0.102668 
      28       59.750000       -0.069575 
      28       59.750000       -0.038403 
      29       59.710000       -0.049886 
      29       59.710000       -0.079616 
      29       59.690000       -0.063267 
      29       59.740000       -0.028909 
      30       59.740000       -0.025550 
      30       59.720000       -0.041643 
      30       59.730000       -0.058178 
      30       59.640000       -0.041070 
      30       59.680000       -0.028792 
      30       59.710000       -0.045278 
      30       59.650000       -0.075506 
      30       59.730000       -0.060036 
      30       59.690000       -0.034699 
      31       59.690000       -0.059540 
      31       59.700000       -0.078966 
      31       59.690000       -0.070174 
      31       59.700000       -0.077448 
      31       59.670000       -0.055815 
      32       59.720000       -0.020668 
      32       59.640000       -0.012472 
      32       59.690000       -0.010085 
      32       59.690000       -0.011382 
      32       59.740000       -0.009844 
      32       59.630000       -0.011170 
      32       59.720000       -0.009660 
      32       59.640000       -0.011825 
      33       59.680000       -0.019683 
      33       59.700000       -0.053637 
      33       59.710000       -0.068641 
      33       59.690000       -0.036900 
      33       59.700000       -0.015689 
      33       59.690000       -0.018190 
      33       59.690000       -0.051720 
      33       59.730000       -0.066729 
      33       59.660000       -0.034982 
      34       59.650000       -0.012952 
      34       59.640000       -0.006080 
      34       59.710000       -0.007018 
      34       59.640000       -0.005949 
      35       59.690000       -0.012632 
      35       59.630000       -0.034185 
      35       59.690000       -0.064924 
      36       59.690000       -0.048734 
      36       59.690000       -0.014097 
      36       59.660000       -0.005980 
      36       59.700000       -0.003658 
      36       59.590000       -0.005019 
      36       59.660000       -0.003545 
      36       59.780000       -0.004933 
      36       59.590000       -0.003460 
      36       59.690000       -0.004849 
      37       59.580000       -0.003377 
      37       59.600000       -0.004767 
      37       59.630000       -0.003296 
      37       59.700000       -0.004687 
      37       59.670000       -0.003216 
      37       59.610000       -0.004621 
      38       59.650000       -0.003576 
      38       59.700000       -0.009871 
      38       59.650000       -0.026958 
      38       59.640000       -0.043653 
      38       59.630000       -0.026252 
      38       59.650000       -0.008804 
      38       59.670000       -0.002411 
      38       59.620000       -0.004237 
      38       59.590000       -0.012570 
      38       59.650000       -0.051088 
      38       59.620000       -0.080234 
      38       59.630000       -0.049788 
      39       59.660000       -0.011072 
      39       59.630000       -0.007479 
      39       59.630000       -0.023766 
      39       59.720000       -0.041317 
      39       59.580000       -0.033752 
      39       59.620000       -0.053448 
      40       59.620000       -0.077664 
      40       59.620000       -0.046805 
      40       59.620000       -0.007680 
      40       59.680000       0.000785 
      40       59.580000       0.003053 
      40       59.640000       0.001624 
      40       59.630000       0.003032 
      40       59.610000       0.001578 
      41       59.640000       0.002986 
      41       59.650000       0.001532 
      41       59.630000       0.002941 
      42       59.560000       0.001488 
      42       59.710000       0.002897 
      42       59.660000       0.001444 
      42       59.730000       0.002853 
      42       59.630000       0.001401 
      42       59.600000       0.002811 
      42       59.650000       0.001359 
      42       59.620000       0.002769 
      42       59.680000       0.001317 
      42       59.610000       0.002728 
      43       59.660000       0.001277 
      43       59.690000       0.002688 
      43       59.650000       0.001237 
      43       59.680000       0.002649 
      44       59.670000       0.001198 
      44       59.600000       0.002610 
      44       59.640000       0.001160 
      45       59.700000       0.002573 
      45       59.670000       0.001123 
      45       59.650000       0.002536 
      45       59.630000       0.001086 
      45       59.640000       0.002500 
      45       59.660000       0.001051 
      45       59.640000       0.002464 
      45       59.690000       0.001015 
      45       59.610000       0.002429 
      46       59.700000       0.000981 
      46       59.640000       0.002395 
      46       59.590000       0.000947 
      46       59.630000       0.002362 
      46       59.640000       0.000914 
      46       59.650000       0.002329 
      46       59.600000       0.000882 
      46       59.670000       0.002297 
      46       59.560000       0.000850 
      46       59.610000       0.002265 
      47       59.670000       0.000819 
      47       59.650000       0.002235 
      47       59.560000       0.000788 
      47       59.650000       0.002204 
      47       59.670000       0.000758 
      47       59.640000       0.002175 
      47       59.590000       0.000729 
      47       59.590000       0.002146 
      47       59.630000       0.000700 
      48       59.640000       0.002117 
      48       59.630000       0.000672 
      48       59.610000       0.002089 
      48       59.640000       0.000644 
      48       59.620000       0.002062 
      48       59.610000       0.000617 
      48       59.620000       0.002035 
      48       59.640000       0.000617 
      48       59.660000       0.002886 
      49       59.610000       0.011233 
      49       59.660000       0.049339 
      49       59.660000       0.073596 
      49       59.630000       0.024593 
      50       59.590000       -0.029850 
      50       59.610000       -0.022839 
      50       59.610000       -0.011594 
      50       59.550000       -0.028278 
      50       59.580000       -0.058650 
      50       59.630000       -0.042511 
      50       59.600000       -0.007935 
      51       59.600000       0.000120 
      51       59.580000       0.002381 
      51       59.550000       0.000959 
      51       59.590000       0.002374 
      51       59.590000       0.000926 
      51       59.680000       0.002315 
      51       59.640000       0.000016 
      51       59.640000       -0.008372 
      51       59.600000       -0.046933 
      51       59.610000       -0.076120 
      52       59.530000       -0.045702 
      52       59.570000       -0.006627 
      52       59.590000       0.000989 
      52       59.570000       -0.006146 
      53       59.550000       -0.040208 
      53       59.570000       -0.055346 
      53       59.530000       -0.023712 
      53       59.580000       -0.001795 
      53       59.590000       0.004966 
      53       59.570000       0.003917 
      54       59.540000       0.004890 
      54       59.560000       -0.001489 
      54       59.580000       -0.018660 
      54       59.600000       -0.035438 
      54       59.520000       -0.018119 
      54       59.600000       -0.000752 
      54       59.590000       0.005559 
      54       59.590000       0.003667 
      54       59.540000       -0.004333 
      55       59.540000       -0.038466 
      55       59.600000       -0.054459 
      55       59.570000       -0.032234 
      55       59.580000       -0.042958 
      55       59.540000       -0.052750 
      55       59.590000       -0.020704 
      55       59.620000       0.001183 
      56       59.520000       0.007489 
      56       59.580000       0.001509 
      56       59.590000       -0.016118 
      56       59.500000       -0.038240 
      56       59.560000       -0.044010 
      57       59.570000       -0.056466 
      57       59.560000       -0.040361 
      57       59.520000       -0.023992 
      57       59.550000       -0.031303 
      57       59.550000       -0.013187 
      57       59.540000       0.004157 
      57       59.530000       0.010446 
      58       59.590000       0.009343 
      58       59.510000       0.010687 
      58       59.580000       0.009156 
      58       59.530000       0.010488 
      58       59.570000       0.008959 
      58       59.490000       0.010267 
      58       59.530000       0.007903 
      58       59.540000       -0.000152 
      58       59.530000       -0.034301 
      59       59.560000       -0.049472 
      59       59.530000       -0.017046 
      59       59.580000       0.014604 
      59       59.560000       0.057995 
      59       59.510000       0.082604 
      59       59.520000       0.033525 
      59       59.520000       -0.020995 
      59       59.530000       -0.013633 
      59       59.560000       0.002838 
      60       59.500000       0.009114 
      60       59.560000       0.008024 
      60       59.500000       0.009381 
      60       59.530000       0.007863 
      60       59.530000       0.009209 
      60       59.540000       0.007692 
