

 time    ||    gripping force   ||   raspberry measurement 

      0       0.150000       -795.052778 
      0       0.060000       -795.052778 
      0       0.050000       -795.052778 
      0       0.110000       -795.052778 
      1       0.160000       -787.102250 
      1       0.230000       -779.231227 
      2       9.370000       -771.438915 
      2       36.220000       -763.724526 
      2       63.580000       -756.087281 
      2       73.480000       -748.526403 
      2       81.960000       -741.039971 
      2       84.600000       -733.524372 
      2       83.700000       -730.005471 
      3       81.990000       -687.136227 
      3       81.730000       -495.006946 
      3       81.730000       -178.232947 
      3       81.580000       13.888278 
      3       81.230000       56.720770 
      3       81.130000       60.218323 
      3       81.060000       60.332131 
      3       80.820000       60.426834 
      3       80.870000       60.711390 
      3       80.640000       61.152556 
      4       80.510000       61.558205 
      4       80.370000       61.922740 
      4       80.260000       62.193476 
      4       79.900000       62.297143 
      4       79.610000       62.316970 
      4       78.820000       62.310683 
      4       78.170000       62.278067 
      4       77.710000       62.199581 
      4       77.620000       62.150788 
      4       77.580000       62.198252 
      4       77.570000       62.261870 
      4       77.450000       62.238106 
      4       77.490000       62.197839 
      4       77.190000       62.233606 
      5       76.780000       62.248458 
      5       76.700000       62.206322 
      5       76.530000       62.201370 
      5       76.510000       62.222019 
      5       76.520000       62.251558 
      5       76.230000       62.235448 
      5       76.080000       62.195970 
      5       75.990000       62.234145 
      5       75.920000       62.236221 
      5       75.830000       62.159340 
      5       75.740000       62.119297 
      6       75.710000       62.165581 
      6       75.720000       62.206668 
      6       75.480000       62.222974 
      6       74.920000       62.236654 
      6       74.070000       62.239088 
      6       73.730000       62.214281 
      6       73.730000       62.180768 
      6       73.730000       62.107195 
      6       73.670000       62.079467 
      6       73.560000       62.085226 
      6       72.710000       62.076726 
      6       72.000000       62.094682 
      7       70.970000       62.112094 
      7       70.500000       62.119348 
      7       70.380000       62.128224 
      7       70.090000       62.166385 
      7       70.150000       62.185543 
      7       70.000000       62.107206 
      7       70.040000       61.988800 
      7       70.030000       61.936486 
      7       70.010000       61.938117 
      7       69.890000       61.946287 
      7       69.930000       61.960049 
      7       69.800000       62.016591 
      7       69.540000       61.981017 
      8       67.630000       61.842729 
      8       65.960000       61.759634 
      8       65.320000       61.735985 
      8       64.590000       61.696384 
      8       64.670000       61.674540 
      8       64.680000       61.655076 
      8       64.830000       61.605046 
      8       64.760000       61.514367 
      8       64.800000       61.501534 
      8       64.740000       61.582954 
      8       64.810000       61.648431 
      9       64.850000       61.656061 
      9       64.850000       61.686029 
      9       64.800000       61.687855 
      9       64.850000       61.595067 
      9       64.790000       61.506822 
      9       64.790000       61.459674 
      9       64.830000       61.473208 
      9       64.860000       61.498155 
      9       64.820000       61.472725 
      9       64.780000       61.452918 
      9       64.860000       61.465514 
      9       64.850000       61.470856 
      9       64.850000       61.483426 
      9       64.840000       61.462773 
      10       64.760000       61.427875 
      10       63.770000       61.420651 
      10       63.340000       61.427861 
      10       63.380000       61.462330 
      10       63.370000       61.478040 
      10       63.430000       61.447089 
      10       63.430000       61.430563 
      10       63.420000       61.447089 
      10       63.420000       61.478067 
      10       63.420000       61.463243 
      11       63.420000       61.439546 
      11       63.480000       61.479843 
      11       63.400000       61.556044 
      11       63.470000       61.590553 
      11       63.430000       61.538536 
      11       63.440000       61.474084 
      11       63.400000       61.493269 
      11       62.640000       61.518405 
      12       62.250000       61.470884 
      12       62.280000       61.431503 
      12       62.320000       61.435906 
      12       62.340000       61.508190 
      12       62.330000       61.616026 
      12       62.340000       61.646174 
      12       62.350000       61.594543 
      12       62.340000       61.540417 
      12       62.310000       61.472629 
      12       62.290000       61.430187 
      12       62.360000       61.418393 
      13       62.300000       61.419805 
      13       62.370000       61.427835 
      13       62.430000       61.462330 
      13       62.330000       61.478027 
      13       62.180000       61.446673 
      13       62.120000       61.426077 
      13       62.130000       61.434563 
      14       61.560000       61.496909 
      14       61.340000       61.561400 
      14       61.460000       61.533163 
      14       61.280000       61.479457 
      14       61.480000       61.522422 
      14       61.240000       61.577527 
      14       61.490000       61.515720 
      14       61.450000       61.439506 
      14       61.220000       61.426077 
      14       61.590000       61.441717 
      14       61.330000       61.458813 
      15       61.480000       61.442107 
      15       61.310000       61.429703 
      15       61.350000       61.442134 
      15       61.450000       61.459726 
      15       61.310000       61.453361 
      15       61.450000       61.483926 
      15       61.440000       61.551062 
      15       61.420000       61.566355 
      15       61.390000       61.498198 
      15       61.400000       61.444488 
      16       61.460000       61.463673 
      16       61.200000       61.478067 
      16       60.460000       61.446633 
      16       60.510000       61.424734 
      16       60.580000       61.417922 
      16       60.860000       61.418891 
      17       60.670000       61.416580 
      17       60.730000       61.408107 
      17       60.690000       61.369072 
      17       60.720000       61.339116 
      18       60.700000       61.369072 
      18       60.730000       61.408107 
      18       60.710000       61.416580 
      18       60.730000       61.418878 
      18       60.840000       61.417466 
      18       60.680000       61.418905 
      18       60.730000       61.417466 
      18       60.600000       61.418905 
      18       60.650000       61.417466 
      18       60.680000       61.418905 
      19       60.780000       61.417466 
      19       60.640000       61.418905 
      19       60.760000       61.417466 
      19       60.720000       61.418878 
      19       60.770000       61.416580 
      19       60.620000       61.408107 
      19       60.760000       61.369072 
      19       60.640000       61.339117 
      19       60.660000       61.369099 
      19       60.760000       61.408993 
      19       60.780000       61.427378 
      19       60.670000       61.467272 
      19       60.690000       61.497255 
      20       60.630000       61.467312 
      20       60.680000       61.428721 
      20       60.790000       61.425620 
      20       60.610000       61.446673 
      20       60.680000       61.478484 
      20       60.700000       61.468185 
      20       60.670000       61.457874 
      21       59.850000       61.489281 
      21       59.860000       61.506211 
      21       59.860000       61.493351 
      21       59.880000       61.466304 
      21       59.970000       61.440458 
      22       59.970000       61.402226 
      22       60.040000       61.400121 
      22       59.960000       61.412537 
      22       59.970000       61.419361 
      22       60.080000       61.428251 
      22       59.940000       61.467299 
      22       59.940000       61.497241 
      22       60.040000       61.466856 
      22       59.960000       61.422852 
      22       60.080000       61.395138 
      22       59.990000       61.371770 
      22       60.060000       61.365542 
      22       60.030000       61.352945 
      23       60.150000       61.373598 
      23       60.100000       61.408523 
      23       59.960000       61.416593 
      23       59.860000       61.418851 
      23       60.080000       61.416580 
      24       60.060000       61.408107 
      24       60.090000       61.369072 
      24       60.060000       61.339116 
      24       60.180000       61.369072 
      24       60.150000       61.408107 
      24       60.060000       61.416607 
      24       60.020000       61.419751 
      24       60.120000       61.427834 
      24       60.010000       61.462330 
      24       59.990000       61.478027 
      24       60.180000       61.446633 
      25       60.270000       61.424734 
      25       59.930000       61.417909 
      25       60.140000       61.418475 
      25       60.000000       61.412068 
      25       60.120000       61.394721 
      25       60.100000       61.378015 
      25       60.100000       61.400080 
      25       60.080000       61.435391 
      25       60.090000       61.447988 
      25       60.280000       61.398225 
      26       60.040000       61.363743 
      26       60.170000       61.390182 
      26       59.990000       61.411651 
      26       60.190000       61.418448 
      27       60.050000       61.417453 
      27       60.170000       61.418905 
      27       60.020000       61.417466 
      27       60.280000       61.418905 
      27       59.910000       61.417466 
      27       60.180000       61.418905 
      27       60.110000       61.417466 
      27       60.020000       61.418878 
      28       60.080000       61.416593 
      28       59.990000       61.408536 
      29       60.030000       61.374041 
      29       60.000000       61.358344 
      29       60.040000       61.389738 
      29       60.030000       61.411637 
      30       60.150000       61.418448 
      30       59.900000       61.417439 
      30       60.010000       61.418448 
      30       60.020000       61.411611 
      30       59.940000       61.388852 
      30       60.030000       61.347546 
      30       60.020000       61.325647 
      30       60.020000       61.328748 
      30       59.950000       61.368199 
      30       60.030000       61.408080 
      31       60.030000       61.416580 
      31       60.000000       61.418878 
      31       59.990000       61.417466 
      31       59.980000       61.418905 
      31       60.020000       61.417466 
      32       60.030000       61.418905 
      32       60.020000       61.417466 
      32       60.060000       61.418878 
      32       59.980000       61.416580 
      34       60.010000       61.408080 
      34       60.060000       61.368186 
      34       60.070000       61.328291 
      34       60.010000       61.319805 
      34       60.040000       61.317950 
      34       60.000000       61.324734 
      34       59.960000       61.346633 
      34       59.990000       61.378054 
      35       60.080000       61.363216 
      35       59.950000       61.338660 
      35       60.010000       61.369059 
      35       60.010000       61.408106 
      35       60.060000       61.416580 
      35       60.050000       61.418878 
      35       59.940000       61.417466 
      35       60.010000       61.418905 
      35       60.040000       61.417466 
      35       60.080000       61.418905 
      35       59.990000       61.417466 
      36       60.090000       61.418918 
      36       60.050000       61.417910 
      36       60.030000       61.424304 
      36       60.050000       61.441663 
      36       59.960000       61.458799 
      36       59.970000       61.441663 
      37       60.070000       61.424277 
      37       59.980000       61.417023 
      37       60.050000       61.408093 
      37       60.020000       61.368186 
      37       60.010000       61.328291 
      38       60.030000       61.319792 
      38       60.000000       61.317520 
      38       59.970000       61.319792 
      38       60.060000       61.328291 
      38       59.980000       61.368186 
      38       60.010000       61.408080 
      38       59.970000       61.416580 
      38       60.020000       61.418878 
      39       60.000000       61.417466 
      39       60.040000       61.418905 
      39       60.020000       61.417466 
      39       60.020000       61.418865 
      39       60.030000       61.416137 
      39       59.970000       61.402707 
      39       59.960000       61.344875 
      39       60.070000       61.299222 
      40       59.990000       61.344875 
      40       60.000000       61.402681 
      40       60.000000       61.415250 
      40       60.030000       61.408040 
      41       60.000000       61.368185 
      41       60.010000       61.328318 
      41       60.020000       61.320678 
      41       60.070000       61.328291 
      42       59.940000       61.367299 
      42       59.930000       61.397282 
      42       59.960000       61.368185 
      42       60.110000       61.339063 
      43       59.970000       61.368185 
      43       60.020000       61.397268 
      43       60.030000       61.366856 
      43       59.970000       61.322892 
      43       60.010000       61.296481 
      43       60.020000       61.288424 
      44       59.970000       61.343989 
      44       59.960000       61.402681 
      45       59.990000       61.416136 
      45       60.050000       61.418865 
      45       59.990000       61.417466 
      45       59.960000       61.418905 
      45       60.030000       61.417466 
      46       60.000000       61.418905 
      46       60.030000       61.417466 
      46       60.040000       61.418905 
      46       59.960000       61.417466 
      46       59.990000       61.418905 
      46       60.070000       61.417466 
      46       60.010000       61.418905 
      46       59.950000       61.417453 
      47       59.950000       61.418448 
      47       60.050000       61.411637 
      47       59.910000       61.389738 
      47       60.030000       61.358344 
      47       59.970000       61.374041 
      47       59.890000       61.408536 
      47       59.990000       61.416593 
      47       60.020000       61.418878 
      48       59.960000       61.417466 
      48       60.020000       61.418905 
      48       60.000000       61.417466 
      48       60.020000       61.418878 
      49       60.030000       61.416593 
      49       59.950000       61.408536 
      49       60.180000       61.374015 
      50       59.940000       61.357458 
      50       59.980000       61.378940 
      50       59.910000       61.363243 
      50       60.000000       61.338660 
      50       60.060000       61.369059 
      51       60.050000       61.408106 
      51       59.980000       61.416580 
      51       59.990000       61.418878 
      51       59.990000       61.417466 
      51       60.090000       61.418905 
      51       60.010000       61.417466 
      51       60.020000       61.418905 
      51       60.120000       61.417466 
      51       59.990000       61.418905 
      53       60.000000       61.417466 
      53       59.960000       61.418905 
      53       59.970000       61.417466 
      53       60.040000       61.418918 
      53       59.990000       61.417910 
      53       59.940000       61.424304 
      54       60.030000       61.441663 
      54       60.020000       61.458772 
      54       60.030000       61.440777 
      54       60.010000       61.413506 
      56       59.980000       61.369515 
      56       59.990000       61.339130 
      57       60.000000       61.369072 
      57       59.990000       61.408107 
      57       60.000000       61.416580 
      57       60.060000       61.418878 
      57       59.900000       61.417466 
      57       60.000000       61.418905 
      57       60.000000       61.417466 
      58       60.050000       61.418905 
      58       59.960000       61.417466 
      58       60.010000       61.418878 
      58       60.000000       61.416580 
      58       60.010000       61.408080 
      58       60.060000       61.368199 
      58       60.000000       61.328748 
      59       59.950000       61.325647 
      59       60.050000       61.347546 
      59       60.020000       61.388825 
      59       60.030000       61.410724 
      60       60.010000       61.407650 
      60       60.010000       61.369059 
      60       59.960000       61.339116 
