

 time    ||    gripping force   ||   raspberry measurement 

      0       0.030000       -795.091489 
      0       0.030000       -795.091489 
      0       1.400000       -795.091489 
      0       0.080000       -795.091489 
      0       0.030000       -795.091489 
      0       0.210000       -795.091489 
      0       0.140000       -795.091489 
      0       0.060000       -795.091489 
      0       0.180000       -795.091489 
      0       0.010000       -795.091485 
      0       0.030000       -795.090303 
      0       0.140000       -794.983908 
      1       0.160000       -791.460601 
      1       0.330000       -748.538213 
      1       0.280000       -556.176456 
      1       0.430000       -239.036571 
      1       0.140000       -46.690525 
      1       0.370000       -3.771680 
      1       0.470000       -0.255602 
      1       7.840000       -0.171119 
      2       49.860000       -0.201331 
      2       54.740000       -0.185643 
      2       60.630000       -0.151577 
      2       51.760000       -0.148477 
      2       50.730000       -0.164990 
      2       50.680000       -0.182099 
      2       50.450000       -0.164963 
      2       50.310000       -0.147604 
      2       50.280000       -0.141236 
      2       50.180000       -0.143104 
      3       49.930000       -0.151563 
      3       49.850000       -0.190490 
      3       49.790000       -0.216887 
      3       50.120000       -0.143268 
      3       49.290000       0.095601 
      3       49.630000       0.457337 
      3       49.530000       0.730716 
      3       49.530000       0.828531 
      3       49.410000       0.812919 
      3       49.400000       0.798632 
      3       49.320000       0.830041 
      4       49.360000       0.851080 
      4       49.240000       0.847953 
      4       49.320000       0.808502 
      4       49.380000       0.768647 
      4       49.340000       0.760994 
      4       49.450000       0.768191 
      4       49.470000       0.802686 
      4       49.440000       0.819229 
      4       49.300000       0.797290 
      4       49.360000       0.807172 
      4       49.330000       0.803045 
      5       49.290000       0.719353 
      5       49.210000       0.664609 
      5       49.240000       0.706327 
      5       49.200000       0.746581 
      5       49.110000       0.758335 
      5       49.150000       0.757796 
      5       49.090000       0.760120 
      5       49.070000       0.768594 
      5       49.050000       0.807642 
      5       49.070000       0.838027 
      5       49.050000       0.813028 
      6       49.040000       0.792817 
      6       49.040000       0.800874 
      6       48.960000       0.791931 
      6       49.010000       0.802229 
      6       48.880000       0.789633 
      6       48.900000       0.727853 
      6       48.910000       0.720227 
      6       48.880000       0.750195 
      6       48.890000       0.767305 
      6       48.880000       0.802659 
      6       48.880000       0.819243 
      6       48.830000       0.797787 
      6       48.850000       0.814331 
      7       48.860000       0.848422 
      7       48.850000       0.851523 
      7       48.770000       0.834957 
      7       48.810000       0.816115 
      7       48.870000       0.812957 
      7       48.690000       0.748880 
      7       48.740000       0.658820 
      7       48.740000       0.648509 
      7       48.680000       0.693758 
      7       48.810000       0.778032 
      7       48.720000       0.842500 
      7       48.690000       0.855109 
      8       48.740000       0.842540 
      8       48.650000       0.779348 
      8       48.700000       0.709499 
      8       48.660000       0.715258 
      8       48.710000       0.748906 
      8       48.620000       0.757366 
      8       48.670000       0.764620 
      8       48.590000       0.782436 
      8       48.650000       0.804541 
      8       48.650000       0.806633 
      8       48.660000       0.809940 
      8       48.560000       0.807076 
      9       48.610000       0.809953 
      9       48.610000       0.807090 
      9       48.670000       0.810397 
      9       48.600000       0.812489 
      9       48.600000       0.834594 
      9       48.570000       0.852383 
      9       48.610000       0.858790 
      9       48.970000       0.857755 
      9       49.800000       0.858334 
      9       50.700000       0.846567 
      9       50.610000       0.805857 
      9       50.580000       0.758323 
      10       50.540000       0.784318 
      10       50.560000       0.813387 
      10       50.530000       0.785659 
      10       50.530000       0.754708 
      10       50.440000       0.715714 
      10       50.510000       0.709512 
      10       50.450000       0.771542 
      10       50.460000       0.826000 
      10       50.350000       0.826528 
      10       50.440000       0.801076 
      10       50.400000       0.760970 
      11       50.310000       0.708711 
      11       50.270000       0.642929 
      11       50.380000       0.627263 
      11       50.310000       0.626679 
      11       50.290000       0.658630 
      11       50.410000       0.679495 
      12       50.320000       0.636383 
      12       50.260000       0.638478 
      12       50.240000       0.709234 
      12       50.300000       0.787393 
      12       50.200000       0.814494 
      12       50.330000       0.753628 
      12       50.170000       0.668418 
      12       50.240000       0.634735 
      12       50.240000       0.644696 
      12       50.210000       0.677826 
      13       50.240000       0.682902 
      13       50.160000       0.635783 
      13       50.220000       0.559288 
      13       50.200000       0.545320 
      13       50.280000       0.569523 
      13       50.190000       0.581204 
      13       50.080000       0.615712 
      13       50.140000       0.649076 
      13       50.140000       0.651001 
      13       50.170000       0.646766 
      14       50.140000       0.638901 
      14       50.130000       0.633936 
      14       50.150000       0.626159 
      14       50.100000       0.620896 
      14       50.140000       0.608357 
      14       50.120000       0.585087 
      14       50.100000       0.562272 
      14       50.100000       0.573614 
      15       50.120000       0.585064 
      15       50.160000       0.585543 
      15       50.100000       0.578689 
      15       50.080000       0.574339 
      15       50.090000       0.567159 
      15       50.100000       0.562473 
      15       50.040000       0.550105 
      15       50.060000       0.522924 
      15       50.110000       0.486588 
      15       49.990000       0.496425 
      15       50.060000       0.516210 
      16       50.100000       0.486298 
      16       50.020000       0.466720 
      16       50.040000       0.492721 
      16       50.070000       0.504155 
      16       50.030000       0.482752 
      16       50.060000       0.447283 
      16       50.090000       0.458363 
      16       50.040000       0.487930 
      17       50.060000       0.491027 
      17       50.020000       0.488352 
      17       50.030000       0.481233 
      17       50.020000       0.468431 
      17       49.980000       0.429158 
      17       49.990000       0.403981 
      17       49.970000       0.407080 
      17       50.010000       0.385632 
      17       50.030000       0.369883 
      17       49.970000       0.382970 
      17       50.030000       0.410220 
      17       49.950000       0.395445 
      18       50.020000       0.375126 
      18       49.980000       0.369964 
      18       49.960000       0.320655 
      18       50.010000       0.302308 
      18       50.070000       0.345919 
      18       50.000000       0.367222 
      18       49.990000       0.372555 
      18       49.960000       0.371352 
      18       50.030000       0.389536 
      18       50.000000       0.403252 
      18       49.920000       0.405563 
      18       49.970000       0.400509 
      19       49.920000       0.397915 
      19       50.010000       0.391674 
      19       50.060000       0.379781 
      19       50.040000       0.341807 
      19       50.010000       0.322010 
      19       49.890000       0.340471 
      19       50.050000       0.326019 
      19       49.970000       0.312538 
      20       50.070000       0.340931 
      20       50.050000       0.359202 
      20       49.950000       0.361914 
      20       50.090000       0.351991 
      20       50.080000       0.326791 
      20       50.030000       0.292017 
      20       50.040000       0.299718 
      20       50.010000       0.311822 
      20       49.960000       0.295794 
      20       50.130000       0.286658 
      21       50.060000       0.260683 
      21       50.220000       0.231477 
      21       49.960000       0.194999 
      21       50.150000       0.195719 
      21       49.890000       0.241221 
      21       50.080000       0.254787 
      22       50.050000       0.278430 
      22       50.000000       0.310235 
      22       50.080000       0.309816 
      22       50.070000       0.285876 
      22       50.010000       0.251963 
      22       50.060000       0.264984 
      22       50.000000       0.296484 
      22       50.080000       0.301469 
      22       50.080000       0.299853 
      22       50.090000       0.285231 
      22       50.030000       0.242089 
      22       49.970000       0.193048 
      22       50.060000       0.222198 
      23       50.030000       0.272736 
      23       50.000000       0.282877 
      23       50.130000       0.282298 
      23       50.120000       0.272771 
      23       50.040000       0.248364 
      23       50.070000       0.214800 
      23       50.110000       0.228192 
      23       50.020000       0.260034 
      23       50.030000       0.264519 
      23       50.010000       0.253060 
      24       50.020000       0.197618 
      24       50.030000       0.115062 
      24       50.150000       0.115557 
      24       50.080000       0.215206 
      24       50.050000       0.261732 
      24       50.120000       0.257473 
      24       49.970000       0.249033 
      24       50.220000       0.238180 
      24       50.250000       0.201635 
      25       50.100000       0.184039 
      25       49.990000       0.212003 
      25       50.130000       0.216843 
      25       50.070000       0.165588 
      25       50.100000       0.116313 
      25       50.070000       0.162769 
      25       50.060000       0.210228 
      25       50.100000       0.201152 
      26       50.070000       0.168911 
      26       49.990000       0.177895 
      26       50.000000       0.191657 
      26       50.090000       0.182176 
      26       49.980000       0.198157 
      26       50.000000       0.213387 
      26       50.040000       0.217584 
      27       50.110000       0.214410 
      27       50.000000       0.213703 
      27       50.070000       0.210142 
      27       49.930000       0.209464 
      27       50.020000       0.205932 
      27       50.100000       0.204872 
      27       50.020000       0.196493 
      27       50.080000       0.177342 
      27       50.090000       0.158604 
      27       49.980000       0.173956 
      27       50.050000       0.188564 
      28       49.920000       0.183595 
      28       49.920000       0.147596 
      28       50.000000       0.125248 
      28       50.040000       0.131134 
      28       49.950000       0.112446 
      28       49.980000       0.099454 
      28       50.000000       0.116071 
      29       50.010000       0.154966 
      29       49.950000       0.170615 
      29       50.010000       0.152561 
      29       49.970000       0.119968 
      29       50.000000       0.129416 
      29       49.960000       0.143662 
      29       50.000000       0.134661 
      29       49.950000       0.151116 
      29       50.000000       0.166791 
      29       49.950000       0.170603 
      29       49.930000       0.158072 
      30       49.930000       0.120270 
      30       50.010000       0.081244 
      30       49.960000       0.089832 
      30       49.980000       0.095074 
      30       50.070000       0.119476 
      30       49.950000       0.153282 
      30       50.020000       0.159752 
      30       50.030000       0.160417 
      30       49.900000       0.157414 
      30       49.990000       0.157225 
      31       50.020000       0.152965 
      31       50.020000       0.138553 
      31       49.940000       0.084407 
      31       50.010000       0.052470 
      31       49.980000       0.098127 
      31       50.060000       0.132090 
      31       49.980000       0.118464 
      31       50.050000       0.077250 
      31       49.900000       0.054824 
      31       50.050000       0.057346 
      32       49.860000       0.095816 
      32       49.990000       0.133901 
      32       49.990000       0.135631 
      32       49.870000       0.112569 
      32       49.940000       0.069699 
      32       49.890000       0.036632 
      32       49.820000       -0.008561 
      32       50.000000       -0.047945 
      32       49.920000       -0.049710 
      32       49.960000       -0.018120 
      33       49.990000       0.056119 
      33       49.990000       0.100372 
      33       49.880000       0.096750 
      33       49.930000       0.104636 
      34       49.870000       0.088089 
      34       49.900000       0.076575 
      34       49.860000       0.107315 
      34       49.930000       0.127908 
      34       49.900000       0.132508 
      34       49.890000       0.119946 
      34       49.920000       0.077632 
      34       49.890000       0.020835 
      34       49.840000       0.018981 
      35       49.810000       0.054587 
      35       49.910000       0.099428 
      35       49.830000       0.121377 
      35       49.890000       0.126946 
      35       49.890000       0.124691 
      35       49.900000       0.124881 
      35       49.910000       0.122208 
      36       49.880000       0.122384 
      36       49.830000       0.118885 
      36       49.880000       0.109308 
      36       49.840000       0.069557 
      36       49.930000       0.038780 
      36       49.870000       0.063142 
      36       49.870000       0.082545 
      36       49.850000       0.074568 
      36       49.860000       0.091637 
      37       49.840000       0.107933 
      37       49.880000       0.113184 
      37       49.890000       0.111041 
      37       49.840000       0.110942 
      37       49.810000       0.103502 
      37       49.850000       0.085281 
      37       49.820000       0.067438 
      38       49.840000       0.082864 
      38       49.850000       0.088996 
      38       49.900000       0.052722 
      38       49.880000       0.006000 
      38       49.860000       0.037033 
      38       49.790000       0.089423 
      38       49.930000       0.101398 
      38       49.840000       0.102647 
      38       49.800000       0.095329 
      38       49.830000       0.077163 
      39       49.800000       0.058550 
      39       49.820000       0.064252 
      39       49.810000       0.033350 
      39       49.850000       -0.033447 
      39       49.740000       -0.048227 
      39       49.890000       0.020569 
      39       49.800000       0.082936 
      39       49.850000       0.095840 
      39       49.820000       0.097595 
      39       49.820000       0.095235 
      40       49.890000       0.095707 
      40       49.800000       0.093313 
      40       49.800000       0.093378 
      40       49.900000       0.086114 
      40       49.780000       0.068067 
      40       49.820000       0.050422 
      40       49.820000       0.066882 
      40       49.780000       0.083399 
      40       49.850000       0.088895 
      40       49.850000       0.087008 
      41       49.860000       0.087549 
      41       49.820000       0.084411 
      41       49.840000       0.075591 
      41       49.850000       0.040685 
      41       49.770000       0.024738 
      41       49.810000       0.055544 
      41       49.760000       0.075818 
      41       49.790000       0.071990 
      41       49.790000       0.033051 
      42       49.780000       0.002639 
      42       49.770000       0.026950 
      42       49.800000       0.042207 
      42       49.840000       0.020079 
      42       49.830000       0.030911 
      42       49.780000       0.040411 
      42       49.780000       0.004007 
      42       49.780000       -0.031430 
      43       49.790000       -0.034789 
      43       49.860000       -0.002361 
      43       49.790000       -0.000267 
      43       49.730000       -0.007199 
      43       49.850000       0.010924 
      43       49.770000       0.051321 
      43       49.750000       0.073326 
      43       49.770000       0.079322 
      43       49.740000       0.076280 
      44       49.780000       0.062635 
      44       49.720000       0.008823 
      44       49.820000       -0.027265 
      44       49.760000       0.000580 
      44       49.770000       0.020004 
      44       49.760000       0.023890 
      44       49.770000       0.012018 
      44       49.790000       0.031533 
      44       49.730000       0.056393 
      44       49.850000       0.031066 
      44       49.770000       0.015203 
      45       49.710000       0.036344 
      45       49.740000       0.020441 
      45       49.760000       -0.004127 
      45       49.770000       0.025158 
      45       49.760000       0.053751 
      45       49.770000       0.024382 
      46       49.760000       -0.004694 
      46       49.750000       0.024198 
      46       49.750000       0.053186 
      46       49.730000       0.027839 
      46       49.760000       0.006276 
      46       49.740000       -0.000516 
      46       49.730000       -0.064743 
      46       49.770000       -0.094763 
      47       49.790000       -0.031216 
      47       49.740000       0.017375 
      47       49.790000       0.049723 
      47       49.730000       0.067714 
      47       49.770000       0.073407 
      47       49.800000       0.071674 
      47       49.720000       0.072369 
      47       49.790000       0.069383 
      48       49.730000       0.060713 
      48       49.770000       0.025956 
      48       49.700000       0.010156 
      48       49.730000       0.041095 
      48       49.720000       0.061087 
      48       49.740000       0.052500 
      48       49.750000       -0.004840 
      48       49.790000       -0.049975 
      48       49.730000       -0.004279 
      48       49.700000       0.053018 
      48       49.730000       0.065783 
      49       49.780000       0.067826 
      49       49.740000       0.065763 
      49       49.820000       0.066530 
      49       49.730000       0.064440 
      49       49.700000       0.065220 
      49       49.790000       0.063130 
      49       49.670000       0.063485 
      49       49.830000       0.056107 
      49       49.700000       0.033866 
      49       49.760000       0.002447 
      50       49.770000       0.017962 
      50       49.780000       0.051907 
      50       49.790000       0.058526 
      50       49.760000       0.050802 
      50       49.740000       0.016144 
      50       49.740000       -0.000408 
      50       49.700000       0.020863 
      50       49.780000       0.005114 
      50       49.740000       -0.019301 
      50       49.730000       0.010136 
      51       49.740000       0.038853 
      51       49.760000       0.008782 
      51       49.770000       -0.029924 
      51       49.750000       -0.037162 
      51       49.710000       -0.029226 
      51       49.760000       0.010535 
      51       49.740000       0.049898 
      52       49.690000       0.056976 
      52       49.700000       0.049255 
      52       49.720000       0.013774 
      52       49.770000       -0.012155 
      52       49.720000       -0.023505 
      52       49.680000       -0.056187 
      52       49.700000       -0.051978 
      52       49.780000       -0.016062 
      53       49.730000       0.020099 
      53       49.720000       0.010115 
      53       49.750000       -0.000168 
      53       49.730000       0.031326 
      53       49.740000       0.051868 
      53       49.740000       0.048692 
      54       49.720000       0.014494 
      54       49.720000       -0.001178 
      54       49.680000       0.029914 
      54       49.740000       0.051282 
      54       49.670000       0.057086 
      54       49.670000       0.050623 
      55       49.700000       0.032944 
      55       49.700000       0.015651 
      55       49.740000       0.032459 
      55       49.770000       0.049320 
      55       49.750000       0.055157 
      55       49.800000       0.053607 
      55       49.640000       0.054508 
      55       49.720000       0.052526 
      55       49.660000       0.052999 
      56       49.660000       0.046139 
      56       49.710000       0.028465 
      56       49.750000       0.010365 
      56       49.710000       0.017413 
      56       49.730000       -0.002809 
      56       49.700000       -0.027969 
      56       49.770000       -0.002926 
      57       49.760000       0.012656 
      57       49.720000       -0.008738 
      57       49.690000       0.007741 
      57       49.650000       0.041840 
      57       49.740000       0.049384 
      57       49.670000       0.050714 
      57       49.740000       0.043490 
      57       49.750000       0.021376 
      57       49.690000       -0.009918 
      58       49.690000       0.005721 
      58       49.720000       0.039814 
      58       49.570000       0.047392 
      58       49.750000       0.049180 
      58       49.740000       0.047290 
      58       49.740000       0.048215 
      58       49.690000       0.045471 
      58       49.760000       0.037027 
      59       49.680000       0.002081 
      59       49.690000       -0.018386 
      59       49.710000       -0.005732 
      59       49.720000       0.000465 
      59       49.720000       0.022743 
      59       49.670000       0.040140 
      60       49.730000       0.046083 
      60       49.680000       0.044623 
      60       49.670000       0.045614 
      60       49.730000       0.043734 
      60       49.690000       0.044721 
      60       49.670000       0.042837 
      60       49.730000       0.043407 
      60       49.680000       0.036642 
      60       49.730000       0.019090 
      60       49.690000       0.001935 
      60       49.740000       0.018879 
      61       49.760000       0.035863 
