Human trial picking the raspberry twin 

 time    ||     output compensated 

      0       -799.943750 
      0       -799.943750 
      0       -799.943750 
      0       -799.943750 
      0       -799.943750 
      0       -799.943750 
      0       -799.943750 
      0       -799.943750 
      0       -799.943750 
      0       -799.943745 
      0       -799.942556 
      0       -799.835505 
      0       -796.290456 
      0       -753.102652 
      0       -559.545300 
      0       -240.412142 
      0       -46.839094 
      0       -3.648189 
      0       -0.101285 
      0       0.004341 
      0       0.006968 
      0       0.005522 
      1       0.006517 
      1       -0.000294 
      1       -0.022206 
      1       -0.054043 
      1       -0.043719 
      1       -0.032561 
      1       -0.054460 
      1       -0.037917 
      1       -0.003395 
      1       0.004662 
      1       0.006947 
      1       0.005535 
      1       0.006973 
      1       0.005535 
      1       0.006973 
      1       0.005535 
      1       0.006973 
      1       0.005535 
      1       0.006973 
      1       0.005522 
      1       0.006530 
      1       0.000122 
      1       -0.017680 
      1       -0.040215 
      1       -0.047276 
      1       -0.069784 
      1       -0.086727 
      1       -0.083197 
      1       -0.043732 
      1       -0.003851 
      2       0.004648 
      2       0.006907 
      2       0.004205 
      2       -0.009224 
      2       -0.067056 
      2       -0.112709 
      2       -0.067056 
      2       -0.009224 
      2       0.004206 
      2       0.006933 
      2       0.005535 
      2       0.006973 
      2       0.005535 
      2       0.006973 
      2       0.005535 
      2       0.006973 
      2       0.005535 
      2       0.006973 
      2       0.005535 
      2       0.006973 
      2       0.005535 
      2       0.006973 
      2       0.005535 
      2       0.006973 
      2       0.005535 
      3       0.006973 
      3       0.005535 
      3       0.006973 
      3       0.005535 
      3       0.006973 
      3       0.005535 
      3       0.006973 
      3       0.005535 
      3       0.006973 
      3       0.005535 
      3       0.006973 
      3       0.005535 
      3       0.006973 
      3       0.005535 
      3       0.006973 
      3       0.005535 
      3       0.006973 
      3       0.005535 
      3       0.006973 
      3       0.005535 
      3       0.006973 
      3       0.005535 
      3       0.006973 
      3       0.005535 
      3       0.006973 
      3       0.005535 
      3       0.006973 
      3       0.005535 
      3       0.006973 
      3       0.005535 
      3       0.006973 
      3       0.005535 
      3       0.006973 
      3       0.005535 
      4       0.006973 
      4       0.005535 
      4       0.006973 
      4       0.005535 
      4       0.006973 
      4       0.005535 
      4       0.006947 
      4       0.004649 
      4       -0.003825 
      4       -0.042444 
      4       -0.072101 
      4       -0.046630 
      4       -0.026130 
      4       -0.033020 
      4       -0.014875 
      4       0.002473 
      4       0.008340 
      4       0.001940 
      4       -0.019747 
      4       -0.050629 
      4       -0.034583 
      4       -0.000087 
      4       0.007890 
      4       0.010073 
      4       0.008575 
      4       0.009913 
      4       0.008390 
      4       0.009730 
      4       0.008209 
      4       0.009551 
      5       0.008031 
      5       0.009375 
      5       0.007857 
      5       0.009203 
      5       0.007686 
      5       0.009007 
      5       0.006642 
      5       -0.001839 
      5       -0.041303 
      5       -0.079946 
      5       -0.082217 
      5       -0.059728 
      5       -0.018676 
      5       -0.001278 
      5       -0.017600 
      5       -0.048065 
      5       -0.032031 
      5       0.002440 
      5       0.010391 
      5       0.012549 
      5       0.011026 
      5       0.012340 
      5       0.010793 
      5       0.012109 
      5       0.010564 
      5       0.011882 
      5       0.010339 
      6       0.011660 
      6       0.010119 
      6       0.011442 
      6       0.009890 
      6       0.010790 
      6       0.004352 
      6       -0.012878 
      6       -0.029713 
      6       -0.012452 
      6       0.004859 
      6       0.011140 
      6       0.010030 
      6       0.011367 
      6       0.009830 
      6       0.011155 
      6       0.009620 
      6       0.010948 
      6       0.009414 
      6       0.010744 
      6       0.009213 
      6       0.010545 
      6       0.009015 
      6       0.010349 
      6       0.008821 
      6       0.010157 
      6       0.008632 
      6       0.009969 
      6       0.008446 
      6       0.009785 
      6       0.008290 
      7       0.010482 
      7       0.018766 
      7       0.057222 
      7       0.086306 
      7       0.055787 
      7       0.016585 
      7       0.008044 
      7       0.006127 
      7       0.012809 
      7       0.035252 
      7       0.077175 
      7       0.116326 
      7       0.211122 
      7       0.413534 
      7       0.662363 
      7       0.812792 
      7       0.816328 
      7       0.776686 
      7       0.767206 
      7       0.791067 
      7       0.870856 
      7       0.935807 
      7       0.959644 
      7       1.000841 
      7       1.040775 
      7       1.049276 
      7       1.051588 
      7       1.050646 
      7       1.058384 
      7       1.092464 
      8       1.190209 
      8       1.348059 
      8       1.573473 
      8       1.789584 
      8       1.885474 
      8       1.925536 
      8       1.944735 
      8       1.952044 
      8       1.960974 
      8       2.000881 
      8       2.040776 
      8       2.049317 
      8       2.052985 
      8       2.069126 
      8       2.160214 
      8       2.361014 
      8       2.594069 
      8       2.733523 
      8       2.807097 
      8       2.881059 
      8       2.895025 
      8       2.890127 
      8       2.922408 
      8       2.944374 
      8       2.952569 
      8       2.969570 
      8       3.066096 
      8       3.291926 
      8       3.573901 
      8       3.764377 
      8       3.827223 
      8       3.800774 
      8       3.770912 
      8       3.791426 
      8       3.798264 
      8       3.799540 
      8       3.873127 
      8       3.933493 
      8       3.949675 
      8       3.939762 
      8       3.855453 
      8       3.435047 
      8       2.297130 
      8       0.712784 
      8       -0.161102 
      8       0.060127 
      8       0.567698 
      8       0.689348 
      9       0.495669 
      9       0.241528 
      9       0.024177 
      9       -0.205904 
      9       -0.528688 
      9       -0.861353 
      9       -1.075278 
      9       -1.210279 
      9       -1.374910 
      9       -1.605748 
      9       -1.777036 
      9       -1.800809 
      9       -1.819801 
      9       -1.884223 
      9       -1.919785 
      9       -1.936758 
      9       -1.984736 
      9       -1.987863 
      9       -1.958325 
      9       -1.950711 
      9       -1.948869 
      9       -1.935685 
      9       -1.933513 
      9       -1.931116 
      9       -1.894003 
      9       -1.848477 
      9       -1.790935 
      9       -1.757047 
      9       -1.770118 
      9       -1.787061 
      9       -1.775074 
      9       -1.758382 
      9       -1.775530 
      9       -1.792890 
      9       -1.799285 
      10       -1.798276 
      10       -1.799728 
      10       -1.798289 
      10       -1.799741 
      10       -1.798746 
      10       -1.805557 
      10       -1.827456 
      10       -1.858850 
      10       -1.843153 
      10       -1.808658 
      10       -1.800601 
      10       -1.798316 
      10       -1.799742 
      10       -1.798746 
      10       -1.805557 
      10       -1.827469 
      10       -1.859280 
      10       -1.848095 
      10       -1.827026 
      10       -1.811329 
      10       -1.763391 
      10       -1.760264 
      10       -1.789803 
      10       -1.797430 
      10       -1.799701 
      10       -1.798289 
      10       -1.799728 
      10       -1.798276 
      11       -1.799285 
      11       -1.792890 
      11       -1.775531 
      11       -1.758395 
      11       -1.775531 
      11       -1.792890 
      11       -1.799285 
      11       -1.798276 
      11       -1.799728 
      11       -1.798289 
      11       -1.799728 
      11       -1.798289 
      11       -1.799728 
      11       -1.798289 
      11       -1.799741 
      11       -1.798746 
      11       -1.805557 
      11       -1.827456 
      11       -1.858850 
      11       -1.843153 
      11       -1.808658 
      11       -1.800601 
      11       -1.798316 
      11       -1.799728 
      11       -1.798316 
      11       -1.800601 
      11       -1.808658 
      11       -1.843153 
      11       -1.840261 
      11       -1.790778 
      11       -1.751191 
      11       -1.726923 
      11       -1.710200 
      11       -1.686342 
      11       -1.647799 
      12       -1.600241 
      12       -1.599778 
      12       -1.617931 
      12       -1.609728 
      12       -1.595892 
      12       -1.578535 
      12       -1.564174 
      12       -1.547109 
      12       -1.533062 
      12       -1.516307 
      12       -1.502568 
      12       -1.486118 
      12       -1.472681 
      12       -1.456530 
      12       -1.443402 
      12       -1.427983 
      12       -1.420446 
      12       -1.427921 
      12       -1.444722 
      12       -1.414735 
      12       -1.366437 
      12       -1.344797 
      12       -1.329113 
      12       -1.318071 
      12       -1.313279 
      12       -1.338790 
      12       -1.355045 
      12       -1.311400 
      12       -1.254323 
      12       -1.210287 
      13       -1.166253 
      13       -1.170104 
      13       -1.192554 
      13       -1.188630 
      13       -1.179844 
      13       -1.176048 
      13       -1.198438 
      13       -1.201994 
      13       -1.158893 
      13       -1.125638 
      13       -1.108077 
      13       -1.103301 
      13       -1.113934 
      13       -1.133862 
      13       -1.106558 
      13       -1.056436 
      13       -1.019285 
      13       -0.991290 
      13       -0.998316 
      13       -1.005544 
      13       -1.002657 
      13       -1.001032 
      13       -1.025185 
      13       -1.030474 
      13       -0.989115 
      13       -0.958382 
      13       -0.951455 
      13       -0.975653 
      13       -0.981423 
      13       -0.940528 
      13       -0.909443 
      13       -0.893606 
      14       -0.885655 
      14       -0.875361 
      14       -0.868005 
      14       -0.857063 
      14       -0.840516 
      14       -0.797961 
      14       -0.774441 
      14       -0.797777 
      14       -0.811479 
      14       -0.810121 
      14       -0.801473 
      14       -0.800240 
      14       -0.814769 
      14       -0.847514 
      14       -0.860719 
      14       -0.849042 
      14       -0.801508 
      14       -0.754423 
      14       -0.742945 
      14       -0.746931 
      14       -0.737351 
      14       -0.692154 
      14       -0.660483 
      14       -0.636501 
      14       -0.650157 
      14       -0.678218 
      14       -0.679425 
      14       -0.674893 
      14       -0.666746 
      14       -0.661503 
      14       -0.653464 
      14       -0.648353 
      14       -0.640446 
      14       -0.635465 
      14       -0.627687 
      14       -0.622834 
      14       -0.615168 
      14       -0.610015 
      14       -0.597571 
      14       -0.573984 
      15       -0.546374 
      15       -0.539264 
      15       -0.535517 
      15       -0.552033 
      15       -0.564124 
      15       -0.564826 
      15       -0.558180 
      15       -0.554048 
      15       -0.547496 
      15       -0.547926 
      15       -0.554726 
      15       -0.547533 
      15       -0.509554 
      15       -0.502812 
      15       -0.510064 
      15       -0.510868 
      15       -0.504748 
      15       -0.501137 
      15       -0.494689 
      15       -0.490740 
      15       -0.479503 
      15       -0.457521 
      15       -0.435982 
      15       -0.448560 
      15       -0.460422 
      15       -0.452735 
      15       -0.414057 
      15       -0.389444 
      15       -0.396743 
      15       -0.384183 
      15       -0.346369 
      15       -0.309003 
      15       -0.340267 
      15       -0.376156 
      15       -0.404091 
      15       -0.418512 
      15       -0.420697 
      15       -0.415492 
      15       -0.412774 
      15       -0.407222 
      15       -0.404548 
      16       -0.398240 
      16       -0.386268 
      16       -0.347817 
      16       -0.323480 
      16       -0.328209 
      16       -0.316538 
      16       -0.329763 
      16       -0.347763 
      16       -0.359839 
      16       -0.403699 
      16       -0.402758 
      16       -0.369487 
      16       -0.358255 
      16       -0.352849 
      16       -0.355625 
      16       -0.369254 
      16       -0.382526 
      16       -0.361736 
      16       -0.340933 
      16       -0.331193 
      16       -0.328853 
      16       -0.323277 
      16       -0.311655 
      16       -0.269894 
      16       -0.237513 
      16       -0.263956 
      16       -0.290560 
      16       -0.263317 
      16       -0.246021 
      16       -0.275506 
      16       -0.303831 
      16       -0.340262 
      16       -0.352838 
      16       -0.318242 
      16       -0.293354 
      16       -0.282826 
      16       -0.271184 
      16       -0.230253 
      16       -0.203600 
      16       -0.253899 
      16       -0.314753 
      17       -0.287242 
      17       -0.234693 
      17       -0.230536 
      17       -0.211852 
      17       -0.199061 
      17       -0.228150 
      17       -0.242655 
      17       -0.228362 
      17       -0.209553 
      17       -0.224448 
      17       -0.239815 
      17       -0.248653 
      17       -0.263778 
      17       -0.278118 
      17       -0.258359 
      17       -0.238151 
      17       -0.224120 
      17       -0.199760 
      17       -0.166231 
      17       -0.174790 
      17       -0.184088 
      17       -0.160567 
      17       -0.175326 
      17       -0.207311 
      17       -0.207895 
      17       -0.184975 
      17       -0.152070 
      17       -0.166090 
      17       -0.198580 
      17       -0.204570 
      17       -0.204787 
      17       -0.201367 
      17       -0.201629 
      17       -0.208001 
      17       -0.244565 
      17       -0.271762 
      17       -0.238963 
      17       -0.192996 
      17       -0.163217 
      17       -0.133957 
      17       -0.112335 
      17       -0.097317 
      18       -0.133755 
      18       -0.168639 
      18       -0.178202 
      18       -0.175834 
      18       -0.175087 
      18       -0.166594 
      18       -0.143248 
      18       -0.110735 
      18       -0.125194 
      18       -0.158931 
      18       -0.174718 
      18       -0.207959 
      18       -0.221445 
      18       -0.188151 
      18       -0.164589 
      18       -0.156201 
      18       -0.155624 
      18       -0.152631 
      18       -0.152528 
      18       -0.149539 
      18       -0.148178 
      18       -0.130141 
      18       -0.069940 
      18       -0.007079 
      18       -0.053616 
      18       -0.124024 
      18       -0.135654 
      18       -0.118374 
      18       -0.095359 
      18       -0.092322 
      18       -0.087726 
      18       -0.085615 
      18       -0.072714 
      18       -0.092447 
      18       -0.126098 
      18       -0.132826 
      18       -0.133760 
      19       -0.131025 
      19       -0.131139 
      19       -0.128403 
      19       -0.128543 
      19       -0.125834 
      19       -0.125999 
      19       -0.123315 
      19       -0.123480 
      19       -0.119983 
      19       -0.110807 
      19       -0.075549 
      19       -0.059253 
      19       -0.089741 
      19       -0.110523 
      19       -0.116161 
      19       -0.114014 
      19       -0.114285 
      19       -0.110880 
      19       -0.101795 
      19       -0.066627 
      19       -0.050420 
      19       -0.080997 
      19       -0.101866 
      19       -0.107590 
      19       -0.105516 
      19       -0.105472 
      19       -0.098074 
      19       -0.079443 
      19       -0.055514 
      19       -0.039007 
      19       0.011074 
      19       0.021623 
      19       -0.043398 
      19       -0.078347 
      19       -0.051993 
      19       -0.014966 
      19       -0.029562 
      19       -0.058483 
      19       -0.112043 
      20       -0.121544 
      20       -0.049806 
      20       0.013634 
      20       0.030449 
      20       -0.032975 
      20       -0.118131 
      20       -0.124131 
      20       -0.063430 
      20       -0.055271 
      20       -0.083524 
      20       -0.089375 
      20       -0.080892 
      20       -0.040627 
      20       -0.001164 
      20       0.001917 
      20       -0.019782 
      20       -0.060477 
      20       -0.082403 
      20       -0.088348 
      20       -0.086479 
      20       -0.087052 
      20       -0.084757 
      20       -0.085334 
      20       -0.083043 
      20       -0.083211 
      20       -0.076035 
      20       -0.057651 
      20       -0.034791 
      20       -0.028303 
      20       -0.015550 
      20       -0.035841 
      20       -0.070072 
      20       -0.077799 
      20       -0.084588 
      20       -0.105010 
      21       -0.129722 
