Human trial picking the raspberry twin 

 time    ||     output compensated 

      0       -798.845000 
      0       -798.845000 
      0       -798.845000 
      0       -798.845000 
      0       -798.845000 
      0       -798.845000 
      0       -798.845000 
      0       -798.845000 
      0       -798.845000 
      0       -798.844995 
      0       -798.843808 
      0       -798.736917 
      0       -795.197173 
      0       -752.073729 
      0       -558.801786 
      0       -240.128534 
      0       -46.829293 
      0       -3.708923 
      0       -0.147263 
      0       -0.000908 
      0       0.021788 
      0       0.016868 
      0       -0.025241 
      0       -0.009517 
      0       0.036566 
      0       0.037991 
      0       0.054521 
      0       0.065262 
      0       0.032591 
      0       0.001131 
      0       -0.040469 
      0       -0.076836 
      0       -0.124744 
      0       -0.174533 
      0       -0.083465 
      0       0.032867 
      0       0.022748 
      0       -0.025335 
      0       -0.018514 
      0       -0.012745 
      0       -0.053039 
      0       -0.113583 
      0       -0.080351 
      0       -0.010114 
      0       -0.045842 
      0       -0.089386 
      0       -0.042254 
      0       0.011895 
      0       0.021408 
      0       -0.000614 
      1       0.036192 
      1       0.089459 
      1       0.096240 
      1       0.065249 
      1       -0.009530 
      1       -0.054354 
      1       -0.046297 
      1       -0.030627 
      1       0.029437 
      1       0.077775 
      1       0.042890 
      1       -0.032868 
      1       -0.067350 
      1       -0.014903 
      1       0.054504 
      1       0.054091 
      1       0.043806 
      1       0.066161 
      1       0.054534 
      1       0.037548 
      1       0.031180 
      1       -0.033284 
      1       -0.060152 
      1       0.012382 
      1       0.043763 
      1       0.042920 
      1       0.065719 
      1       0.050061 
      1       0.025438 
      1       0.054548 
      1       0.078701 
      1       0.029894 
      1       -0.025698 
      1       -0.028412 
      1       -0.050354 
      1       -0.084849 
      1       -0.086661 
      1       -0.054837 
      1       0.024065 
      1       0.078244 
      1       0.054547 
      1       0.025868 
      1       0.055017 
      1       0.084557 
      1       0.059947 
      1       0.044250 
      1       0.065759 
      1       0.050049 
      1       0.025035 
      1       0.050451 
      1       0.069815 
      2       0.051819 
      2       0.022267 
      2       -0.030627 
      2       -0.039127 
      2       -0.028425 
      2       -0.037355 
      2       -0.029285 
      2       -0.049052 
      2       -0.068652 
      2       -0.014070 
      2       0.064846 
      2       0.096670 
      2       0.094858 
      2       0.060389 
      2       0.039294 
      2       0.046061 
      2       0.023136 
      2       -0.012215 
      2       -0.025254 
      2       0.019136 
      2       0.030280 
      2       -0.025853 
      2       -0.032706 
      2       -0.002684 
      2       0.014694 
      2       0.054029 
      2       0.083596 
      2       0.058010 
      2       0.037370 
      2       0.043297 
      2       0.015223 
      2       -0.039787 
      2       -0.081720 
      2       -0.067873 
      2       -0.052309 
      2       -0.049377 
      2       -0.074809 
      2       -0.104924 
      2       -0.101804 
      2       -0.044751 
      2       -0.003150 
      2       0.009408 
      2       0.018554 
      2       0.056613 
      2       0.080784 
      3       0.031284 
      3       -0.028119 
      3       -0.039283 
      3       -0.037657 
      3       -0.010091 
      3       0.031563 
      3       0.076621 
      3       0.092615 
      3       0.064678 
      3       -0.014494 
      3       -0.076909 
      3       -0.079236 
      3       -0.034086 
      3       0.037230 
      3       0.050618 
      3       0.045261 
      3       0.076767 
      3       0.097705 
      3       0.103445 
      3       0.100573 
      3       0.091153 
      3       0.050334 
      3       0.005855 
      3       -0.016309 
      3       -0.014913 
      3       0.023060 
      3       0.048429 
      3       0.075135 
      3       0.091595 
      3       0.087636 
      3       0.052996 
      3       0.035662 
      3       0.051667 
      3       0.017000 
      3       -0.023088 
      3       0.021489 
      3       0.063396 
      3       0.015308 
      3       -0.047840 
      3       -0.023849 
      3       0.015855 
      3       -0.023769 
      3       -0.047031 
      4       0.016859 
      4       0.069013 
      4       0.043560 
      4       0.000451 
      4       -0.021220 
      4       -0.015706 
      4       0.031457 
      4       0.038680 
      4       0.022354 
      4       0.007428 
      4       -0.035610 
      4       -0.024620 
      4       0.002625 
      4       -0.011944 
      4       0.015600 
      4       0.031010 
      4       0.007171 
      4       0.016912 
      4       0.013109 
      4       0.001111 
      4       0.004995 
      4       0.043190 
      4       0.072827 
      4       0.047361 
      4       0.027279 
      4       0.039065 
      4       0.039495 
      4       0.038279 
      4       0.025812 
      4       0.044324 
      4       0.059177 
      4       -0.005538 
      4       -0.077087 
      4       -0.122323 
      4       -0.200638 
      4       -0.169632 
      4       -0.044790 
      4       0.043210 
      4       0.039578 
      4       0.015348 
      4       0.040397 
      4       0.059615 
      4       0.046948 
      4       0.045205 
      4       0.039804 
      4       0.022602 
      4       -0.055351 
      5       -0.119468 
      5       -0.083342 
      5       -0.049635 
      5       -0.075325 
      5       -0.094975 
      5       -0.090904 
      5       -0.050525 
      5       -0.006044 
      5       0.016574 
      5       0.020959 
      5       0.012212 
      5       0.049475 
      5       0.079032 
      5       0.056163 
      5       -0.016342 
      5       -0.045808 
      5       0.018457 
      5       0.080432 
      5       0.093349 
      5       0.095129 
      5       0.092793 
      5       0.093263 
      5       0.090055 
      5       0.080766 
      5       0.041301 
      5       0.010793 
      5       0.034996 
      5       0.049309 
      5       0.016858 
      5       -0.014803 
      5       -0.058619 
      5       -0.088153 
      5       -0.058466 
      5       -0.028612 
      5       -0.051812 
      5       -0.056144 
      5       0.013595 
      5       0.076032 
      5       0.088154 
      5       0.080148 
      5       0.039904 
      5       0.000448 
      5       -0.002652 
      5       0.018203 
      6       0.049062 
      6       0.032605 
      6       -0.006777 
      6       -0.033296 
      6       -0.050792 
      6       -0.034197 
      6       -0.026495 
      6       -0.057545 
      6       -0.093929 
      6       -0.078257 
      6       -0.048243 
      6       0.006862 
      6       0.024035 
      6       -0.008080 
      6       0.023507 
      6       0.066232 
      6       0.040382 
      6       0.001733 
      6       -0.007086 
      6       -0.014196 
      6       -0.031266 
      6       -0.047918 
      6       -0.030461 
      6       -0.012532 
      6       -0.000731 
      6       0.022233 
      6       0.062943 
      6       0.084831 
      6       0.090327 
      6       0.083531 
      6       0.065497 
      6       0.047040 
      6       0.054134 
      6       0.038026 
      6       0.026161 
      6       0.047592 
      6       0.031589 
      6       0.006936 
      6       0.036948 
      6       0.074810 
      6       0.077492 
      6       0.058680 
      6       0.021530 
      6       -0.036161 
      7       -0.080774 
      7       -0.011475 
      7       0.062081 
      7       0.082523 
      7       0.081975 
      7       0.082606 
      7       0.079505 
      7       0.070295 
      7       0.030097 
      7       -0.009673 
      7       -0.017140 
      7       -0.009405 
      7       0.030158 
      7       0.069312 
      7       0.075770 
      7       0.062968 
      7       0.009179 
      7       -0.026913 
      7       0.000929 
      7       0.020350 
      7       0.024232 
      7       0.012383 
      7       0.032732 
      7       0.066955 
      7       0.073423 
      7       0.065139 
      7       0.025869 
      7       -0.004046 
      7       0.025638 
      7       0.063587 
      7       0.065968 
      7       0.042791 
      7       -0.007918 
      7       -0.062683 
      7       -0.081269 
      7       -0.031999 
      7       -0.001598 
      7       0.029116 
      7       0.064265 
      7       0.071638 
      8       0.073184 
      8       0.071041 
      8       0.071316 
      8       0.063860 
      8       0.041542 
      8       0.010046 
      8       0.025485 
      8       0.059341 
      8       0.065447 
      8       0.052336 
      8       -0.005429 
      8       -0.051009 
      8       -0.010621 
      8       0.023635 
      8       0.007037 
      8       0.023784 
      8       0.057735 
      8       0.065135 
      8       0.066745 
      8       0.064680 
      8       0.065430 
      8       0.062462 
      8       0.052172 
      8       -0.001726 
      8       -0.087634 
      8       -0.109040 
      8       -0.045790 
      8       -0.010796 
      8       0.019545 
      8       0.044126 
      8       0.004255 
      8       -0.066319 
      8       -0.081170 
      8       -0.012058 
      8       0.050609 
      8       0.062999 
      8       0.055682 
      8       0.020988 
      8       0.004388 
      8       0.025611 
      8       0.009815 
      8       -0.014621 
      8       0.015620 
      8       0.054121 
      8       0.061956 
      8       0.063186 
      8       0.056223 
      8       0.037598 
      8       0.009607 
      9       -0.020145 
      9       -0.066564 
      9       -0.045465 
      9       0.023277 
      9       0.049204 
      9       0.032364 
      9       -0.007988 
      9       -0.025520 
      9       -0.013423 
      9       0.003236 
      9       -0.013773 
      9       -0.030809 
      9       -0.036392 
      9       -0.029685 
      9       -0.006870 
      9       0.034118 
      9       0.056295 
      9       0.062075 
      9       0.055550 
      9       0.037383 
      9       0.014726 
      9       0.008439 
      9       -0.004142 
      9       0.015495 
      9       0.040103 
      9       0.010458 
      9       -0.018904 
      9       0.005623 
      9       0.020269 
      9       -0.010615 
      9       -0.027283 
      9       -0.015156 
      9       0.001096 
      9       -0.020812 
      9       -0.056825 
      9       -0.083008 
      9       -0.083398 
      9       -0.071118 
      9       -0.011317 
      9       0.037515 
      10       0.013254 
      10       -0.015258 
      10       0.014577 
      10       0.052637 
      10       0.055180 
      10       0.033786 
      10       0.001956 
      10       0.012158 
      10       0.023083 
      10       0.001172 
      10       0.017565 
      10       0.052417 
      10       0.069722 
      10       0.109863 
      10       0.155799 
      10       0.212525 
      10       0.363450 
      10       0.558691 
      10       0.721312 
      10       0.900123 
      10       1.063338 
      10       1.181295 
      10       1.313233 
      10       1.537303 
      10       1.785280 
      10       1.895136 
      10       1.972409 
      10       2.099265 
      10       2.299760 
      10       2.559727 
      10       2.756502 
      10       2.877212 
      10       2.968187 
      10       3.019860 
      10       3.040529 
      10       3.098017 
      10       3.218144 
      10       3.397520 
      10       3.633302 
      10       3.872186 
      11       4.006294 
      11       4.051160 
      11       4.071426 
      11       4.065666 
      11       4.104343 
      11       4.229816 
      11       4.450896 
      11       4.732305 
      11       4.940803 
      11       5.015265 
      11       5.031061 
      11       5.046813 
      11       5.122174 
      11       5.255796 
      11       5.393835 
      11       5.506905 
      11       5.624347 
      11       5.801021 
      11       5.962371 
      11       6.066870 
      11       6.118866 
      11       6.127432 
      11       6.119819 
      11       6.079952 
      11       6.040058 
      11       6.031517 
      11       6.027822 
      11       6.010794 
      11       5.908909 
      11       5.659767 
      11       5.348671 
      11       5.181546 
      11       5.183688 
      11       5.228095 
      11       5.288163 
      11       5.457599 
      11       5.713990 
      11       5.920164 
      11       6.011694 
      11       6.027822 
      12       6.030630 
      12       6.029233 
      12       6.030671 
      12       6.029233 
      12       6.030671 
      12       6.029233 
      12       6.030672 
      12       6.029273 
      12       6.032001 
      12       6.045457 
      12       6.104149 
      12       6.159741 
      12       6.152543 
      12       6.136044 
      12       6.129676 
      12       6.130685 
      12       6.129233 
      12       6.130671 
      12       6.129233 
      12       6.130673 
      12       6.129341 
      12       6.134339 
      12       6.176563 
      12       6.377837 
      12       6.729688 
      12       7.003080 
      12       7.111251 
      12       7.139533 
      12       7.192065 
      12       7.285324 
      12       7.391511 
      12       7.446672 
      12       7.386996 
      12       7.271290 
      12       7.188581 
      12       7.082411 
      13       6.606512 
      13       5.512335 
      13       3.900202 
      13       1.903008 
      13       0.475186 
      13       0.709607 
      13       1.349020 
      13       1.301826 
      13       0.911004 
      13       0.493714 
      13       0.217382 
      13       0.035780 
      13       -0.268516 
      13       -0.738956 
      13       -1.193413 
      13       -1.544644 
      13       -1.755951 
      13       -1.853945 
      13       -1.906894 
      13       -1.916348 
      13       -1.918674 
      13       -1.917262 
      13       -1.918701 
      14       -1.917263 
      14       -1.918701 
      14       -1.917263 
      14       -1.918701 
      14       -1.917263 
      14       -1.918701 
      14       -1.917263 
      14       -1.918701 
      14       -1.917263 
      14       -1.918714 
      14       -1.917706 
      14       -1.924100 
      14       -1.941460 
      14       -1.958622 
      14       -1.942346 
      14       -1.934925 
      14       -1.967013 
      14       -2.010174 
      14       -2.024419 
      14       -2.052713 
      14       -2.027104 
      14       -1.957254 
      14       -1.925417 
      14       -1.917746 
      14       -1.918715 
      15       -1.917263 
      15       -1.918701 
      15       -1.917263 
      15       -1.918701 
      15       -1.917263 
      15       -1.918701 
      15       -1.917263 
      15       -1.918701 
      15       -1.917263 
      15       -1.918701 
      15       -1.917263 
      15       -1.918701 
      15       -1.917263 
      15       -1.918701 
      15       -1.917263 
      15       -1.918701 
      15       -1.917263 
      15       -1.918701 
      15       -1.917263 
      15       -1.918701 
      15       -1.917263 
      15       -1.918701 
      15       -1.917263 
      15       -1.918701 
      15       -1.917263 
      15       -1.918701 
      15       -1.917289 
      15       -1.919574 
      15       -1.927631 
      16       -1.962126 
      16       -1.977823 
      16       -1.946429 
      16       -1.924530 
      16       -1.917719 
      16       -1.918714 
      16       -1.917263 
      16       -1.918701 
      16       -1.917263 
      16       -1.918701 
      16       -1.917263 
      16       -1.918701 
      16       -1.917263 
      16       -1.918701 
      16       -1.917263 
      16       -1.918701 
      16       -1.917263 
      16       -1.918701 
      16       -1.917263 
      16       -1.918701 
      16       -1.917263 
      16       -1.918701 
      17       -1.898090 
      17       -1.880533 
      17       -1.860304 
      17       -1.843125 
      17       -1.823269 
      17       -1.806461 
      17       -1.786972 
      17       -1.770526 
      17       -1.751397 
      17       -1.735307 
      17       -1.716530 
      17       -1.700789 
      17       -1.682357 
      17       -1.666957 
      17       -1.648864 
      17       -1.633799 
      17       -1.616037 
      17       -1.601301 
      17       -1.583864 
      17       -1.569449 
      18       -1.552331 
      18       -1.538231 
      18       -1.521425 
      18       -1.507635 
      18       -1.491134 
      18       -1.477647 
      18       -1.461447 
      18       -1.448256 
      18       -1.432350 
      18       -1.419450 
      18       -1.403832 
      18       -1.391217 
      18       -1.375881 
      18       -1.363546 
      18       -1.348487 
      18       -1.336426 
      18       -1.321638 
      18       -1.309845 
      18       -1.295323 
      18       -1.283794 
      18       -1.269532 
      18       -1.258260 
      19       -1.244254 
      19       -1.233235 
      19       -1.219479 
      19       -1.208721 
      19       -1.195636 
      19       -1.190010 
      19       -1.195296 
      19       -1.200307 
      19       -1.171339 
      19       -1.142414 
      19       -1.123808 
      19       -1.103756 
      19       -1.054061 
      19       -1.013864 
      19       -1.033382 
      19       -1.061692 
      19       -1.059464 
      19       -1.051144 
      19       -1.039235 
      19       -1.030267 
      20       -1.018540 
      20       -1.009779 
      20       -0.998257 
      20       -0.989698 
      20       -0.978377 
      20       -0.970018 
      20       -0.958893 
      20       -0.950729 
      20       -0.939797 
      20       -0.931823 
      20       -0.921081 
      20       -0.913294 
      20       -0.902737 
      20       -0.895107 
      20       -0.883881 
      20       -0.866654 
      20       -0.819343 
      20       -0.781493 
      20       -0.803335 
      20       -0.833946 
      20       -0.833995 
      20       -0.827930 
      20       -0.818253 
      20       -0.811495 
      21       -0.801956 
