Human trial picking the raspberry twin 

 time    ||     output compensated 

      0       -799.257692 
      0       -799.257692 
      0       -799.257692 
      0       -799.257692 
      0       -799.257692 
      0       -799.257692 
      0       -799.257692 
      0       -799.257692 
      0       -799.257692 
      0       -799.257687 
      0       -799.256499 
      0       -799.149542 
      0       -795.607596 
      0       -752.457612 
      0       -559.070499 
      0       -240.226526 
      0       -46.860883 
      0       -3.744148 
      0       -0.188610 
      0       -0.071118 
      0       -0.081324 
      0       -0.103977 
      0       -0.098802 
      0       -0.074810 
      0       -0.016329 
      0       0.005851 
      0       0.008355 
      0       0.040860 
      0       0.078661 
      0       0.069127 
      0       0.062065 
      0       0.026544 
      0       -0.046420 
      0       -0.086314 
      0       -0.061744 
      0       -0.037021 
      0       -0.030820 
      0       -0.020478 
      0       -0.049162 
      0       -0.051859 
      0       -0.036605 
      0       -0.036192 
      0       -0.044661 
      0       -0.088626 
      0       -0.071074 
      0       -0.022333 
      0       -0.010597 
      0       -0.017807 
      0       -0.056802 
      0       -0.086784 
      0       -0.057661 
      0       -0.027679 
      0       -0.046903 
      1       -0.038846 
      1       0.017158 
      1       0.001488 
      1       -0.056744 
      1       -0.040578 
      1       0.027001 
      1       0.062092 
      1       0.069570 
      1       0.084061 
      1       0.065070 
      1       0.048679 
      1       0.035018 
      1       0.008299 
      1       -0.053674 
      1       -0.094398 
      1       -0.092197 
      1       -0.045175 
      1       -0.037965 
      1       -0.123648 
      1       -0.173204 
      1       -0.127731 
      1       -0.046838 
      1       -0.022873 
      1       -0.041036 
      1       -0.098995 
      1       -0.119038 
      1       -0.097582 
      1       -0.044746 
      1       -0.027637 
      1       -0.081110 
      1       -0.123481 
      1       -0.149660 
      1       -0.133340 
      1       -0.117792 
      1       -0.047320 
      1       0.046727 
      1       0.079008 
      1       0.067894 
      1       0.046285 
      1       0.044610 
      1       0.045413 
      1       0.057566 
      1       0.036900 
      1       0.002001 
      1       -0.005222 
      1       0.001988 
      1       0.036483 
      1       0.053040 
      1       0.031584 
      2       0.048127 
      2       0.082179 
      2       0.084004 
      2       0.053013 
      2       -0.016811 
      2       -0.042459 
      2       -0.015495 
      2       -0.017407 
      2       -0.045521 
      2       -0.117335 
      2       -0.129269 
      2       -0.055472 
      2       0.040982 
      2       0.123832 
      2       0.140415 
      2       0.071451 
      2       0.008246 
      2       -0.005626 
      2       -0.008367 
      2       -0.006955 
      2       -0.007872 
      2       -0.001076 
      2       0.019763 
      2       0.040834 
      2       -0.012322 
      2       -0.077004 
      2       -0.048250 
      2       0.004950 
      2       0.021878 
      2       -0.030397 
      2       -0.063602 
      2       0.018027 
      2       0.107180 
      2       0.082006 
      2       0.029906 
      2       0.006338 
      2       0.041997 
      2       0.067933 
      2       0.040406 
      2       -0.002315 
      2       -0.016821 
      2       -0.050034 
      2       -0.048987 
      2       -0.028640 
      2       -0.057585 
      2       -0.080908 
      2       -0.030968 
      2       0.032913 
      3       0.057733 
      3       0.052866 
      3       -0.005468 
      3       -0.043879 
      3       -0.042620 
      3       0.007470 
      3       0.032296 
      3       0.017653 
      3       0.004772 
      3       -0.055382 
      3       -0.092721 
      3       -0.101386 
      3       -0.077529 
      3       -0.056524 
      3       -0.038942 
      3       -0.056897 
      3       -0.071639 
      3       -0.007663 
      3       0.053754 
      3       0.056260 
      3       0.076184 
      3       0.030526 
      3       -0.041984 
      3       -0.007440 
      3       0.087544 
      3       0.094236 
      3       0.028106 
      3       0.054877 
      3       0.117335 
      3       0.113452 
      3       0.099985 
      3       0.095694 
      3       0.044331 
      3       -0.072487 
      3       -0.138639 
      3       -0.136046 
      3       -0.052982 
      3       0.034432 
      3       0.018986 
      3       -0.065799 
      3       -0.109186 
      3       -0.065364 
      3       0.025243 
      3       0.131527 
      3       0.118618 
      3       0.035866 
      3       0.004003 
      3       0.009274 
      3       0.003401 
      4       -0.033919 
      4       -0.005626 
      4       0.021000 
      4       -0.079043 
      4       -0.163765 
      4       -0.133474 
      4       -0.092948 
      4       -0.096153 
      4       -0.080885 
      4       -0.088669 
      4       -0.124868 
      4       -0.173912 
      4       -0.212822 
      4       -0.221462 
      4       -0.144613 
      4       -0.006154 
      4       0.083132 
      4       0.021061 
      4       -0.070897 
      4       -0.030270 
      4       0.051598 
      4       0.054277 
      4       0.034112 
      4       0.017419 
      4       -0.040026 
      4       -0.079902 
      4       -0.079663 
      4       -0.025543 
      4       0.069187 
      4       0.114582 
      4       0.042122 
      4       -0.004056 
      4       0.068341 
      4       0.104409 
      4       0.067942 
      4       -0.010026 
      4       -0.050658 
      4       -0.034229 
      4       -0.049453 
      4       -0.068815 
      4       -0.023864 
      4       0.018119 
      4       0.027724 
      4       0.088183 
      4       0.092617 
      4       -0.008528 
      4       -0.076343 
      4       -0.083547 
      4       -0.048601 
      5       -0.017882 
      5       0.007471 
      5       0.037244 
      5       0.002118 
      5       -0.037194 
      5       -0.068080 
      5       -0.080556 
      5       -0.063415 
      5       -0.036156 
      5       -0.059321 
      5       -0.062236 
      5       0.004451 
      5       -0.016040 
      5       -0.104050 
      5       -0.101363 
      5       -0.057229 
      5       -0.069179 
      5       -0.098964 
      5       -0.105690 
      5       -0.086231 
      5       -0.079789 
      5       -0.049540 
      5       -0.005286 
      5       0.045030 
      5       0.014734 
      5       -0.091320 
      5       -0.152142 
      5       -0.117295 
      5       -0.039872 
      5       0.009782 
      5       0.017687 
      5       0.005504 
      5       -0.047324 
      5       -0.079207 
      5       -0.046514 
      5       -0.061615 
      5       -0.096821 
      5       -0.059619 
      5       -0.039401 
      5       -0.062137 
      5       -0.051663 
      5       -0.053943 
      5       -0.055896 
      5       -0.019541 
      5       0.026849 
      5       -0.004938 
      5       -0.062529 
      5       -0.092519 
      5       -0.099144 
      5       -0.033730 
      5       0.058290 
      5       0.097845 
      5       0.105572 
      5       0.129088 
      5       0.150298 
      5       0.173284 
      5       0.114666 
      6       0.035953 
      6       -0.006177 
      6       -0.048737 
      6       -0.071219 
      6       -0.080906 
      6       -0.082990 
      6       -0.042868 
      6       0.026490 
      6       0.020746 
      6       0.010534 
      6       0.018692 
      6       0.024836 
      6       0.032525 
      6       0.061043 
      6       0.052843 
      6       -0.009299 
      6       -0.027408 
      6       -0.044510 
      6       -0.095840 
      6       -0.064387 
      6       0.006419 
      6       0.025365 
      6       0.044750 
      6       0.036600 
      6       0.004932 
      6       -0.016601 
      6       -0.000735 
      6       0.006632 
      6       -0.024376 
      6       -0.057901 
      6       -0.044043 
      6       -0.078617 
      6       -0.124890 
      6       -0.103195 
      6       -0.098272 
      6       -0.089148 
      6       -0.075099 
      6       -0.067500 
      6       -0.055857 
      6       0.009208 
      6       0.147937 
      6       0.268973 
      6       0.299644 
      6       0.401006 
      7       0.586415 
      7       0.699146 
      7       0.786165 
      7       0.874951 
      7       0.954409 
      7       1.110515 
      7       1.353936 
      7       1.605058 
      7       1.864308 
      7       2.218460 
      7       2.613488 
      7       2.953301 
      7       3.269914 
      7       3.522265 
      7       3.660096 
      7       3.718016 
      7       3.812259 
      7       4.010916 
      7       4.299992 
      7       4.564055 
      7       4.681498 
      7       4.707178 
      7       4.717478 
      7       4.756566 
      7       4.786496 
      7       4.755600 
      7       4.704019 
      8       4.626222 
      8       4.450545 
      8       4.189130 
      8       3.566969 
      8       2.034990 
      8       0.202979 
      8       -0.391641 
      8       0.071420 
      8       0.235287 
      8       -0.149487 
      8       -0.631435 
      8       -1.001519 
      8       -1.216301 
      8       -1.323540 
      8       -1.357275 
      8       -1.351005 
      8       -1.368584 
      8       -1.380572 
      8       -1.362769 
      8       -1.321866 
      8       -1.299121 
      8       -1.292310 
      8       -1.294165 
      8       -1.302652 
      8       -1.342546 
      8       -1.382413 
      8       -1.390054 
      8       -1.382440 
      8       -1.343419 
      8       -1.313020 
      8       -1.337604 
      8       -1.353301 
      8       -1.318513 
      8       -1.322145 
      8       -1.348019 
      8       -1.361538 
      8       -1.370206 
      8       -1.353256 
      8       -1.319029 
      8       -1.263123 
      8       -1.225755 
      8       -1.201426 
      8       -1.232510 
      8       -1.283553 
      9       -1.254778 
      9       -1.171724 
      9       -1.121814 
      9       -1.148789 
      9       -1.207794 
      9       -1.211230 
      9       -1.130817 
      9       -1.056936 
      9       -1.032633 
      9       -1.029892 
      9       -1.031290 
      9       -1.029878 
      9       -1.032203 
      9       -1.041536 
      9       -1.090482 
      9       -1.158061 
      9       -1.160359 
      9       -1.099868 
      9       -1.092242 
      9       -1.120935 
      9       -1.123592 
      9       -1.107039 
      9       -1.089070 
      9       -1.096308 
      9       -1.076514 
      9       -1.056874 
      9       -1.110180 
      9       -1.174644 
      9       -1.154574 
      9       -1.118640 
      9       -1.117807 
      9       -1.078729 
      9       -1.042102 
      9       -1.030738 
      9       -1.031330 
      9       -1.030308 
      9       -1.037145 
      9       -1.059891 
      9       -1.100780 
      9       -1.118140 
      10       -1.100794 
      10       -1.060347 
      10       -1.042975 
      10       -1.059501 
      10       -1.091338 
      10       -1.086386 
      10       -1.098982 
      10       -1.155376 
      10       -1.138833 
      10       -1.069816 
      10       -1.038005 
      10       -1.030334 
      10       -1.031303 
      10       -1.029851 
      10       -1.031290 
      10       -1.029851 
      10       -1.031290 
      10       -1.029892 
      10       -1.022306 
      10       -1.025817 
      10       -1.078132 
      10       -1.135651 
      10       -1.108754 
      10       -1.026296 
      10       -0.967164 
      10       -0.948240 
      10       -0.936456 
      10       -0.928489 
      10       -0.917780 
      10       -0.910026 
      10       -0.899528 
      10       -0.892795 
      10       -0.891856 
      10       -0.917513 
      10       -0.928785 
      10       -0.907026 
      10       -0.891817 
      10       -0.860616 
      10       -0.834398 
      10       -0.820136 
      10       -0.817853 
      10       -0.827286 
      10       -0.841336 
      10       -0.840378 
      10       -0.860480 
      10       -0.903254 
      10       -0.976842 
      11       -1.015765 
      11       -0.957354 
      11       -0.870067 
      11       -0.828598 
      11       -0.807399 
      11       -0.778018 
      11       -0.748531 
      11       -0.788900 
      11       -0.827631 
      11       -0.780710 
      11       -0.753459 
      11       -0.752473 
      11       -0.740589 
      11       -0.694087 
      11       -0.647663 
      11       -0.632772 
      11       -0.624169 
      11       -0.619325 
      11       -0.611708 
      11       -0.607014 
      11       -0.599520 
      11       -0.594962 
      11       -0.588014 
      11       -0.588478 
      11       -0.600218 
      11       -0.616538 
      11       -0.617789 
      11       -0.638827 
      11       -0.668660 
      11       -0.683432 
      11       -0.655153 
      11       -0.612818 
      11       -0.584819 
      11       -0.595484 
      11       -0.605850 
      11       -0.596283 
      11       -0.551251 
      11       -0.506282 
      11       -0.493643 
      11       -0.495884 
      11       -0.526751 
      12       -0.556662 
      12       -0.594894 
      12       -0.634771 
      12       -0.583475 
      12       -0.543655 
      12       -0.540272 
      12       -0.530523 
      12       -0.491029 
      12       -0.465685 
      12       -0.473512 
      12       -0.475342 
      12       -0.497791 
      12       -0.529473 
      12       -0.550982 
      12       -0.547982 
      12       -0.546175 
      12       -0.541508 
      12       -0.542792 
      12       -0.492950 
      12       -0.413949 
      12       -0.377866 
      12       -0.366506 
      12       -0.364651 
      12       -0.369380 
      12       -0.404330 
      12       -0.429943 
      12       -0.395987 
      12       -0.353383 
      12       -0.341461 
      12       -0.335797 
      12       -0.334675 
      12       -0.339304 
      12       -0.370061 
      12       -0.381901 
      12       -0.347028 
      12       -0.322716 
      12       -0.322146 
      12       -0.352636 
      12       -0.364637 
      12       -0.329910 
      12       -0.304931 
      12       -0.295139 
      12       -0.293173 
      12       -0.288804 
      12       -0.287340 
      12       -0.283043 
      13       -0.281649 
      13       -0.277847 
      13       -0.281812 
      13       -0.300673 
      13       -0.328747 
      13       -0.309933 
      13       -0.273122 
      13       -0.267733 
      13       -0.285911 
      13       -0.314532 
      13       -0.300752 
      13       -0.282205 
      13       -0.286960 
      13       -0.266714 
      13       -0.251754 
      13       -0.261955 
      13       -0.281245 
      13       -0.286248 
      13       -0.315069 
      13       -0.361418 
      13       -0.371273 
      13       -0.296013 
      13       -0.234192 
      13       -0.225932 
      13       -0.270840 
      13       -0.334994 
      13       -0.333919 
      13       -0.270668 
      13       -0.259573 
      13       -0.275970 
      13       -0.242676 
      14       -0.201579 
      14       -0.191175 
      14       -0.187014 
      14       -0.187393 
      14       -0.193907 
      14       -0.230625 
      14       -0.258401 
      14       -0.231067 
      14       -0.208722 
      14       -0.213787 
      14       -0.193834 
      14       -0.174683 
      14       -0.166606 
      14       -0.165938 
      14       -0.162842 
      14       -0.162637 
      14       -0.159587 
      14       -0.159428 
      14       -0.156835 
      14       -0.161597 
      14       -0.177167 
      14       -0.192373 
      14       -0.173911 
      14       -0.159905 
      14       -0.171011 
      14       -0.190746 
      14       -0.190498 
      14       -0.187798 
      14       -0.173862 
      14       -0.191732 
      14       -0.214552 
      14       -0.182324 
      14       -0.141844 
      14       -0.132036 
      14       -0.128441 
      14       -0.128555 
      14       -0.125871 
      14       -0.126874 
      14       -0.133595 
      14       -0.166848 
      15       -0.186038 
      15       -0.176201 
      15       -0.182416 
      15       -0.159733 
      15       -0.123547 
      15       -0.114322 
      15       -0.110916 
      15       -0.111205 
      15       -0.108669 
      15       -0.109019 
      15       -0.106931 
      15       -0.112192 
      15       -0.128256 
      15       -0.143938 
      15       -0.125534 
      15       -0.107093 
      15       -0.099718 
      15       -0.100557 
      15       -0.107515 
      15       -0.140616 
      15       -0.155588 
      15       -0.132352 
      15       -0.142075 
      15       -0.150875 
      15       -0.117848 
      15       -0.094976 
      15       -0.087283 
      15       -0.087396 
      15       -0.085085 
      15       -0.085658 
      16       -0.083377 
      16       -0.083981 
      16       -0.082142 
      16       -0.087651 
      16       -0.103961 
      16       -0.119885 
      16       -0.101722 
      16       -0.083519 
      16       -0.076354 
      16       -0.076589 
      16       -0.074386 
      16       -0.075066 
      16       -0.072891 
      16       -0.073586 
      16       -0.071426 
      16       -0.072149 
      16       -0.070442 
      16       -0.076481 
      16       -0.097396 
      16       -0.127502 
      16       -0.110700 
      16       -0.075868 
      16       -0.072040 
      16       -0.087668 
      16       -0.103729 
      16       -0.085727 
      16       -0.067684 
      16       -0.060677 
      16       -0.061082 
      16       -0.059459 
      17       -0.065195 
      17       -0.081729 
      17       -0.097876 
      17       -0.079933 
      17       -0.061948 
      17       -0.055024 
      17       -0.056310 
      17       -0.063710 
      17       -0.097223 
      17       -0.111791 
      17       -0.079593 
      17       -0.057117 
      17       -0.049803 
      17       -0.050291 
      17       -0.048377 
      17       -0.050155 
      17       -0.057630 
      17       -0.091230 
      17       -0.106709 
      17       -0.084361 
      17       -0.098632 
      17       -0.117077 
      17       -0.067201 
      17       -0.012332 
      17       -0.019360 
      17       -0.035501 
      17       -0.041450 
      17       -0.040037 
      17       -0.041074 
      17       -0.039239 
      17       -0.040271 
      17       -0.038444 
      17       -0.039484 
      17       -0.037665 
      17       -0.038712 
      17       -0.036901 
      17       -0.037956 
      17       -0.036192 
      17       -0.038518 
      17       -0.051015 
      17       -0.103265 
      18       -0.133313 
      18       -0.085359 
      18       -0.044229 
      18       -0.032576 
      18       -0.038155 
      18       -0.060266 
      18       -0.100156 
      18       -0.116766 
      18       -0.103319 
      18       -0.080415 
      18       -0.072633 
      18       -0.049598 
      18       -0.031477 
      18       -0.024819 
      18       -0.025569 
      18       -0.023902 
      18       -0.025925 
      18       -0.033642 
      18       -0.067456 
      18       -0.082322 
      18       -0.050418 
      18       -0.028247 
      19       -0.021647 
      19       -0.027323 
      19       -0.044223 
      19       -0.060757 
      19       -0.043611 
      19       -0.030895 
      19       -0.042866 
      19       -0.058950 
      19       -0.040532 
      19       -0.013128 
      19       0.030554 
      19       0.060330 
      19       0.030084 
      19       -0.008874 
      19       -0.017613 
      19       -0.025031 
      19       -0.046486 
      19       -0.077102 
      19       -0.060791 
      19       -0.026033 
      19       -0.017796 
      19       -0.015356 
      19       -0.016601 
      19       -0.015011 
      19       -0.016298 
      19       -0.015136 
      20       -0.021315 
      20       -0.038314 
      20       -0.055733 
      20       -0.047612 
      20       -0.062676 
      20       -0.072683 
      20       -0.040450 
      20       -0.018353 
      20       -0.011426 
      20       -0.012298 
      20       -0.010737 
      20       -0.012054 
      20       -0.010509 
      20       -0.011828 
      20       -0.010286 
      20       -0.011581 
      20       -0.009203 
      20       -0.001135 
      20       0.033027 
      20       0.048237 
      20       0.016674 
      20       -0.005173 
      20       -0.011864 
      20       -0.010760 
      20       -0.012103 
      20       -0.010996 
