Human trial picking the raspberry twin 

 time    ||     output compensated 

      0       -800.975000 
      0       -800.975000 
      0       -800.975000 
      0       -800.975000 
      0       -800.975000 
      0       -800.975000 
      0       -800.975000 
      0       -800.975000 
      0       -800.975000 
      0       -800.974995 
      0       -800.973804 
      0       -800.866606 
      0       -797.316709 
      0       -754.070375 
      0       -560.256767 
      0       -240.722369 
      0       -46.914573 
      0       -3.633743 
      0       -0.054307 
      0       0.022922 
      0       -0.014922 
      0       -0.023390 
      0       -0.025688 
      0       -0.024276 
      0       -0.025715 
      0       -0.024277 
      0       -0.025715 
      0       -0.024277 
      0       -0.025715 
      1       -0.024277 
      1       -0.025715 
      1       -0.024277 
      1       -0.025715 
      1       -0.024277 
      1       -0.025715 
      1       -0.024277 
      1       -0.025715 
      1       -0.024277 
      1       -0.025715 
      1       -0.024277 
      1       -0.025715 
      1       -0.024277 
      1       -0.025715 
      1       -0.024277 
      1       -0.025715 
      1       -0.024277 
      1       -0.025715 
      1       -0.024277 
      1       -0.025715 
      1       -0.024277 
      1       -0.025715 
      1       -0.024277 
      1       -0.025715 
      1       -0.024277 
      1       -0.025715 
      2       -0.024277 
      2       -0.025715 
      2       -0.024277 
      2       -0.025715 
      2       -0.024277 
      2       -0.025715 
      2       -0.024277 
      3       -0.025715 
      3       -0.024277 
      3       -0.025715 
      3       -0.024277 
      3       -0.025715 
      3       -0.024277 
      3       -0.025715 
      3       -0.024277 
      3       -0.025715 
      3       -0.024277 
      3       -0.025715 
      3       -0.024277 
      3       -0.025715 
      3       -0.024277 
      3       -0.025715 
      3       -0.024277 
      3       -0.025715 
      3       -0.024277 
      3       -0.025715 
      3       -0.024277 
      4       -0.025715 
      4       -0.024277 
      4       -0.025715 
      4       -0.024277 
      4       -0.025715 
      4       -0.024277 
      4       -0.025715 
      4       -0.024277 
      4       -0.025715 
      4       -0.024277 
      4       -0.025715 
      4       -0.024277 
      4       -0.025715 
      4       -0.024277 
      4       -0.025715 
      4       -0.024277 
      4       -0.025715 
      4       -0.024277 
      4       -0.025715 
      4       -0.024277 
      4       -0.025715 
      4       -0.024277 
      4       -0.025715 
      4       -0.024277 
      4       -0.025715 
      4       -0.024277 
      4       -0.025715 
      4       -0.024277 
      4       -0.025715 
      4       -0.024276 
      4       -0.025688 
      4       -0.023390 
      4       -0.014877 
      4       0.025434 
      4       0.069868 
      4       0.092653 
      4       0.097250 
      4       0.088641 
      4       0.125604 
      4       0.160582 
      4       0.170201 
      4       0.167115 
      5       0.158411 
      5       0.134657 
      5       0.180878 
      5       0.351632 
      5       0.504356 
      5       0.582776 
      5       0.678635 
      5       0.797830 
      5       0.884041 
      5       0.908887 
      5       0.908309 
      5       0.908106 
      5       0.948014 
      5       0.987922 
      5       0.996865 
      5       1.004563 
      5       1.027402 
      5       1.070535 
      5       1.115803 
      5       1.231113 
      5       1.448887 
      5       1.675310 
      5       1.823651 
      5       1.886055 
      5       1.896381 
      5       1.899593 
      5       1.908120 
      5       1.948068 
      5       1.989709 
      5       2.018958 
      5       2.108523 
      5       2.232799 
      5       2.304864 
      5       2.330978 
      5       2.369070 
      5       2.457355 
      6       2.428716 
      6       2.347227 
      6       2.409520 
      6       2.516603 
      6       2.616176 
      6       2.681556 
      6       2.690593 
      6       2.675866 
      6       2.674968 
      6       2.764722 
      6       2.902637 
      6       2.991978 
      6       3.050189 
      6       3.109475 
      6       3.128288 
      6       3.176420 
      6       3.309893 
      6       3.492904 
      6       3.655074 
      6       3.761884 
      6       3.820551 
      6       3.868197 
      6       3.891466 
      7       3.899674 
      7       3.915816 
      7       4.002404 
      7       4.189806 
      7       4.431387 
      7       4.627319 
      7       4.754673 
      7       4.886941 
      7       4.976169 
      7       4.995495 
      7       4.998680 
      7       4.997294 
      7       4.998706 
      7       4.996355 
      7       4.986122 
      7       4.925921 
      7       4.804106 
      7       4.692450 
      7       4.641368 
      7       4.585776 
      7       4.585265 
      7       4.696523 
      7       4.772625 
      7       4.513147 
      7       3.452963 
      7       1.519517 
      7       -0.066730 
      7       -0.100181 
      7       0.527343 
      7       0.815089 
      7       0.758990 
      7       0.420575 
      7       -0.191594 
      7       -0.942971 
      7       -1.578616 
      8       -1.977360 
      8       -2.275150 
      8       -2.619567 
      8       -2.920808 
      8       -3.042392 
      8       -3.039363 
      8       -3.052374 
      8       -3.068112 
      8       -3.029016 
      8       -3.006690 
      8       -2.955763 
      8       -2.891617 
      8       -2.854712 
      8       -2.823929 
      8       -2.797939 
      9       -2.778374 
      9       -2.818268 
      9       -2.858136 
      9       -2.865776 
      9       -2.858162 
      9       -2.819155 
      9       -2.789199 
      9       -2.819141 
      9       -2.857733 
      9       -2.860834 
      9       -2.839794 
      9       -2.808400 
      9       -2.823238 
      10       -2.847821 
      10       -2.818281 
      10       -2.789146 
      10       -2.818268 
      10       -2.847391 
      10       -2.818269 
      10       -2.789172 
      10       -2.819155 
      10       -2.858203 
      10       -2.867106 
      10       -2.874373 
      10       -2.892189 
      10       -2.914281 
      10       -2.915943 
      10       -2.914254 
      10       -2.891316 
      11       -2.864032 
      11       -2.824567 
      11       -2.808440 
      11       -2.839795 
      11       -2.860834 
      11       -2.857733 
      11       -2.819141 
      11       -2.789199 
      11       -2.819155 
      11       -2.858189 
      11       -2.866663 
      11       -2.868961 
      11       -2.867549 
      11       -2.868987 
      11       -2.867549 
      11       -2.869001 
      11       -2.868005 
      11       -2.874803 
      11       -2.896259 
      11       -2.922281 
      11       -2.883246 
      11       -2.818795 
      11       -2.824997 
      11       -2.858646 
      11       -2.866676 
      12       -2.868961 
      12       -2.867548 
      12       -2.868961 
      12       -2.866662 
      12       -2.858162 
      12       -2.818268 
      12       -2.778374 
      12       -2.769888 
      12       -2.768033 
      12       -2.774844 
      13       -2.797602 
      13       -2.838935 
      13       -2.861693 
      13       -2.868531 
      13       -2.867536 
      13       -2.840297 
      13       -2.810470 
      13       -2.783763 
      13       -2.753650 
      13       -2.717699 
      13       -2.651027 
      13       -2.585048 
      13       -2.551633 
      13       -2.533654 
      13       -2.546936 
      13       -2.551122 
      13       -2.495955 
      13       -2.432378 
      13       -2.400517 
      13       -2.384075 
      14       -2.399704 
      14       -2.415202 
      14       -2.399464 
      14       -2.377745 
      14       -2.352570 
      14       -2.330468 
      14       -2.305740 
      14       -2.284106 
      14       -2.259841 
      14       -2.238640 
      14       -2.213979 
      14       -2.183450 
      14       -2.122959 
      14       -2.071634 
      14       -2.075255 
      14       -2.070043 
      14       -2.028075 
      14       -2.024185 
      14       -2.038120 
      14       -2.025715 
      14       -2.007720 
      14       -1.986245 
      14       -1.967807 
      15       -1.946704 
      15       -1.928635 
      15       -1.907074 
      15       -1.879614 
      15       -1.822174 
      15       -1.774296 
      15       -1.786209 
      15       -1.806991 
      16       -1.797310 
      16       -1.781612 
      16       -1.762398 
      16       -1.746198 
      16       -1.727312 
      16       -1.711463 
      16       -1.692924 
      16       -1.677393 
      16       -1.658344 
      16       -1.633372 
      16       -1.578394 
      16       -1.532954 
      16       -1.547267 
      16       -1.570000 
      16       -1.557343 
      16       -1.520090 
      16       -1.463996 
      16       -1.426825 
      17       -1.405788 
      17       -1.392729 
      17       -1.377803 
      17       -1.370767 
      17       -1.378739 
      17       -1.396032 
      17       -1.366532 
      17       -1.318743 
      17       -1.298431 
      17       -1.293023 
      17       -1.319562 
      18       -1.345861 
      18       -1.340804 
      18       -1.329233 
      18       -1.309224 
      18       -1.274452 
      18       -1.230627 
      18       -1.233861 
      18       -1.255646 
      18       -1.250215 
      18       -1.230162 
      18       -1.179243 
      18       -1.137794 
      18       -1.156073 
      18       -1.183156 
      18       -1.179713 
      18       -1.170191 
      18       -1.157091 
      18       -1.146945 
      19       -1.134051 
      19       -1.124135 
      19       -1.111469 
      19       -1.101779 
      19       -1.089337 
      19       -1.079868 
      19       -1.067645 
      19       -1.058392 
      19       -1.046384 
      19       -1.037345 
      19       -1.025547 
      20       -1.016716 
      20       -1.005125 
      20       -0.996497 
      20       -0.985108 
      20       -0.976681 
      20       -0.965490 
      20       -0.957260 
      20       -0.946263 
      20       -0.938198 
      20       -0.926554 
      20       -0.909312 
      20       -0.866069 
      20       -0.841868 
      21       -0.864530 
