Human trial picking the raspberry twin 

 time    ||     output     ||     loadcell

      0.000000       -785.070769       0.030000 
      0.030921       -785.070769       0.040000 
      0.059840       -785.070769       0.110000 
      0.090270       -785.070769       0.040000 
      0.135149       -785.070769       0.000000 
      0.165069       -785.070769       0.060000 
      0.195499       -785.070769       0.210000 
      0.225419       -785.070769       0.120000 
      0.255341       -785.070769       0.090000 
      0.285259       -785.070764       0.130000 
      0.315179       -785.069597       0.020000 
      0.345100       -784.964541       0.240000 
      0.375021       -781.485566       0.070000 
      0.404939       -739.103504       0.220000 
      0.434860       -549.165954       0.150000 
      0.464810       -236.028460       0.030000 
      0.494729       -46.088625       0.020000 
      0.524618       -3.633985       0.020000 
      0.554566       -0.087792       0.190000 
      0.584486       0.056773       0.060000 
      0.614379       0.099123       0.030000 
      0.644326       0.122922       0.190000 
      0.674245       0.122922       0.100000 
      0.704165       0.099155       0.200000 
      0.734092       0.058831       0.060000 
      0.764006       0.029248       0.110000 
      0.793932       0.000082       0.090000 
      0.823845       -0.035313       0.010000 
      0.853765       -0.041155       0.090000 
      0.883695       -0.035813       0.310000 
      0.913606       -0.070751       0.140000 
      0.943528       -0.105260       0.070000 
      0.973445       -0.094532       0.300000 
      1.003366       -0.076567       0.150000 
      1.033287       -0.075721       0.030000 
      1.063206       -0.084177       0.020000 
      1.093131       -0.062252       0.050000 
      1.123018       -0.014717       0.140000 
      1.152958       -0.021901       0.110000 
      1.183535       -0.029901       0.040000 
      1.213455       0.005897       0.110000 
      1.243104       0.053015       0.170000 
      1.273052       0.093299       0.120000 
      1.302972       0.098242       0.170000 
      1.332898       0.076756       0.130000 
      1.362785       0.040419       0.260000 
      1.392780       -0.029014       0.190000 
      1.422692       -0.045598       0.130000 
      1.452612       0.009923       0.020000 
      1.482460       0.012151       0.170000 
      1.512378       -0.036213       0.050000 
      1.542302       -0.064493       0.010000 
      1.572191       -0.070268       0.030000 
      1.602139       -0.069851       0.090000 
      1.632060       -0.059496       0.010000 
      1.661978       -0.016058       0.080000 
      1.691896       0.044932       0.090000 
      1.721845       0.077616       0.290000 
      1.751765       0.103681       0.290000 
      1.781690       0.118383       0.090000 
      1.811576       0.103708       0.100000 
      1.841496       0.078529       0.080000 
      1.871418       0.056630       0.180000 
      1.901851       0.043591       0.020000 
      1.931744       0.074542       0.060000 
      1.961663       0.088384       0.100000 
      1.991584       0.058831       0.110000 
      2.021503       0.040020       0.140000 
      2.051423       0.048489       0.140000 
      2.081899       0.044932       0.100000 
      2.111819       0.013108       0.060000 
      2.141739       0.005481       0.170000 
      2.171659       0.005494       0.010000 
      2.202167       0.013524       0.150000 
      2.232717       0.049432       0.090000 
      2.262665       0.061432       0.070000 
      2.292620       0.025691       0.040000 
      2.322549       -0.025940       0.020000 
      2.352320       -0.014177       0.140000 
      2.382863       0.013924       0.120000 
      2.412866       0.009537       0.030000 
      2.442878       0.012625       0.040000 
      2.472833       0.034147       0.140000 
      2.502743       0.000069       0.090000 
      2.532635       -0.040628       0.030000 
      2.562555       0.000512       0.030000 
      2.592762       0.039546       0.070000 
      2.623216       0.036862       0.260000 
      2.653809       0.050747       0.140000 
      2.683728       0.053862       0.030000 
      2.714288       0.057958       0.000000 
      2.744207       0.064147       0.160000 
      2.774130       0.028818       0.040000 
      2.804049       -0.010229       0.050000 
      2.833967       -0.013773       0.110000 
      2.863887       0.002323       0.030000 
      2.893807       0.015323       0.020000 
      2.923727       -0.011129       0.120000 
      2.953646       -0.011559       0.100000 
      2.983567       0.009897       0.170000 
      3.013514       -0.022787       0.150000 
      3.043440       -0.065366       0.070000 
      3.073327       -0.094075       0.070000 
      3.103284       -0.110592       0.040000 
      3.133199       -0.093619       0.120000 
      3.163086       -0.059497       0.230000 
      3.193007       0.007682       0.190000 
      3.222927       0.084356       0.010000 
      3.252846       0.095970       0.030000 
      3.282674       0.079457       0.220000 
      3.313143       0.053848       0.110000 
      3.343065       0.028805       0.070000 
      3.372984       -0.000361       0.070000 
      3.402906       -0.040256       0.140000 
      3.432825       -0.059510       0.050000 
      3.462745       -0.046111       0.130000 
      3.492665       -0.030844       0.190000 
      3.522585       -0.046111       0.030000 
      3.552505       -0.059524       0.240000 
      3.582423       -0.040726       0.240000 
      3.612350       -0.006660       0.190000 
      3.642270       -0.006647       0.050000 
      3.672188       -0.040282       0.050000 
      3.702108       -0.054125       0.100000 
      3.732028       -0.021928       0.210000 
      3.761950       0.008594       0.270000 
      3.791776       -0.027770       0.190000 
      3.822578       -0.084164       0.160000 
      3.852442       -0.109773       0.120000 
      3.882477       -0.094922       0.210000 
      3.912403       -0.075694       0.170000 
      3.942290       -0.064923       0.070000 
      3.972881       -0.035797       0.000000 
      4.002999       0.017066       0.130000 
      4.032943       0.027365       0.020000 
      4.062838       -0.047011       0.050000 
      4.092758       -0.128987       0.000000 
      4.123315       -0.157267       0.160000 
      4.153821       -0.129430       0.010000 
      4.183475       -0.052410       0.140000 
      4.213842       0.003168       0.240000 
      4.243947       -0.022828       0.120000 
      4.274478       -0.059980       0.190000 
      4.303780       -0.069879       0.260000 
      4.333758       -0.070738       0.020000 
      4.363875       -0.070751       0.020000 
      4.394593       -0.070322       0.130000 
      4.425066       -0.065353       0.110000 
      4.455747       -0.046125       0.160000 
      4.486939       -0.025458       0.130000 
      4.517039       -0.021928       0.050000 
      4.547485       -0.020072       0.180000 
      4.578712       -0.021901       0.230000 
      4.608843       -0.024545       0.030000 
      4.640013       -0.034413       0.220000 
      4.670992       -0.005274       0.160000 
      4.701005       0.068673       0.090000 
      4.730615       0.106295       0.240000 
      4.760762       0.074488       0.120000 
      4.791266       0.023866       0.160000 
      4.821626       0.023862       0.140000 
      4.851582       0.010837       0.090000 
      4.881678       -0.045584       0.290000 
      4.911989       -0.029484       0.070000 
      4.941655       0.034134       0.020000 
      4.972654       0.041774       0.020000 
      5.002568       0.010410       0.160000 
      5.032813       -0.004831       0.030000 
      5.063972       0.029235       0.140000 
      5.093435       0.063301       0.050000 
      5.123760       0.048046       0.190000 
      5.153513       0.016279       0.100000 
      5.184082       0.019810       0.170000 
      5.214002       0.074085       0.020000 
      5.243922       0.106296       0.170000 
      5.274570       0.069142       0.110000 
      5.304635       0.000999       0.020000 
      5.334879       0.000166       0.270000 
      5.364839       0.059244       0.170000 
      5.395300       0.069116       0.050000 
      5.425042       0.047190       0.080000 
      5.455144       0.064133       0.030000 
      5.484701       0.039090       0.010000 
      5.515234       -0.032615       0.070000 
      5.546004       -0.066680       0.080000 
      5.576326       -0.079707       0.010000 
      5.606751       -0.036173       0.090000 
      5.636680       0.028695       0.010000 
      5.667016       0.022519       0.050000 
      5.696946       -0.010699       0.230000 
      5.726781       -0.013774       0.090000 
      5.757979       0.002766       0.020000 
      5.789037       0.020722       0.100000 
      5.819705       0.013068       0.020000 
      5.849675       0.028322       0.050000 
      5.879629       0.033664       0.020000 
      5.909859       -0.022317       0.030000 
      5.940222       -0.082807       0.010000 
      5.969821       -0.098062       0.410000 
      6.000822       -0.035300       0.130000 
      6.031747       0.057391       0.080000 
      6.062208       0.080312       0.020000 
      6.092197       0.018423       0.100000 
      6.122783       -0.071593       0.010000 
      6.153303       -0.085062       0.250000 
      6.184329       0.009064       0.020000 
      6.214340       0.041704       0.040000 
      6.245729       -0.030344       0.080000 
      6.276992       -0.063120       0.120000 
      6.307938       0.005051       0.010000 
      6.336866       0.076713       0.050000 
      6.368768       0.068673       0.060000 
      6.396693       0.024296       0.120000 
      6.426610       0.034621       0.080000 
      6.456530       0.058358       0.160000 
      6.486450       0.023836       0.090000 
      6.516390       -0.024501       0.140000 
      6.546315       -0.015186       0.260000 
      6.576236       0.020292       0.120000 
      6.606641       0.026037       0.110000 
      6.636698       0.019822       0.240000 
      6.666662       -0.021484       0.010000 
      6.697451       -0.059927       0.030000 
      6.727576       -0.069435       0.170000 
      6.758695       -0.065326       0.150000 
      6.788964       -0.046124       0.010000 
      6.819809       -0.025472       0.030000 
      6.850835       -0.022371       0.030000 
      6.880942       -0.025498       0.110000 
      6.911144       -0.047011       0.040000 
      6.941789       -0.076124       0.360000 
      6.986748       -0.117816       0.250000 
      7.017482       -0.139285       0.200000 
      7.047628       -0.064922       0.020000 
      7.093375       0.027848       0.040000 
      7.124003       0.041747       0.000000 
      7.152937       0.015782       0.110000 
      7.182919       0.018910       0.020000 
      7.213511       0.063300       0.050000 
      7.243861       0.058331       0.170000 
      7.273560       -0.005717       0.210000 
      7.303958       -0.029470       0.020000 
      7.334050       -0.005291       0.170000 
      7.363825       -0.000375       0.170000 
      7.393786       -0.006616       0.350000 
      7.423901       0.017980       0.300000 
      7.453852       0.009937       0.190000 
      7.484048       -0.051010       0.010000 
      7.513972       -0.054111       0.040000 
      7.544568       -0.010717       0.170000 
      7.574855       -0.001261       0.150000 
      7.605541       -0.012029       0.030000 
      7.636116       -0.006217       0.210000 
      7.666149       -0.029958       0.120000 
      7.696784       -0.075194       0.100000 
      7.727227       -0.059054       0.100000 
      7.757678       -0.005331       0.050000 
      7.787603       0.027905       0.050000 
      7.817664       0.047563       0.050000 
      7.847679       0.044919       0.090000 
      7.877792       0.013551       0.140000 
      7.907442       0.010893       0.130000 
      7.937204       0.030108       0.210000 
      7.967838       0.057972       0.100000 
      7.998770       0.088357       0.070000 
      8.028871       0.074515       0.190000 
      8.059815       0.042677       0.170000 
      8.090007       0.044919       0.170000 
      8.120870       0.018437       0.090000 
      8.150171       -0.035743       0.010000 
      8.179898       -0.064466       0.170000 
      8.209921       -0.069825       0.180000 
      8.240673       -0.064466       0.090000 
      8.270860       -0.035770       0.010000 
      8.300899       0.017524       0.050000 
      8.331566       0.033247       0.190000 
      8.361729       -0.016085       0.250000 
      8.392065       -0.048725       0.060000 
      8.421993       -0.021471       0.020000 
      8.451962       0.009064       0.000000 
      8.482546       -0.021941       0.050000 
      8.513898       -0.055011       0.160000 
      8.544483       -0.051081       0.020000 
      8.575050       -0.055041       0.090000 
      8.605290       -0.086449       0.070000 
      8.636452       -0.089120       0.030000 
      8.667210       -0.070322       0.160000 
      8.697721       -0.046984       0.190000 
      8.727898       -0.030414       0.350000 
      8.757960       -0.040296       0.120000 
      8.787944       -0.030814       0.100000 
      8.817751       0.012568       0.010000 
      8.847947       0.009050       0.090000 
      8.877896       -0.056422       0.130000 
      8.907922       -0.078295       0.110000 
      8.938963       -0.050181       0.010000 
      8.969970       -0.020462       0.290000 
      8.999994       0.002726       0.050000 
      9.030175       0.026107       0.030000 
      9.060574       0.037278       0.070000 
      9.091061       0.068686       0.290000 
      9.121624       0.064147       0.240000 
      9.151301       0.018064       0.010000 
      9.181559       0.005455       0.070000 
      9.211875       -0.000335       0.090000 
      9.242372       -0.016058       0.140000 
      9.272687       -0.014217       0.140000 
      9.303409       0.002726       0.000000 
      9.333915       0.019862       0.010000 
      9.364608       0.003169       0.030000 
      9.395174       -0.008818       0.130000 
      9.425143       0.008112       0.080000 
      9.454962       0.038673       0.150000 
      9.485100       0.018867       0.210000 
      9.515606       -0.024515       0.180000 
      9.545875       -0.010659       0.190000 
      9.576168       0.034590       0.020000 
      9.605825       0.028779       0.080000 
      9.636864       0.018037       0.010000 
      9.666868       0.039949       0.010000 
      9.697419       0.023406       0.120000 
      9.727293       -0.011102       0.100000 
      9.757264       -0.018729       0.160000 
      9.787086       -0.016032       0.080000 
      9.817824       0.005038       0.050000 
      9.848927       0.029208       0.080000 
      9.879584       0.052559       0.370000 
      9.910840       0.064147       0.010000 
      9.941676       0.034191       0.180000 
      9.972391       0.013524       0.160000 
      10.003422       0.020722       0.070000 
      10.034434       0.002310       0.110000 
      10.064405       -0.019602       0.090000 
      10.095726       -0.039839       0.150000 
      10.126509       -0.035743       0.280000 
      10.156837       -0.006230       0.040000 
      10.186936       -0.006647       0.090000 
      10.217094       -0.040739       0.040000 
      10.247261       -0.059953       0.040000 
      10.277351       -0.051054       0.040000 
      10.307211       -0.049185       0.000000 
      10.337492       -0.055966       0.090000 
      10.367905       -0.014230       0.060000 
      10.398907       0.042177       0.020000 
      10.429024       0.062843       0.290000 
      10.460262       0.029195       0.150000 
      10.490984       -0.005704       0.120000 
      10.521664       0.000082       0.040000 
      10.552201       -0.000348       0.080000 
      10.583029       -0.011116       0.000000 
      10.613304       0.004568       0.030000 
      10.643907       0.017980       0.040000 
      10.674070       -0.001247       0.150000 
      10.704823       -0.040255       0.000000 
      10.735506       -0.058597       0.100000 
      10.765704       -0.034427       0.060000 
      10.796508       0.028348       0.140000 
      10.826783       0.082058       0.060000 
      10.857486       0.068216       0.110000 
      10.887914       0.013068       0.160000 
      10.918863       -0.019173       0.160000 
      10.949076       -0.045641       0.040000 
      10.979243       -0.064896       0.000000 
      11.009665       -0.064922       0.070000 
      11.040892       -0.046528       0.160000 
      11.071018       -0.029984       0.100000 
      11.100872       -0.035756       0.080000 
      11.131824       -0.016529       0.040000 
      11.161960       0.014866       0.020000 
      11.192053       0.001853       0.050000 
      11.222842       -0.019629       0.050000 
      11.252740       -0.040269       0.100000 
      11.283139       -0.040699       0.050000 
      11.313404       -0.025001       0.030000 
      11.343721       -0.021444       0.010000 
      11.373518       -0.013760       0.030000 
      11.404532       0.013954       0.030000 
      11.434396       0.073655       0.010000 
      11.464693       0.107155       0.020000 
      11.494697       0.079470       0.170000 
      11.525061       0.043080       0.060000 
      11.554975       0.044046       0.120000 
      11.585231       0.007665       0.000000 
      11.615187       -0.083237       0.000000 
      11.645571       -0.133000       0.040000 
      11.676485       -0.064010       0.080000 
      11.706148       0.033234       0.130000 
      11.736888       0.065045       0.130000 
      11.767224       0.044435       0.190000 
      11.798223       -0.010660       0.030000 
      11.828297       -0.034427       0.140000 
      11.873678       -0.019589       0.090000 
      11.903888       -0.002633       0.200000 
      11.934373       0.001910       0.130000 
      11.965054       -0.002616       0.010000 
      11.994774       0.044489       0.010000 
      12.024930       0.058748       0.090000 
      12.055431       0.017634       0.060000 
      12.085965       0.005911       0.080000 
