

 time    ||    gripping force   ||   raspberry measurement 

      0       0.020000       -793.965000 
      0       0.120000       -793.965000 
      0       0.180000       -793.965000 
      0       0.140000       -793.965000 
      0       0.140000       -793.965000 
      1       40.450000       -786.025350 
      1       70.490000       -778.165096 
      1       96.270000       -770.383446 
      1       144.220000       -762.679611 
      1       160.860000       -755.052810 
      1       150.740000       -747.501116 
      1       119.590000       -739.921172 
      1       99.910000       -736.411161 
      2       103.550000       -693.650745 
      2       113.040000       -502.014874 
      2       118.690000       -186.070955 
      2       119.640000       5.559253 
      2       114.700000       48.359107 
      2       113.570000       51.960384 
      2       113.010000       52.333669 
      2       112.710000       52.907863 
      2       112.640000       53.628967 
      2       112.540000       54.392964 
      2       112.380000       55.076280 
      3       112.300000       55.327491 
      3       112.220000       55.000006 
      3       109.450000       54.495181 
      3       109.020000       54.215916 
      3       109.050000       54.275117 
      3       108.900000       54.524603 
      3       108.780000       54.710496 
      3       108.690000       54.703371 
      3       108.540000       54.620013 
      3       108.520000       54.592739 
      4       108.470000       54.550517 
      4       108.130000       54.457855 
      4       107.810000       54.392728 
      4       106.680000       54.398608 
      4       106.530000       54.408783 
      4       106.490000       54.379725 
      4       106.410000       54.285472 
      4       106.150000       54.164141 
      4       104.500000       54.093252 
      4       104.220000       54.100422 
      4       104.280000       54.131293 
      5       104.290000       54.188252 
      5       104.280000       54.206041 
      5       104.110000       54.111621 
      5       103.870000       54.051517 
      5       103.370000       54.080640 
      5       102.660000       54.074785 
      5       102.020000       54.081139 
      6       101.150000       54.102042 
      6       100.870000       54.076196 
      6       100.600000       54.055933 
      6       100.610000       54.063157 
      8       97.450000       54.045161 
      8       97.450000       54.027775 
      8       97.340000       54.021381 
      8       97.370000       54.022389 
      8       97.310000       54.020938 
      8       97.220000       54.022376 
      9       97.020000       54.020937 
      9       97.020000       54.022349 
      9       97.040000       54.020051 
      9       96.960000       54.011578 
      9       96.890000       53.972543 
      10       96.850000       53.942561 
      10       96.800000       53.971657 
      11       96.680000       54.000739 
      11       96.500000       53.970327 
      11       96.540000       53.926337 
      11       96.600000       53.899066 
      12       92.860000       53.881097 
      12       78.810000       53.899052 
      12       79.430000       53.925907 
      12       79.780000       53.965358 
      12       80.980000       53.981485 
      12       82.660000       53.950130 
      12       85.650000       53.929092 
      13       88.970000       53.932219 
      13       88.950000       53.971670 
      13       88.980000       54.011551 
      13       89.010000       54.020050 
      14       89.000000       54.022282 
      14       88.940000       54.018708 
      14       89.000000       53.994923 
      14       88.940000       53.894070 
      14       88.950000       53.791966 
      14       88.940000       53.819207 
      14       88.910000       53.852842 
      15       89.010000       53.839390 
      15       88.950000       53.873928 
      15       88.920000       53.910139 
      15       89.050000       53.921489 
      15       88.970000       53.920897 
      16       88.970000       53.921919 
      16       88.870000       53.915109 
      16       88.910000       53.893210 
      16       88.790000       53.861815 
      16       89.140000       53.877512 
      16       88.770000       53.911981 
      16       89.050000       53.919191 
      17       88.780000       53.911981 
      17       88.760000       53.877512 
      17       88.820000       53.861815 
      17       89.040000       53.893210 
      17       88.910000       53.915109 
      17       88.760000       53.921920 
      18       88.880000       53.920924 
      18       88.870000       53.922349 
      19       88.860000       53.920065 
      19       88.840000       53.912034 
      20       88.840000       53.878399 
      20       88.860000       53.872614 
      20       88.780000       53.941604 
      20       88.890000       53.994897 
      21       88.870000       53.970314 
      21       88.870000       53.931722 
      22       88.810000       53.923262 
      22       88.870000       53.920964 
      22       88.900000       53.922376 
      22       88.780000       53.920938 
      23       88.890000       53.922376 
      23       88.830000       53.920938 
      23       88.820000       53.922376 
      23       88.910000       53.920938 
      23       88.800000       53.922376 
      23       88.860000       53.920938 
      24       88.880000       53.922376 
      24       88.890000       53.920924 
      24       88.910000       53.921933 
      24       89.090000       53.915539 
      24       88.990000       53.898179 
      24       89.170000       53.881030 
      24       89.140000       53.897736 
      25       89.140000       53.910139 
      25       89.280000       53.897736 
      25       89.190000       53.881030 
      25       89.260000       53.898179 
      25       89.280000       53.915539 
      25       89.240000       53.921933 
      26       89.500000       53.920924 
      26       89.510000       53.922376 
      26       89.460000       53.920938 
      27       89.500000       53.922376 
      27       89.480000       53.920924 
      27       89.590000       53.921933 
      27       89.500000       53.915539 
      27       89.490000       53.898179 
      27       89.500000       53.881043 
      27       89.500000       53.898152 
      27       89.500000       53.914665 
      27       89.490000       53.911565 
      28       89.520000       53.877499 
      28       89.520000       53.861815 
      29       89.520000       53.893210 
      29       89.610000       53.915109 
      29       89.580000       53.921920 
      29       89.770000       53.920924 
      29       89.710000       53.922376 
      29       89.860000       53.920938 
      29       89.730000       53.922376 
      29       89.750000       53.920938 
      29       89.750000       53.922376 
      30       89.810000       53.920938 
      30       89.750000       53.922376 
      30       89.720000       53.920924 
      30       89.760000       53.921920 
      30       89.740000       53.915109 
      30       89.710000       53.893210 
      30       89.770000       53.861815 
      30       89.710000       53.877513 
      31       89.770000       53.912008 
      31       89.760000       53.920064 
      31       89.730000       53.922349 
      31       89.740000       53.920937 
      32       89.740000       53.922376 
      32       89.760000       53.920938 
      32       89.740000       53.922376 
      32       89.740000       53.920938 
      32       89.660000       53.922376 
      33       89.680000       53.920938 
      33       89.740000       53.922376 
      33       89.680000       53.920938 
      33       89.720000       53.922376 
      34       89.690000       53.920938 
      34       89.700000       53.922376 
      34       89.680000       53.920938 
      34       89.740000       53.922376 
      34       89.680000       53.920938 
      34       89.690000       53.922376 
      34       89.770000       53.920938 
      35       89.720000       53.922376 
      35       89.750000       53.920938 
      35       89.730000       53.922376 
      35       89.730000       53.920924 
      35       89.770000       53.921933 
      35       89.720000       53.915539 
      35       89.790000       53.898179 
      35       89.760000       53.881043 
      35       89.690000       53.898179 
      35       89.700000       53.915539 
      35       89.700000       53.921933 
      36       89.780000       53.920924 
      36       89.690000       53.922376 
      36       89.720000       53.920924 
      36       89.720000       53.921933 
      36       89.700000       53.915539 
      36       89.690000       53.898179 
      37       89.690000       53.881043 
      37       89.710000       53.898179 
      37       89.730000       53.915539 
      37       89.730000       53.921933 
      37       89.680000       53.920924 
      37       89.670000       53.922376 
      37       89.710000       53.920938 
      38       89.670000       53.922376 
      38       89.720000       53.920938 
      38       89.640000       53.922376 
      38       89.650000       53.920938 
      38       89.710000       53.922376 
      38       89.690000       53.920911 
      38       89.740000       53.921490 
      39       89.680000       53.910166 
      39       89.710000       53.874868 
      39       89.710000       53.851947 
      39       89.690000       53.922376 
      39       89.640000       53.989928 
      39       89.650000       53.969884 
      39       89.600000       53.931709 
      39       89.630000       53.923235 
      40       89.720000       53.920092 
      40       89.710000       53.912035 
      40       89.690000       53.878399 
      40       89.750000       53.872614 
      40       89.730000       53.941604 
      40       89.720000       53.994897 
      40       89.710000       53.970314 
      40       89.680000       53.931722 
      41       89.680000       53.923262 
      41       89.700000       53.920951 
      41       89.660000       53.921933 
      41       89.720000       53.915539 
      41       89.710000       53.898179 
      41       89.710000       53.881030 
      41       89.730000       53.897736 
      41       89.670000       53.910139 
      41       89.770000       53.897736 
      41       89.760000       53.881030 
      42       89.760000       53.898179 
      42       91.150000       53.915538 
      42       91.170000       53.921906 
      42       91.150000       53.920051 
      42       91.150000       53.912008 
      42       91.190000       53.877513 
      42       91.170000       53.861815 
      42       91.160000       53.893210 
      43       91.120000       53.915095 
      43       91.090000       53.921476 
      43       91.100000       53.915525 
      43       91.070000       53.898179 
      43       91.080000       53.881043 
      44       91.080000       53.898179 
      44       91.090000       53.915539 
      44       91.080000       53.921933 
      44       91.080000       53.920924 
      44       91.070000       53.922376 
      44       91.090000       53.920938 
      44       91.040000       53.922376 
      45       91.100000       53.920924 
      45       91.100000       53.921933 
      45       91.050000       53.915539 
      45       91.100000       53.898179 
      45       91.020000       53.881043 
      46       91.010000       53.898179 
      46       91.090000       53.915539 
      46       91.030000       53.921933 
      46       91.000000       53.920924 
      46       90.970000       53.922376 
      46       91.010000       53.920938 
      47       90.970000       53.922376 
      47       91.000000       53.920938 
      47       91.010000       53.922376 
      47       90.970000       53.920938 
      47       90.960000       53.922376 
      47       90.980000       53.920938 
      48       90.980000       53.922376 
      48       91.000000       53.920924 
      48       91.010000       53.921933 
      48       90.990000       53.915539 
      48       90.890000       53.898179 
      49       90.950000       53.881043 
      49       90.990000       53.898179 
      49       90.970000       53.915539 
      49       90.960000       53.921933 
      49       90.990000       53.920924 
      49       90.960000       53.922376 
      49       90.990000       53.920938 
      49       90.950000       53.922376 
      49       90.940000       53.920924 
      49       90.980000       53.921933 
      50       90.940000       53.915539 
      50       90.990000       53.898179 
      50       90.930000       53.881030 
      50       90.990000       53.897736 
      50       90.970000       53.910139 
      50       90.950000       53.897736 
      50       90.920000       53.881030 
      50       90.880000       53.898179 
      50       90.910000       53.915539 
      51       90.940000       53.921933 
      51       90.930000       53.920924 
      51       90.920000       53.922376 
      51       90.860000       53.920938 
      51       90.910000       53.922376 
      51       90.880000       53.920938 
      51       90.920000       53.922376 
      52       90.860000       53.920937 
      52       90.870000       53.922349 
      52       90.930000       53.920051 
      52       90.940000       53.911578 
      53       90.880000       53.872543 
      53       90.830000       53.842588 
      53       90.880000       53.872543 
      53       90.900000       53.911551 
      53       90.920000       53.919165 
      53       90.880000       53.911551 
      53       90.890000       53.872543 
      54       90.890000       53.842561 
      55       90.840000       53.871670 
      55       90.850000       53.901210 
      55       90.870000       53.876626 
      55       90.870000       53.861789 
      55       90.860000       53.893209 
      55       90.880000       53.915109 
      55       90.840000       53.921920 
      55       90.830000       53.920924 
      55       90.830000       53.922376 
      56       90.860000       53.920938 
      56       90.860000       53.922376 
      56       90.830000       53.920938 
      56       90.850000       53.922376 
      56       90.850000       53.920938 
      56       90.880000       53.922376 
      56       90.840000       53.920938 
      57       90.830000       53.922376 
      57       90.790000       53.920938 
      57       90.800000       53.922376 
      57       90.810000       53.920938 
      57       90.750000       53.922376 
      57       90.770000       53.920938 
      57       90.840000       53.922376 
      58       90.820000       53.920938 
      58       90.850000       53.922376 
      58       90.850000       53.920938 
      58       90.810000       53.922376 
      58       90.790000       53.920938 
      58       90.840000       53.922376 
      58       90.830000       53.920938 
      58       90.830000       53.922376 
      58       90.890000       53.920964 
      58       90.830000       53.923262 
      59       90.790000       53.931736 
      59       90.830000       53.970770 
      59       90.840000       54.000726 
      59       90.770000       53.970770 
      59       90.770000       53.931735 
      59       90.770000       53.923222 
      59       90.800000       53.919648 
      59       90.780000       53.906609 
      59       90.840000       53.853316 
      59       90.800000       53.821921 
      59       90.830000       53.869013 
      60       90.780000       53.909736 
      60       90.800000       53.922350 
      60       90.800000       53.931279 
      60       90.760000       53.965801 
      60       90.820000       53.981498 
      60       90.850000       53.950104 
      60       90.740000       53.928205 
