<mxfile host="app.diagrams.net" modified="2024-05-21T08:12:35.013Z" agent="Mozilla/5.0 (X11; Linux x86_64; rv:109.0) Gecko/20100101 Firefox/115.0" etag="iTu515buNSqZGsS5-CKw" version="24.4.0" type="device">
  <diagram name="Page-1" id="bkeufHj57YdlL86luDum">
    <mxGraphModel dx="2924" dy="1151" grid="1" gridSize="10" guides="1" tooltips="1" connect="1" arrows="1" fold="1" page="1" pageScale="1" pageWidth="850" pageHeight="1100" math="0" shadow="0">
      <root>
        <mxCell id="0" />
        <mxCell id="1" parent="0" />
        <mxCell id="u5iPqbp8BkahNGgutwdZ-44" style="edgeStyle=orthogonalEdgeStyle;rounded=0;orthogonalLoop=1;jettySize=auto;html=1;entryX=0.5;entryY=1;entryDx=0;entryDy=0;endArrow=none;endFill=0;" parent="1" source="u5iPqbp8BkahNGgutwdZ-30" target="u5iPqbp8BkahNGgutwdZ-2" edge="1">
          <mxGeometry relative="1" as="geometry" />
        </mxCell>
        <mxCell id="u5iPqbp8BkahNGgutwdZ-45" style="edgeStyle=orthogonalEdgeStyle;rounded=0;orthogonalLoop=1;jettySize=auto;html=1;endArrow=none;endFill=0;" parent="1" source="u5iPqbp8BkahNGgutwdZ-31" target="u5iPqbp8BkahNGgutwdZ-3" edge="1">
          <mxGeometry relative="1" as="geometry" />
        </mxCell>
        <mxCell id="u5iPqbp8BkahNGgutwdZ-48" style="edgeStyle=orthogonalEdgeStyle;rounded=0;orthogonalLoop=1;jettySize=auto;html=1;entryX=0.5;entryY=1;entryDx=0;entryDy=0;endArrow=none;endFill=0;" parent="1" source="u5iPqbp8BkahNGgutwdZ-32" target="u5iPqbp8BkahNGgutwdZ-6" edge="1">
          <mxGeometry relative="1" as="geometry" />
        </mxCell>
        <mxCell id="u5iPqbp8BkahNGgutwdZ-47" style="edgeStyle=orthogonalEdgeStyle;rounded=0;orthogonalLoop=1;jettySize=auto;html=1;entryX=0.5;entryY=1;entryDx=0;entryDy=0;endArrow=none;endFill=0;" parent="1" source="u5iPqbp8BkahNGgutwdZ-34" target="u5iPqbp8BkahNGgutwdZ-5" edge="1">
          <mxGeometry relative="1" as="geometry" />
        </mxCell>
        <mxCell id="u5iPqbp8BkahNGgutwdZ-49" style="edgeStyle=orthogonalEdgeStyle;rounded=0;orthogonalLoop=1;jettySize=auto;html=1;entryX=0.5;entryY=1;entryDx=0;entryDy=0;endArrow=none;endFill=0;" parent="1" source="u5iPqbp8BkahNGgutwdZ-35" target="u5iPqbp8BkahNGgutwdZ-7" edge="1">
          <mxGeometry relative="1" as="geometry" />
        </mxCell>
        <mxCell id="u5iPqbp8BkahNGgutwdZ-50" style="edgeStyle=orthogonalEdgeStyle;rounded=0;orthogonalLoop=1;jettySize=auto;html=1;entryX=0.5;entryY=1;entryDx=0;entryDy=0;endArrow=none;endFill=0;" parent="1" source="u5iPqbp8BkahNGgutwdZ-36" target="u5iPqbp8BkahNGgutwdZ-8" edge="1">
          <mxGeometry relative="1" as="geometry" />
        </mxCell>
        <mxCell id="u5iPqbp8BkahNGgutwdZ-46" style="edgeStyle=orthogonalEdgeStyle;rounded=0;orthogonalLoop=1;jettySize=auto;html=1;endArrow=none;endFill=0;" parent="1" source="u5iPqbp8BkahNGgutwdZ-33" edge="1">
          <mxGeometry relative="1" as="geometry">
            <mxPoint x="414" y="180" as="targetPoint" />
          </mxGeometry>
        </mxCell>
        <mxCell id="u5iPqbp8BkahNGgutwdZ-2" value="&lt;font style=&quot;font-size: 15px;&quot; face=&quot;Courier New&quot;&gt;/home&lt;/font&gt;" style="rounded=1;whiteSpace=wrap;html=1;fillColor=#dae8fc;strokeColor=#6c8ebf;" parent="1" vertex="1">
          <mxGeometry x="20" y="140" width="100" height="40" as="geometry" />
        </mxCell>
        <mxCell id="u5iPqbp8BkahNGgutwdZ-3" value="&lt;font style=&quot;font-size: 15px;&quot; face=&quot;Courier New&quot;&gt;/work&lt;/font&gt;" style="rounded=1;whiteSpace=wrap;html=1;fillColor=#dae8fc;strokeColor=#6c8ebf;" parent="1" vertex="1">
          <mxGeometry x="193" y="140" width="100" height="40" as="geometry" />
        </mxCell>
        <mxCell id="u5iPqbp8BkahNGgutwdZ-4" value="&lt;font style=&quot;font-size: 15px;&quot; face=&quot;Courier New&quot;&gt;/archive&lt;/font&gt;" style="rounded=1;whiteSpace=wrap;html=1;fillColor=#dae8fc;strokeColor=#6c8ebf;" parent="1" vertex="1">
          <mxGeometry x="367" y="140" width="100" height="40" as="geometry" />
        </mxCell>
        <mxCell id="u5iPqbp8BkahNGgutwdZ-5" value="&lt;font style=&quot;font-size: 15px;&quot; face=&quot;Courier New&quot;&gt;/transfer&lt;/font&gt;" style="rounded=1;whiteSpace=wrap;html=1;fillColor=#dae8fc;strokeColor=#6c8ebf;" parent="1" vertex="1">
          <mxGeometry x="540" y="140" width="100" height="40" as="geometry" />
        </mxCell>
        <mxCell id="u5iPqbp8BkahNGgutwdZ-6" value="&lt;font style=&quot;font-size: 15px;&quot; face=&quot;Courier New&quot;&gt;/export&lt;/font&gt;" style="rounded=1;whiteSpace=wrap;html=1;fillColor=#dae8fc;strokeColor=#6c8ebf;" parent="1" vertex="1">
          <mxGeometry x="713" y="140" width="100" height="40" as="geometry" />
        </mxCell>
        <mxCell id="u5iPqbp8BkahNGgutwdZ-7" value="&lt;font style=&quot;font-size: 15px;&quot; face=&quot;Courier New&quot;&gt;/scratch&lt;/font&gt;" style="rounded=1;whiteSpace=wrap;html=1;fillColor=#d5e8d4;strokeColor=#82b366;" parent="1" vertex="1">
          <mxGeometry x="887" y="140" width="100" height="40" as="geometry" />
        </mxCell>
        <mxCell id="u5iPqbp8BkahNGgutwdZ-8" value="&lt;font style=&quot;font-size: 15px;&quot; face=&quot;Courier New&quot;&gt;/tmp/$SLURM_JOB_ID&lt;/font&gt;" style="rounded=1;whiteSpace=wrap;html=1;fillColor=#ffe6cc;strokeColor=#d79b00;" parent="1" vertex="1">
          <mxGeometry x="1020" y="140" width="180" height="40" as="geometry" />
        </mxCell>
        <mxCell id="u5iPqbp8BkahNGgutwdZ-9" value="User personal files" style="rounded=1;whiteSpace=wrap;html=1;" parent="1" vertex="1">
          <mxGeometry x="10" y="230" width="120" height="60" as="geometry" />
        </mxCell>
        <mxCell id="u5iPqbp8BkahNGgutwdZ-10" value="Team storage space" style="rounded=1;whiteSpace=wrap;html=1;" parent="1" vertex="1">
          <mxGeometry x="183" y="230" width="120" height="60" as="geometry" />
        </mxCell>
        <mxCell id="u5iPqbp8BkahNGgutwdZ-11" value="Cold storage on band for long-term archiving" style="rounded=1;whiteSpace=wrap;html=1;" parent="1" vertex="1">
          <mxGeometry x="345.5" y="230" width="143" height="60" as="geometry" />
        </mxCell>
        <mxCell id="u5iPqbp8BkahNGgutwdZ-12" value="Temporary space for transferring data outside of the EPFL network via &lt;font face=&quot;Courier New&quot;&gt;fdata1.epfl.ch&lt;/font&gt;" style="rounded=1;whiteSpace=wrap;html=1;" parent="1" vertex="1">
          <mxGeometry x="510" y="230" width="160" height="60" as="geometry" />
        </mxCell>
        <mxCell id="u5iPqbp8BkahNGgutwdZ-13" value="Storage space exportable via NFS, SMB or S3" style="rounded=1;whiteSpace=wrap;html=1;" parent="1" vertex="1">
          <mxGeometry x="689.5" y="230" width="147" height="60" as="geometry" />
        </mxCell>
        <mxCell id="u5iPqbp8BkahNGgutwdZ-14" value="Temporary high-performance space for running simulations" style="rounded=1;whiteSpace=wrap;html=1;" parent="1" vertex="1">
          <mxGeometry x="865.5" y="230" width="143" height="60" as="geometry" />
        </mxCell>
        <mxCell id="u5iPqbp8BkahNGgutwdZ-15" value="Local storage space for high-speed data processing" style="rounded=1;whiteSpace=wrap;html=1;" parent="1" vertex="1">
          <mxGeometry x="1030" y="230" width="160" height="60" as="geometry" />
        </mxCell>
        <mxCell id="u5iPqbp8BkahNGgutwdZ-16" value="&lt;div&gt;100GB&lt;/div&gt;&lt;div&gt;(free)&lt;/div&gt;" style="rounded=1;whiteSpace=wrap;html=1;" parent="1" vertex="1">
          <mxGeometry x="10" y="330" width="120" height="60" as="geometry" />
        </mxCell>
        <mxCell id="u5iPqbp8BkahNGgutwdZ-17" value="&lt;div&gt;Few 100s TB&lt;/div&gt;&lt;div&gt;(pay-per-use)&lt;br&gt;&lt;/div&gt;" style="rounded=1;whiteSpace=wrap;html=1;" parent="1" vertex="1">
          <mxGeometry x="183" y="330" width="120" height="60" as="geometry" />
        </mxCell>
        <mxCell id="u5iPqbp8BkahNGgutwdZ-18" value="20PB&lt;div&gt;(pay-per-use)&lt;/div&gt;" style="rounded=1;whiteSpace=wrap;html=1;" parent="1" vertex="1">
          <mxGeometry x="357" y="330" width="120" height="60" as="geometry" />
        </mxCell>
        <mxCell id="u5iPqbp8BkahNGgutwdZ-19" value="&lt;div&gt;-&lt;/div&gt;&lt;div&gt;(free)&lt;/div&gt;" style="rounded=1;whiteSpace=wrap;html=1;" parent="1" vertex="1">
          <mxGeometry x="530" y="330" width="120" height="60" as="geometry" />
        </mxCell>
        <mxCell id="u5iPqbp8BkahNGgutwdZ-20" value="&lt;div&gt;100GB&lt;/div&gt;&lt;div&gt;(pay-per-use)&lt;/div&gt;" style="rounded=1;whiteSpace=wrap;html=1;" parent="1" vertex="1">
          <mxGeometry x="703" y="330" width="120" height="60" as="geometry" />
        </mxCell>
        <mxCell id="u5iPqbp8BkahNGgutwdZ-21" value="&lt;div&gt;Few 100s TB&lt;br&gt;&lt;/div&gt;&lt;div&gt;(free)&lt;/div&gt;" style="rounded=1;whiteSpace=wrap;html=1;" parent="1" vertex="1">
          <mxGeometry x="877" y="330" width="120" height="60" as="geometry" />
        </mxCell>
        <mxCell id="u5iPqbp8BkahNGgutwdZ-22" value="&lt;div&gt;Few TBs&lt;br&gt;&lt;/div&gt;&lt;div&gt;(free)&lt;/div&gt;" style="rounded=1;whiteSpace=wrap;html=1;" parent="1" vertex="1">
          <mxGeometry x="1050" y="330" width="120" height="60" as="geometry" />
        </mxCell>
        <mxCell id="u5iPqbp8BkahNGgutwdZ-23" value="Backup" style="rounded=1;whiteSpace=wrap;html=1;" parent="1" vertex="1">
          <mxGeometry x="10" y="430" width="120" height="60" as="geometry" />
        </mxCell>
        <mxCell id="u5iPqbp8BkahNGgutwdZ-24" value="Backup upon request" style="rounded=1;whiteSpace=wrap;html=1;" parent="1" vertex="1">
          <mxGeometry x="183" y="430" width="120" height="60" as="geometry" />
        </mxCell>
        <mxCell id="u5iPqbp8BkahNGgutwdZ-25" value="Backup upon request" style="rounded=1;whiteSpace=wrap;html=1;" parent="1" vertex="1">
          <mxGeometry x="357" y="430" width="120" height="60" as="geometry" />
        </mxCell>
        <mxCell id="u5iPqbp8BkahNGgutwdZ-26" value="No backup" style="rounded=1;whiteSpace=wrap;html=1;" parent="1" vertex="1">
          <mxGeometry x="530" y="430" width="120" height="60" as="geometry" />
        </mxCell>
        <mxCell id="u5iPqbp8BkahNGgutwdZ-27" value="No backup" style="rounded=1;whiteSpace=wrap;html=1;" parent="1" vertex="1">
          <mxGeometry x="703" y="430" width="120" height="60" as="geometry" />
        </mxCell>
        <mxCell id="u5iPqbp8BkahNGgutwdZ-28" value="No backup" style="rounded=1;whiteSpace=wrap;html=1;" parent="1" vertex="1">
          <mxGeometry x="877" y="430" width="120" height="60" as="geometry" />
        </mxCell>
        <mxCell id="u5iPqbp8BkahNGgutwdZ-29" value="No backup" style="rounded=1;whiteSpace=wrap;html=1;" parent="1" vertex="1">
          <mxGeometry x="1050" y="430" width="120" height="60" as="geometry" />
        </mxCell>
        <mxCell id="u5iPqbp8BkahNGgutwdZ-30" value="Data erased after 2 years of inactivity &lt;b&gt;or&lt;/b&gt; 6 months after leaving EPFL" style="rounded=1;whiteSpace=wrap;html=1;" parent="1" vertex="1">
          <mxGeometry x="-5" y="520" width="150" height="60" as="geometry" />
        </mxCell>
        <mxCell id="u5iPqbp8BkahNGgutwdZ-31" value="Data erased 6 months after cessation of payment" style="rounded=1;whiteSpace=wrap;html=1;" parent="1" vertex="1">
          <mxGeometry x="168" y="520" width="150" height="60" as="geometry" />
        </mxCell>
        <mxCell id="u5iPqbp8BkahNGgutwdZ-32" value="Data erased 6 months after cessation of payment" style="rounded=1;whiteSpace=wrap;html=1;" parent="1" vertex="1">
          <mxGeometry x="688" y="520" width="150" height="60" as="geometry" />
        </mxCell>
        <mxCell id="u5iPqbp8BkahNGgutwdZ-33" value="Data erased 6 months after cessation of payment" style="rounded=1;whiteSpace=wrap;html=1;" parent="1" vertex="1">
          <mxGeometry x="338.5" y="520" width="150" height="60" as="geometry" />
        </mxCell>
        <mxCell id="u5iPqbp8BkahNGgutwdZ-34" value="Data erased after 15 days without notice" style="rounded=1;whiteSpace=wrap;html=1;" parent="1" vertex="1">
          <mxGeometry x="515" y="520" width="150" height="60" as="geometry" />
        </mxCell>
        <mxCell id="u5iPqbp8BkahNGgutwdZ-35" value="Data erased after 30 days without notice" style="rounded=1;whiteSpace=wrap;html=1;" parent="1" vertex="1">
          <mxGeometry x="862" y="520" width="150" height="60" as="geometry" />
        </mxCell>
        <mxCell id="u5iPqbp8BkahNGgutwdZ-36" value="Data erased after job completion" style="rounded=1;whiteSpace=wrap;html=1;" parent="1" vertex="1">
          <mxGeometry x="1042.5" y="520" width="135" height="60" as="geometry" />
        </mxCell>
        <mxCell id="u5iPqbp8BkahNGgutwdZ-37" value="Accessible from all the machines" style="rounded=1;whiteSpace=wrap;html=1;fillColor=#dae8fc;strokeColor=#6c8ebf;" parent="1" vertex="1">
          <mxGeometry y="660" width="130" height="60" as="geometry" />
        </mxCell>
        <mxCell id="u5iPqbp8BkahNGgutwdZ-38" value="Local to the cluster" style="rounded=1;whiteSpace=wrap;html=1;fillColor=#d5e8d4;strokeColor=#82b366;" parent="1" vertex="1">
          <mxGeometry x="163" y="660" width="130" height="60" as="geometry" />
        </mxCell>
        <mxCell id="u5iPqbp8BkahNGgutwdZ-39" value="Local to the node" style="rounded=1;whiteSpace=wrap;html=1;fillColor=#ffe6cc;strokeColor=#d79b00;" parent="1" vertex="1">
          <mxGeometry x="337" y="660" width="130" height="60" as="geometry" />
        </mxCell>
      </root>
    </mxGraphModel>
  </diagram>
</mxfile>
