digraph G {
  labelloc = "b"
  rankdir = "TB"
  ranksep = "1"
  edge[
     penwidth=2
  ]
  node[
     fontname=Monaco,
     penwidth=4,
     fontsize=24,
     margin=.4,
     shape=box,
     fillcolor=lightblue,
     style="rounded,filled"
  ]

  "jjdfmobwoepg7za7bqoelysu6zof75li" [label="nettle@3.9.1%gcc@=11.2.1/jjdfmob"]
  "u3moojtss4al6zy6rwxmezybkqsjnb6x" [label="nasm@2.15.05%gcc@=11.2.1/u3moojt"]
  "jobwyrdqeoytgahvy3axmjihcwfjghvc" [label="gmake@4.3%gcc@=11.2.1/jobwyrd"]
  "xc5soqufoinv7y3rksj4ajj5di45omv5" [label="ncurses@6.4%gcc@=11.2.1/xc5soqu"]
  "cmugi5vtdcozwnx6ef2etr47aonxe2yb" [label="pkgconf@1.7.3%gcc@=11.2.1/cmugi5v"]
  "cd2htn3rv6gfaut5bhpdo2ml2japdnxc" [label="cmake@3.20.2%gcc@=11.2.1/cd2htn3"]
  "nshmqjfzoi7wc25gud5xndapxx7fouio" [label="m4@1.4.19%gcc@=11.2.1/nshmqjf"]
  "dfrl7rneqfzxydhg2zs6n77duqy556jq" [label="diffutils@3.7%gcc@=11.2.1/dfrl7rn"]
  "vqpl4aj4m5zg5q45liqbrq6ymomrltrz" [label="gmp@6.2.1%gcc@=11.2.1/vqpl4aj"]
  "vxmokx5j67rae4mhdi6fcjxuayoqj36d" [label="tar@1.34%gcc@=11.2.1/vxmokx5"]
  "qlythud7gnerzxwjkatqn64l7kfpirdg" [label="zlib-ng@2.1.4%gcc@=11.2.1/qlythud"]
  "syg5rrzilq43un6i2azf2qmbsehp2oa7" [label="perl@5.38.0%gcc@=11.2.1/syg5rrz"]
  "hhahsbjew7sd5s4jwfgavifsonyvns7y" [label="pcre@8.45%gcc@=11.2.1/hhahsbj"]
  "dvj7xbrtwbxoeilltyo7cyeu2bw5u43r" [label="xz@5.4.1%gcc@=11.2.1/dvj7xbr"]
  "vbtr3vjuv5ikx77gqu6p6rb33daqtbat" [label="libxml2@2.10.3%gcc@=11.2.1/vbtr3vj"]
  "xodpz5b2pdbory553ih33e2mzwr3q7bq" [label="emacs@29.1%gcc@=11.2.1/xodpz5b"]
  "haj3sbc76kgo4rcmhcesdnx3tf5htwvm" [label="gdbm@1.23%gcc@=11.2.1/haj3sbc"]
  "l7tz4s7s37gihufelrnnfmer5mxldmzs" [label="gzip@1.12%gcc@=11.2.1/l7tz4s7"]
  "rn5aq2a5bojk37yj6rofckrrv3v5zffu" [label="readline@8.2%gcc@=11.2.1/rn5aq2a"]
  "z45zorj2uyi6xqt7jtz236jl5mjow4hv" [label="automake@1.16.5%gcc@=11.2.1/z45zorj"]
  "xuxeya23fqc7733qoj223gkl67vmaw45" [label="gettext@0.22.3%gcc@=11.2.1/xuxeya2"]
  "t2ivnzsf7agc4hvkallndiw5uxbv3ynl" [label="libjpeg-turbo@3.0.0%gcc@=11.2.1/t2ivnzs"]
  "2cp2qsuazhnlqm7b2nk5ws2o4ka6k462" [label="libidn2@2.3.4%gcc@=11.2.1/2cp2qsu"]
  "6hjicu5v32zs3zdn2bblqdrycnjr7eag" [label="gnutls@3.7.8%gcc@=11.2.1/6hjicu5"]
  "xphd4abhzbwx7yqs2pwrjijzsjdtv6dl" [label="autoconf@2.69%gcc@=11.2.1/xphd4ab"]
  "4mgrletcb5hvefdhl3gf5abu2uxmdqjs" [label="berkeley-db@18.1.40%gcc@=11.2.1/4mgrlet"]
  "hqcqtf4mswpnx5flm3rztmytd5xyhamj" [label="libunistring@1.1%gcc@=11.2.1/hqcqtf4"]
  "n4yuyxthbdvhq6okwp3jgro7xjlabokm" [label="libtool@2.4.6%gcc@=11.2.1/n4yuyxt"]
  "eevx4wgsyftv5vqrp4x2bq7cgeavpbyu" [label="bzip2@1.0.8%gcc@=11.2.1/eevx4wg"]
  "5t5cgfazosntlvfru2zrmoxdlhvkljig" [label="libiconv@1.17%gcc@=11.2.1/5t5cgfa"]
  "vbtr3vjuv5ikx77gqu6p6rb33daqtbat" -> "jobwyrdqeoytgahvy3axmjihcwfjghvc"
  "jjdfmobwoepg7za7bqoelysu6zof75li" -> "jobwyrdqeoytgahvy3axmjihcwfjghvc"
  "vqpl4aj4m5zg5q45liqbrq6ymomrltrz" -> "xphd4abhzbwx7yqs2pwrjijzsjdtv6dl"
  "xodpz5b2pdbory553ih33e2mzwr3q7bq" -> "jobwyrdqeoytgahvy3axmjihcwfjghvc"
  "6hjicu5v32zs3zdn2bblqdrycnjr7eag" -> "jobwyrdqeoytgahvy3axmjihcwfjghvc"
  "vbtr3vjuv5ikx77gqu6p6rb33daqtbat" -> "dvj7xbrtwbxoeilltyo7cyeu2bw5u43r"
  "z45zorj2uyi6xqt7jtz236jl5mjow4hv" -> "syg5rrzilq43un6i2azf2qmbsehp2oa7"
  "hhahsbjew7sd5s4jwfgavifsonyvns7y" -> "jobwyrdqeoytgahvy3axmjihcwfjghvc"
  "xc5soqufoinv7y3rksj4ajj5di45omv5" -> "cmugi5vtdcozwnx6ef2etr47aonxe2yb"
  "xuxeya23fqc7733qoj223gkl67vmaw45" -> "vxmokx5j67rae4mhdi6fcjxuayoqj36d"
  "dvj7xbrtwbxoeilltyo7cyeu2bw5u43r" -> "jobwyrdqeoytgahvy3axmjihcwfjghvc"
  "xphd4abhzbwx7yqs2pwrjijzsjdtv6dl" -> "syg5rrzilq43un6i2azf2qmbsehp2oa7"
  "xodpz5b2pdbory553ih33e2mzwr3q7bq" -> "hhahsbjew7sd5s4jwfgavifsonyvns7y"
  "vbtr3vjuv5ikx77gqu6p6rb33daqtbat" -> "qlythud7gnerzxwjkatqn64l7kfpirdg"
  "xodpz5b2pdbory553ih33e2mzwr3q7bq" -> "vbtr3vjuv5ikx77gqu6p6rb33daqtbat"
  "6hjicu5v32zs3zdn2bblqdrycnjr7eag" -> "2cp2qsuazhnlqm7b2nk5ws2o4ka6k462"
  "vbtr3vjuv5ikx77gqu6p6rb33daqtbat" -> "5t5cgfazosntlvfru2zrmoxdlhvkljig"
  "vbtr3vjuv5ikx77gqu6p6rb33daqtbat" -> "cmugi5vtdcozwnx6ef2etr47aonxe2yb"
  "u3moojtss4al6zy6rwxmezybkqsjnb6x" -> "jobwyrdqeoytgahvy3axmjihcwfjghvc"
  "t2ivnzsf7agc4hvkallndiw5uxbv3ynl" -> "cd2htn3rv6gfaut5bhpdo2ml2japdnxc"
  "xuxeya23fqc7733qoj223gkl67vmaw45" -> "jobwyrdqeoytgahvy3axmjihcwfjghvc"
  "xodpz5b2pdbory553ih33e2mzwr3q7bq" -> "qlythud7gnerzxwjkatqn64l7kfpirdg"
  "6hjicu5v32zs3zdn2bblqdrycnjr7eag" -> "cmugi5vtdcozwnx6ef2etr47aonxe2yb"
  "6hjicu5v32zs3zdn2bblqdrycnjr7eag" -> "jjdfmobwoepg7za7bqoelysu6zof75li"
  "xuxeya23fqc7733qoj223gkl67vmaw45" -> "vbtr3vjuv5ikx77gqu6p6rb33daqtbat"
  "5t5cgfazosntlvfru2zrmoxdlhvkljig" -> "jobwyrdqeoytgahvy3axmjihcwfjghvc"
  "xuxeya23fqc7733qoj223gkl67vmaw45" -> "eevx4wgsyftv5vqrp4x2bq7cgeavpbyu"
  "rn5aq2a5bojk37yj6rofckrrv3v5zffu" -> "xc5soqufoinv7y3rksj4ajj5di45omv5"
  "6hjicu5v32zs3zdn2bblqdrycnjr7eag" -> "qlythud7gnerzxwjkatqn64l7kfpirdg"
  "syg5rrzilq43un6i2azf2qmbsehp2oa7" -> "4mgrletcb5hvefdhl3gf5abu2uxmdqjs"
  "z45zorj2uyi6xqt7jtz236jl5mjow4hv" -> "jobwyrdqeoytgahvy3axmjihcwfjghvc"
  "hqcqtf4mswpnx5flm3rztmytd5xyhamj" -> "jobwyrdqeoytgahvy3axmjihcwfjghvc"
  "xphd4abhzbwx7yqs2pwrjijzsjdtv6dl" -> "nshmqjfzoi7wc25gud5xndapxx7fouio"
  "qlythud7gnerzxwjkatqn64l7kfpirdg" -> "jobwyrdqeoytgahvy3axmjihcwfjghvc"
  "xodpz5b2pdbory553ih33e2mzwr3q7bq" -> "cmugi5vtdcozwnx6ef2etr47aonxe2yb"
  "xuxeya23fqc7733qoj223gkl67vmaw45" -> "dvj7xbrtwbxoeilltyo7cyeu2bw5u43r"
  "t2ivnzsf7agc4hvkallndiw5uxbv3ynl" -> "jobwyrdqeoytgahvy3axmjihcwfjghvc"
  "syg5rrzilq43un6i2azf2qmbsehp2oa7" -> "haj3sbc76kgo4rcmhcesdnx3tf5htwvm"
  "2cp2qsuazhnlqm7b2nk5ws2o4ka6k462" -> "hqcqtf4mswpnx5flm3rztmytd5xyhamj"
  "xuxeya23fqc7733qoj223gkl67vmaw45" -> "5t5cgfazosntlvfru2zrmoxdlhvkljig"
  "jjdfmobwoepg7za7bqoelysu6zof75li" -> "vqpl4aj4m5zg5q45liqbrq6ymomrltrz"
  "syg5rrzilq43un6i2azf2qmbsehp2oa7" -> "eevx4wgsyftv5vqrp4x2bq7cgeavpbyu"
  "l7tz4s7s37gihufelrnnfmer5mxldmzs" -> "jobwyrdqeoytgahvy3axmjihcwfjghvc"
  "eevx4wgsyftv5vqrp4x2bq7cgeavpbyu" -> "dfrl7rneqfzxydhg2zs6n77duqy556jq"
  "vqpl4aj4m5zg5q45liqbrq6ymomrltrz" -> "nshmqjfzoi7wc25gud5xndapxx7fouio"
  "xc5soqufoinv7y3rksj4ajj5di45omv5" -> "jobwyrdqeoytgahvy3axmjihcwfjghvc"
  "vqpl4aj4m5zg5q45liqbrq6ymomrltrz" -> "z45zorj2uyi6xqt7jtz236jl5mjow4hv"
  "z45zorj2uyi6xqt7jtz236jl5mjow4hv" -> "xphd4abhzbwx7yqs2pwrjijzsjdtv6dl"
  "xphd4abhzbwx7yqs2pwrjijzsjdtv6dl" -> "jobwyrdqeoytgahvy3axmjihcwfjghvc"
  "syg5rrzilq43un6i2azf2qmbsehp2oa7" -> "qlythud7gnerzxwjkatqn64l7kfpirdg"
  "haj3sbc76kgo4rcmhcesdnx3tf5htwvm" -> "rn5aq2a5bojk37yj6rofckrrv3v5zffu"
  "vqpl4aj4m5zg5q45liqbrq6ymomrltrz" -> "jobwyrdqeoytgahvy3axmjihcwfjghvc"
  "vqpl4aj4m5zg5q45liqbrq6ymomrltrz" -> "n4yuyxthbdvhq6okwp3jgro7xjlabokm"
  "t2ivnzsf7agc4hvkallndiw5uxbv3ynl" -> "u3moojtss4al6zy6rwxmezybkqsjnb6x"
  "xodpz5b2pdbory553ih33e2mzwr3q7bq" -> "xc5soqufoinv7y3rksj4ajj5di45omv5"
  "hqcqtf4mswpnx5flm3rztmytd5xyhamj" -> "5t5cgfazosntlvfru2zrmoxdlhvkljig"
  "xodpz5b2pdbory553ih33e2mzwr3q7bq" -> "t2ivnzsf7agc4hvkallndiw5uxbv3ynl"
  "rn5aq2a5bojk37yj6rofckrrv3v5zffu" -> "jobwyrdqeoytgahvy3axmjihcwfjghvc"
  "jjdfmobwoepg7za7bqoelysu6zof75li" -> "nshmqjfzoi7wc25gud5xndapxx7fouio"
  "xodpz5b2pdbory553ih33e2mzwr3q7bq" -> "l7tz4s7s37gihufelrnnfmer5mxldmzs"
  "6hjicu5v32zs3zdn2bblqdrycnjr7eag" -> "xuxeya23fqc7733qoj223gkl67vmaw45"
  "2cp2qsuazhnlqm7b2nk5ws2o4ka6k462" -> "jobwyrdqeoytgahvy3axmjihcwfjghvc"
  "xodpz5b2pdbory553ih33e2mzwr3q7bq" -> "6hjicu5v32zs3zdn2bblqdrycnjr7eag"
  "4mgrletcb5hvefdhl3gf5abu2uxmdqjs" -> "jobwyrdqeoytgahvy3axmjihcwfjghvc"
  "haj3sbc76kgo4rcmhcesdnx3tf5htwvm" -> "jobwyrdqeoytgahvy3axmjihcwfjghvc"
  "xuxeya23fqc7733qoj223gkl67vmaw45" -> "xc5soqufoinv7y3rksj4ajj5di45omv5"

}